Grokbase Groups Lucene dev June 2016
FAQ
Build: http://jenkins.thetaphi.de/job/Lucene-Solr-6.x-MacOSX/209/
Java: 64bit/jdk1.8.0 -XX:+UseCompressedOops -XX:+UseSerialGC

3 tests failed.
FAILED: org.apache.solr.cloud.CollectionsAPIDistributedZkTest.test

Error Message:
Timeout occured while waiting response from server at: http://127.0.0.1:65374

Stack Trace:
org.apache.solr.client.solrj.SolrServerException: Timeout occured while waiting response from server at: http://127.0.0.1:65374
  at __randomizedtesting.SeedInfo.seed([83754146B95FE8AA:B217E9C17A38552]:0)
  at org.apache.solr.client.solrj.impl.HttpSolrClient.executeMethod(HttpSolrClient.java:601)
  at org.apache.solr.client.solrj.impl.HttpSolrClient.request(HttpSolrClient.java:259)
  at org.apache.solr.client.solrj.impl.HttpSolrClient.request(HttpSolrClient.java:248)
  at org.apache.solr.client.solrj.SolrClient.request(SolrClient.java:1219)
  at org.apache.solr.cloud.CollectionsAPIDistributedZkTest.makeRequest(CollectionsAPIDistributedZkTest.java:399)
  at org.apache.solr.cloud.CollectionsAPIDistributedZkTest.testCollectionsAPI(CollectionsAPIDistributedZkTest.java:897)
  at org.apache.solr.cloud.CollectionsAPIDistributedZkTest.test(CollectionsAPIDistributedZkTest.java:177)
  at sun.reflect.NativeMethodAccessorImpl.invoke0(Native Method)
  at sun.reflect.NativeMethodAccessorImpl.invoke(NativeMethodAccessorImpl.java:62)
  at sun.reflect.DelegatingMethodAccessorImpl.invoke(DelegatingMethodAccessorImpl.java:43)
  at java.lang.reflect.Method.invoke(Method.java:498)
  at com.carrotsearch.randomizedtesting.RandomizedRunner.invoke(RandomizedRunner.java:1764)
  at com.carrotsearch.randomizedtesting.RandomizedRunner$8.evaluate(RandomizedRunner.java:871)
  at com.carrotsearch.randomizedtesting.RandomizedRunner$9.evaluate(RandomizedRunner.java:907)
  at com.carrotsearch.randomizedtesting.RandomizedRunner$10.evaluate(RandomizedRunner.java:921)
  at org.apache.solr.BaseDistributedSearchTestCase$ShardsRepeatRule$ShardsFixedStatement.callStatement(BaseDistributedSearchTestCase.java:992)
  at org.apache.solr.BaseDistributedSearchTestCase$ShardsRepeatRule$ShardsStatement.evaluate(BaseDistributedSearchTestCase.java:967)
  at com.carrotsearch.randomizedtesting.rules.SystemPropertiesRestoreRule$1.evaluate(SystemPropertiesRestoreRule.java:57)
  at org.apache.lucene.util.TestRuleSetupTeardownChained$1.evaluate(TestRuleSetupTeardownChained.java:49)
  at org.apache.lucene.util.AbstractBeforeAfterRule$1.evaluate(AbstractBeforeAfterRule.java:45)
  at org.apache.lucene.util.TestRuleThreadAndTestName$1.evaluate(TestRuleThreadAndTestName.java:48)
  at org.apache.lucene.util.TestRuleIgnoreAfterMaxFailures$1.evaluate(TestRuleIgnoreAfterMaxFailures.java:64)
  at org.apache.lucene.util.TestRuleMarkFailure$1.evaluate(TestRuleMarkFailure.java:47)
  at com.carrotsearch.randomizedtesting.rules.StatementAdapter.evaluate(StatementAdapter.java:36)
  at com.carrotsearch.randomizedtesting.ThreadLeakControl$StatementRunner.run(ThreadLeakControl.java:367)
  at com.carrotsearch.randomizedtesting.ThreadLeakControl.forkTimeoutingTask(ThreadLeakControl.java:809)
  at com.carrotsearch.randomizedtesting.ThreadLeakControl$3.evaluate(ThreadLeakControl.java:460)
  at com.carrotsearch.randomizedtesting.RandomizedRunner.runSingleTest(RandomizedRunner.java:880)
  at com.carrotsearch.randomizedtesting.RandomizedRunner$5.evaluate(RandomizedRunner.java:781)
  at com.carrotsearch.randomizedtesting.RandomizedRunner$6.evaluate(RandomizedRunner.java:816)
  at com.carrotsearch.randomizedtesting.RandomizedRunner$7.evaluate(RandomizedRunner.java:827)
  at com.carrotsearch.randomizedtesting.rules.StatementAdapter.evaluate(StatementAdapter.java:36)
  at com.carrotsearch.randomizedtesting.rules.SystemPropertiesRestoreRule$1.evaluate(SystemPropertiesRestoreRule.java:57)
  at org.apache.lucene.util.AbstractBeforeAfterRule$1.evaluate(AbstractBeforeAfterRule.java:45)
  at com.carrotsearch.randomizedtesting.rules.StatementAdapter.evaluate(StatementAdapter.java:36)
  at org.apache.lucene.util.TestRuleStoreClassName$1.evaluate(TestRuleStoreClassName.java:41)
  at com.carrotsearch.randomizedtesting.rules.NoShadowingOrOverridesOnMethodsRule$1.evaluate(NoShadowingOrOverridesOnMethodsRule.java:40)
  at com.carrotsearch.randomizedtesting.rules.NoShadowingOrOverridesOnMethodsRule$1.evaluate(NoShadowingOrOverridesOnMethodsRule.java:40)
  at com.carrotsearch.randomizedtesting.rules.StatementAdapter.evaluate(StatementAdapter.java:36)
  at com.carrotsearch.randomizedtesting.rules.StatementAdapter.evaluate(StatementAdapter.java:36)
  at com.carrotsearch.randomizedtesting.rules.StatementAdapter.evaluate(StatementAdapter.java:36)
  at org.apache.lucene.util.TestRuleAssertionsRequired$1.evaluate(TestRuleAssertionsRequired.java:53)
  at org.apache.lucene.util.TestRuleMarkFailure$1.evaluate(TestRuleMarkFailure.java:47)
  at org.apache.lucene.util.TestRuleIgnoreAfterMaxFailures$1.evaluate(TestRuleIgnoreAfterMaxFailures.java:64)
  at org.apache.lucene.util.TestRuleIgnoreTestSuites$1.evaluate(TestRuleIgnoreTestSuites.java:54)
  at com.carrotsearch.randomizedtesting.rules.StatementAdapter.evaluate(StatementAdapter.java:36)
  at com.carrotsearch.randomizedtesting.ThreadLeakControl$StatementRunner.run(ThreadLeakControl.java:367)
  at java.lang.Thread.run(Thread.java:745)
Caused by: java.net.SocketTimeoutException: Read timed out
  at java.net.SocketInputStream.socketRead0(Native Method)
  at java.net.SocketInputStream.socketRead(SocketInputStream.java:116)
  at java.net.SocketInputStream.read(SocketInputStream.java:170)
  at java.net.SocketInputStream.read(SocketInputStream.java:141)
  at org.apache.http.impl.io.AbstractSessionInputBuffer.fillBuffer(AbstractSessionInputBuffer.java:160)
  at org.apache.http.impl.io.SocketInputBuffer.fillBuffer(SocketInputBuffer.java:84)
  at org.apache.http.impl.io.AbstractSessionInputBuffer.readLine(AbstractSessionInputBuffer.java:273)
  at org.apache.http.impl.conn.DefaultHttpResponseParser.parseHead(DefaultHttpResponseParser.java:140)
  at org.apache.http.impl.conn.DefaultHttpResponseParser.parseHead(DefaultHttpResponseParser.java:57)
  at org.apache.http.impl.io.AbstractMessageParser.parse(AbstractMessageParser.java:261)
  at org.apache.http.impl.AbstractHttpClientConnection.receiveResponseHeader(AbstractHttpClientConnection.java:283)
  at org.apache.http.impl.conn.DefaultClientConnection.receiveResponseHeader(DefaultClientConnection.java:251)
  at org.apache.http.impl.conn.ManagedClientConnectionImpl.receiveResponseHeader(ManagedClientConnectionImpl.java:197)
  at org.apache.http.protocol.HttpRequestExecutor.doReceiveResponse(HttpRequestExecutor.java:272)
  at org.apache.http.protocol.HttpRequestExecutor.execute(HttpRequestExecutor.java:124)
  at org.apache.http.impl.client.DefaultRequestDirector.tryExecute(DefaultRequestDirector.java:685)
  at org.apache.http.impl.client.DefaultRequestDirector.execute(DefaultRequestDirector.java:487)
  at org.apache.http.impl.client.AbstractHttpClient.doExecute(AbstractHttpClient.java:882)
  at org.apache.http.impl.client.CloseableHttpClient.execute(CloseableHttpClient.java:82)
  at org.apache.http.impl.client.CloseableHttpClient.execute(CloseableHttpClient.java:107)
  at org.apache.http.impl.client.CloseableHttpClient.execute(CloseableHttpClient.java:55)
  at org.apache.solr.client.solrj.impl.HttpSolrClient.executeMethod(HttpSolrClient.java:495)
  ... 47 more


FAILED: junit.framework.TestSuite.org.apache.solr.cloud.CollectionsAPIDistributedZkTest

Error Message:
6 threads leaked from SUITE scope at org.apache.solr.cloud.CollectionsAPIDistributedZkTest: 1) Thread[id=1876, name=TEST-CollectionsAPIDistributedZkTest.test-seed#[83754146B95FE8AA]-SendThread(127.0.0.1:65364), state=TIMED_WAITING, group=TGRP-CollectionsAPIDistributedZkTest] at java.lang.Thread.sleep(Native Method) at org.apache.zookeeper.ClientCnxn$SendThread.run(ClientCnxn.java:994) 2) Thread[id=1935, name=zkCallback-295-thread-3, state=TIMED_WAITING, group=TGRP-CollectionsAPIDistributedZkTest] at sun.misc.Unsafe.park(Native Method) at java.util.concurrent.locks.LockSupport.parkNanos(LockSupport.java:215) at java.util.concurrent.SynchronousQueue$TransferStack.awaitFulfill(SynchronousQueue.java:460) at java.util.concurrent.SynchronousQueue$TransferStack.transfer(SynchronousQueue.java:362) at java.util.concurrent.SynchronousQueue.poll(SynchronousQueue.java:941) at java.util.concurrent.ThreadPoolExecutor.getTask(ThreadPoolExecutor.java:1066) at java.util.concurrent.ThreadPoolExecutor.runWorker(ThreadPoolExecutor.java:1127) at java.util.concurrent.ThreadPoolExecutor$Worker.run(ThreadPoolExecutor.java:617) at java.lang.Thread.run(Thread.java:745) 3) Thread[id=1936, name=zkCallback-295-thread-4, state=TIMED_WAITING, group=TGRP-CollectionsAPIDistributedZkTest] at sun.misc.Unsafe.park(Native Method) at java.util.concurrent.locks.LockSupport.parkNanos(LockSupport.java:215) at java.util.concurrent.SynchronousQueue$TransferStack.awaitFulfill(SynchronousQueue.java:460) at java.util.concurrent.SynchronousQueue$TransferStack.transfer(SynchronousQueue.java:362) at java.util.concurrent.SynchronousQueue.poll(SynchronousQueue.java:941) at java.util.concurrent.ThreadPoolExecutor.getTask(ThreadPoolExecutor.java:1066) at java.util.concurrent.ThreadPoolExecutor.runWorker(ThreadPoolExecutor.java:1127) at java.util.concurrent.ThreadPoolExecutor$Worker.run(ThreadPoolExecutor.java:617) at java.lang.Thread.run(Thread.java:745) 4) Thread[id=1877, name=TEST-CollectionsAPIDistributedZkTest.test-seed#[83754146B95FE8AA]-EventThread, state=WAITING, group=TGRP-CollectionsAPIDistributedZkTest] at sun.misc.Unsafe.park(Native Method) at java.util.concurrent.locks.LockSupport.park(LockSupport.java:175) at java.util.concurrent.locks.AbstractQueuedSynchronizer$ConditionObject.await(AbstractQueuedSynchronizer.java:2039) at java.util.concurrent.LinkedBlockingQueue.take(LinkedBlockingQueue.java:442) at org.apache.zookeeper.ClientCnxn$EventThread.run(ClientCnxn.java:494) 5) Thread[id=1894, name=zkCallback-295-thread-2, state=TIMED_WAITING, group=TGRP-CollectionsAPIDistributedZkTest] at sun.misc.Unsafe.park(Native Method) at java.util.concurrent.locks.LockSupport.parkNanos(LockSupport.java:215) at java.util.concurrent.SynchronousQueue$TransferStack.awaitFulfill(SynchronousQueue.java:460) at java.util.concurrent.SynchronousQueue$TransferStack.transfer(SynchronousQueue.java:362) at java.util.concurrent.SynchronousQueue.poll(SynchronousQueue.java:941) at java.util.concurrent.ThreadPoolExecutor.getTask(ThreadPoolExecutor.java:1066) at java.util.concurrent.ThreadPoolExecutor.runWorker(ThreadPoolExecutor.java:1127) at java.util.concurrent.ThreadPoolExecutor$Worker.run(ThreadPoolExecutor.java:617) at java.lang.Thread.run(Thread.java:745) 6) Thread[id=1878, name=zkCallback-295-thread-1, state=TIMED_WAITING, group=TGRP-CollectionsAPIDistributedZkTest] at sun.misc.Unsafe.park(Native Method) at java.util.concurrent.locks.LockSupport.parkNanos(LockSupport.java:215) at java.util.concurrent.SynchronousQueue$TransferStack.awaitFulfill(SynchronousQueue.java:460) at java.util.concurrent.SynchronousQueue$TransferStack.transfer(SynchronousQueue.java:362) at java.util.concurrent.SynchronousQueue.poll(SynchronousQueue.java:941) at java.util.concurrent.ThreadPoolExecutor.getTask(ThreadPoolExecutor.java:1066) at java.util.concurrent.ThreadPoolExecutor.runWorker(ThreadPoolExecutor.java:1127) at java.util.concurrent.ThreadPoolExecutor$Worker.run(ThreadPoolExecutor.java:617) at java.lang.Thread.run(Thread.java:745)

Stack Trace:
com.carrotsearch.randomizedtesting.ThreadLeakError: 6 threads leaked from SUITE scope at org.apache.solr.cloud.CollectionsAPIDistributedZkTest:
    1) Thread[id=1876, name=TEST-CollectionsAPIDistributedZkTest.test-seed#[83754146B95FE8AA]-SendThread(127.0.0.1:65364), state=TIMED_WAITING, group=TGRP-CollectionsAPIDistributedZkTest]
         at java.lang.Thread.sleep(Native Method)
         at org.apache.zookeeper.ClientCnxn$SendThread.run(ClientCnxn.java:994)
    2) Thread[id=1935, name=zkCallback-295-thread-3, state=TIMED_WAITING, group=TGRP-CollectionsAPIDistributedZkTest]
         at sun.misc.Unsafe.park(Native Method)
         at java.util.concurrent.locks.LockSupport.parkNanos(LockSupport.java:215)
         at java.util.concurrent.SynchronousQueue$TransferStack.awaitFulfill(SynchronousQueue.java:460)
         at java.util.concurrent.SynchronousQueue$TransferStack.transfer(SynchronousQueue.java:362)
         at java.util.concurrent.SynchronousQueue.poll(SynchronousQueue.java:941)
         at java.util.concurrent.ThreadPoolExecutor.getTask(ThreadPoolExecutor.java:1066)
         at java.util.concurrent.ThreadPoolExecutor.runWorker(ThreadPoolExecutor.java:1127)
         at java.util.concurrent.ThreadPoolExecutor$Worker.run(ThreadPoolExecutor.java:617)
         at java.lang.Thread.run(Thread.java:745)
    3) Thread[id=1936, name=zkCallback-295-thread-4, state=TIMED_WAITING, group=TGRP-CollectionsAPIDistributedZkTest]
         at sun.misc.Unsafe.park(Native Method)
         at java.util.concurrent.locks.LockSupport.parkNanos(LockSupport.java:215)
         at java.util.concurrent.SynchronousQueue$TransferStack.awaitFulfill(SynchronousQueue.java:460)
         at java.util.concurrent.SynchronousQueue$TransferStack.transfer(SynchronousQueue.java:362)
         at java.util.concurrent.SynchronousQueue.poll(SynchronousQueue.java:941)
         at java.util.concurrent.ThreadPoolExecutor.getTask(ThreadPoolExecutor.java:1066)
         at java.util.concurrent.ThreadPoolExecutor.runWorker(ThreadPoolExecutor.java:1127)
         at java.util.concurrent.ThreadPoolExecutor$Worker.run(ThreadPoolExecutor.java:617)
         at java.lang.Thread.run(Thread.java:745)
    4) Thread[id=1877, name=TEST-CollectionsAPIDistributedZkTest.test-seed#[83754146B95FE8AA]-EventThread, state=WAITING, group=TGRP-CollectionsAPIDistributedZkTest]
         at sun.misc.Unsafe.park(Native Method)
         at java.util.concurrent.locks.LockSupport.park(LockSupport.java:175)
         at java.util.concurrent.locks.AbstractQueuedSynchronizer$ConditionObject.await(AbstractQueuedSynchronizer.java:2039)
         at java.util.concurrent.LinkedBlockingQueue.take(LinkedBlockingQueue.java:442)
         at org.apache.zookeeper.ClientCnxn$EventThread.run(ClientCnxn.java:494)
    5) Thread[id=1894, name=zkCallback-295-thread-2, state=TIMED_WAITING, group=TGRP-CollectionsAPIDistributedZkTest]
         at sun.misc.Unsafe.park(Native Method)
         at java.util.concurrent.locks.LockSupport.parkNanos(LockSupport.java:215)
         at java.util.concurrent.SynchronousQueue$TransferStack.awaitFulfill(SynchronousQueue.java:460)
         at java.util.concurrent.SynchronousQueue$TransferStack.transfer(SynchronousQueue.java:362)
         at java.util.concurrent.SynchronousQueue.poll(SynchronousQueue.java:941)
         at java.util.concurrent.ThreadPoolExecutor.getTask(ThreadPoolExecutor.java:1066)
         at java.util.concurrent.ThreadPoolExecutor.runWorker(ThreadPoolExecutor.java:1127)
         at java.util.concurrent.ThreadPoolExecutor$Worker.run(ThreadPoolExecutor.java:617)
         at java.lang.Thread.run(Thread.java:745)
    6) Thread[id=1878, name=zkCallback-295-thread-1, state=TIMED_WAITING, group=TGRP-CollectionsAPIDistributedZkTest]
         at sun.misc.Unsafe.park(Native Method)
         at java.util.concurrent.locks.LockSupport.parkNanos(LockSupport.java:215)
         at java.util.concurrent.SynchronousQueue$TransferStack.awaitFulfill(SynchronousQueue.java:460)
         at java.util.concurrent.SynchronousQueue$TransferStack.transfer(SynchronousQueue.java:362)
         at java.util.concurrent.SynchronousQueue.poll(SynchronousQueue.java:941)
         at java.util.concurrent.ThreadPoolExecutor.getTask(ThreadPoolExecutor.java:1066)
         at java.util.concurrent.ThreadPoolExecutor.runWorker(ThreadPoolExecutor.java:1127)
         at java.util.concurrent.ThreadPoolExecutor$Worker.run(ThreadPoolExecutor.java:617)
         at java.lang.Thread.run(Thread.java:745)
  at __randomizedtesting.SeedInfo.seed([83754146B95FE8AA]:0)


FAILED: junit.framework.TestSuite.org.apache.solr.cloud.CollectionsAPIDistributedZkTest

Error Message:
There are still zombie threads that couldn't be terminated: 1) Thread[id=1876, name=TEST-CollectionsAPIDistributedZkTest.test-seed#[83754146B95FE8AA]-SendThread(127.0.0.1:65364), state=TIMED_WAITING, group=TGRP-CollectionsAPIDistributedZkTest] at java.lang.Thread.sleep(Native Method) at org.apache.zookeeper.ClientCnxn$SendThread.run(ClientCnxn.java:994) 2) Thread[id=1935, name=zkCallback-295-thread-3, state=TIMED_WAITING, group=TGRP-CollectionsAPIDistributedZkTest] at sun.misc.Unsafe.park(Native Method) at java.util.concurrent.locks.LockSupport.parkNanos(LockSupport.java:215) at java.util.concurrent.SynchronousQueue$TransferStack.awaitFulfill(SynchronousQueue.java:460) at java.util.concurrent.SynchronousQueue$TransferStack.transfer(SynchronousQueue.java:362) at java.util.concurrent.SynchronousQueue.poll(SynchronousQueue.java:941) at java.util.concurrent.ThreadPoolExecutor.getTask(ThreadPoolExecutor.java:1066) at java.util.concurrent.ThreadPoolExecutor.runWorker(ThreadPoolExecutor.java:1127) at java.util.concurrent.ThreadPoolExecutor$Worker.run(ThreadPoolExecutor.java:617) at java.lang.Thread.run(Thread.java:745) 3) Thread[id=1936, name=zkCallback-295-thread-4, state=TIMED_WAITING, group=TGRP-CollectionsAPIDistributedZkTest] at sun.misc.Unsafe.park(Native Method) at java.util.concurrent.locks.LockSupport.parkNanos(LockSupport.java:215) at java.util.concurrent.SynchronousQueue$TransferStack.awaitFulfill(SynchronousQueue.java:460) at java.util.concurrent.SynchronousQueue$TransferStack.transfer(SynchronousQueue.java:362) at java.util.concurrent.SynchronousQueue.poll(SynchronousQueue.java:941) at java.util.concurrent.ThreadPoolExecutor.getTask(ThreadPoolExecutor.java:1066) at java.util.concurrent.ThreadPoolExecutor.runWorker(ThreadPoolExecutor.java:1127) at java.util.concurrent.ThreadPoolExecutor$Worker.run(ThreadPoolExecutor.java:617) at java.lang.Thread.run(Thread.java:745) 4) Thread[id=1894, name=zkCallback-295-thread-2, state=TIMED_WAITING, group=TGRP-CollectionsAPIDistributedZkTest] at sun.misc.Unsafe.park(Native Method) at java.util.concurrent.locks.LockSupport.parkNanos(LockSupport.java:215) at java.util.concurrent.SynchronousQueue$TransferStack.awaitFulfill(SynchronousQueue.java:460) at java.util.concurrent.SynchronousQueue$TransferStack.transfer(SynchronousQueue.java:362) at java.util.concurrent.SynchronousQueue.poll(SynchronousQueue.java:941) at java.util.concurrent.ThreadPoolExecutor.getTask(ThreadPoolExecutor.java:1066) at java.util.concurrent.ThreadPoolExecutor.runWorker(ThreadPoolExecutor.java:1127) at java.util.concurrent.ThreadPoolExecutor$Worker.run(ThreadPoolExecutor.java:617) at java.lang.Thread.run(Thread.java:745) 5) Thread[id=1878, name=zkCallback-295-thread-1, state=TIMED_WAITING, group=TGRP-CollectionsAPIDistributedZkTest] at sun.misc.Unsafe.park(Native Method) at java.util.concurrent.locks.LockSupport.parkNanos(LockSupport.java:215) at java.util.concurrent.SynchronousQueue$TransferStack.awaitFulfill(SynchronousQueue.java:460) at java.util.concurrent.SynchronousQueue$TransferStack.transfer(SynchronousQueue.java:362) at java.util.concurrent.SynchronousQueue.poll(SynchronousQueue.java:941) at java.util.concurrent.ThreadPoolExecutor.getTask(ThreadPoolExecutor.java:1066) at java.util.concurrent.ThreadPoolExecutor.runWorker(ThreadPoolExecutor.java:1127) at java.util.concurrent.ThreadPoolExecutor$Worker.run(ThreadPoolExecutor.java:617) at java.lang.Thread.run(Thread.java:745)

Stack Trace:
com.carrotsearch.randomizedtesting.ThreadLeakError: There are still zombie threads that couldn't be terminated:
    1) Thread[id=1876, name=TEST-CollectionsAPIDistributedZkTest.test-seed#[83754146B95FE8AA]-SendThread(127.0.0.1:65364), state=TIMED_WAITING, group=TGRP-CollectionsAPIDistributedZkTest]
         at java.lang.Thread.sleep(Native Method)
         at org.apache.zookeeper.ClientCnxn$SendThread.run(ClientCnxn.java:994)
    2) Thread[id=1935, name=zkCallback-295-thread-3, state=TIMED_WAITING, group=TGRP-CollectionsAPIDistributedZkTest]
         at sun.misc.Unsafe.park(Native Method)
         at java.util.concurrent.locks.LockSupport.parkNanos(LockSupport.java:215)
         at java.util.concurrent.SynchronousQueue$TransferStack.awaitFulfill(SynchronousQueue.java:460)
         at java.util.concurrent.SynchronousQueue$TransferStack.transfer(SynchronousQueue.java:362)
         at java.util.concurrent.SynchronousQueue.poll(SynchronousQueue.java:941)
         at java.util.concurrent.ThreadPoolExecutor.getTask(ThreadPoolExecutor.java:1066)
         at java.util.concurrent.ThreadPoolExecutor.runWorker(ThreadPoolExecutor.java:1127)
         at java.util.concurrent.ThreadPoolExecutor$Worker.run(ThreadPoolExecutor.java:617)
         at java.lang.Thread.run(Thread.java:745)
    3) Thread[id=1936, name=zkCallback-295-thread-4, state=TIMED_WAITING, group=TGRP-CollectionsAPIDistributedZkTest]
         at sun.misc.Unsafe.park(Native Method)
         at java.util.concurrent.locks.LockSupport.parkNanos(LockSupport.java:215)
         at java.util.concurrent.SynchronousQueue$TransferStack.awaitFulfill(SynchronousQueue.java:460)
         at java.util.concurrent.SynchronousQueue$TransferStack.transfer(SynchronousQueue.java:362)
         at java.util.concurrent.SynchronousQueue.poll(SynchronousQueue.java:941)
         at java.util.concurrent.ThreadPoolExecutor.getTask(ThreadPoolExecutor.java:1066)
         at java.util.concurrent.ThreadPoolExecutor.runWorker(ThreadPoolExecutor.java:1127)
         at java.util.concurrent.ThreadPoolExecutor$Worker.run(ThreadPoolExecutor.java:617)
         at java.lang.Thread.run(Thread.java:745)
    4) Thread[id=1894, name=zkCallback-295-thread-2, state=TIMED_WAITING, group=TGRP-CollectionsAPIDistributedZkTest]
         at sun.misc.Unsafe.park(Native Method)
         at java.util.concurrent.locks.LockSupport.parkNanos(LockSupport.java:215)
         at java.util.concurrent.SynchronousQueue$TransferStack.awaitFulfill(SynchronousQueue.java:460)
         at java.util.concurrent.SynchronousQueue$TransferStack.transfer(SynchronousQueue.java:362)
         at java.util.concurrent.SynchronousQueue.poll(SynchronousQueue.java:941)
         at java.util.concurrent.ThreadPoolExecutor.getTask(ThreadPoolExecutor.java:1066)
         at java.util.concurrent.ThreadPoolExecutor.runWorker(ThreadPoolExecutor.java:1127)
         at java.util.concurrent.ThreadPoolExecutor$Worker.run(ThreadPoolExecutor.java:617)
         at java.lang.Thread.run(Thread.java:745)
    5) Thread[id=1878, name=zkCallback-295-thread-1, state=TIMED_WAITING, group=TGRP-CollectionsAPIDistributedZkTest]
         at sun.misc.Unsafe.park(Native Method)
         at java.util.concurrent.locks.LockSupport.parkNanos(LockSupport.java:215)
         at java.util.concurrent.SynchronousQueue$TransferStack.awaitFulfill(SynchronousQueue.java:460)
         at java.util.concurrent.SynchronousQueue$TransferStack.transfer(SynchronousQueue.java:362)
         at java.util.concurrent.SynchronousQueue.poll(SynchronousQueue.java:941)
         at java.util.concurrent.ThreadPoolExecutor.getTask(ThreadPoolExecutor.java:1066)
         at java.util.concurrent.ThreadPoolExecutor.runWorker(ThreadPoolExecutor.java:1127)
         at java.util.concurrent.ThreadPoolExecutor$Worker.run(ThreadPoolExecutor.java:617)
         at java.lang.Thread.run(Thread.java:745)
  at __randomizedtesting.SeedInfo.seed([83754146B95FE8AA]:0)




Build Log:
[...truncated 10597 lines...]
    [junit4] Suite: org.apache.solr.cloud.CollectionsAPIDistributedZkTest
    [junit4] 2> Creating dataDir: /Users/jenkins/workspace/Lucene-Solr-6.x-MacOSX/solr/build/solr-core/test/J1/temp/solr.cloud.CollectionsAPIDistributedZkTest_83754146B95FE8AA-001/init-core-data-001
    [junit4] 2> 261732 INFO (SUITE-CollectionsAPIDistributedZkTest-seed#[83754146B95FE8AA]-worker) [ ] o.a.s.SolrTestCaseJ4 Randomized ssl (false) and clientAuth (false) via: @org.apache.solr.util.RandomizeSSL(reason=, value=NaN, ssl=NaN, clientAuth=NaN) w/ MAC_OS_X supressed clientAuth
    [junit4] 2> 261732 INFO (SUITE-CollectionsAPIDistributedZkTest-seed#[83754146B95FE8AA]-worker) [ ] o.a.s.BaseDistributedSearchTestCase Setting hostContext system property: /
    [junit4] 2> 261738 INFO (TEST-CollectionsAPIDistributedZkTest.test-seed#[83754146B95FE8AA]) [ ] o.a.s.c.ZkTestServer STARTING ZK TEST SERVER
    [junit4] 2> 261739 INFO (Thread-475) [ ] o.a.s.c.ZkTestServer client port:0.0.0.0/0.0.0.0:0
    [junit4] 2> 261739 INFO (Thread-475) [ ] o.a.s.c.ZkTestServer Starting server
    [junit4] 2> 261840 INFO (TEST-CollectionsAPIDistributedZkTest.test-seed#[83754146B95FE8AA]) [ ] o.a.s.c.ZkTestServer start zk server on port:65364
    [junit4] 2> 261840 INFO (TEST-CollectionsAPIDistributedZkTest.test-seed#[83754146B95FE8AA]) [ ] o.a.s.c.c.SolrZkClient Using default ZkCredentialsProvider
    [junit4] 2> 261844 INFO (TEST-CollectionsAPIDistributedZkTest.test-seed#[83754146B95FE8AA]) [ ] o.a.s.c.c.ConnectionManager Waiting for client to connect to ZooKeeper
    [junit4] 2> 261857 INFO (zkCallback-249-thread-1) [ ] o.a.s.c.c.ConnectionManager Watcher org.apache.solr.common.cloud.ConnectionManager@5d58af80 name:ZooKeeperConnection Watcher:127.0.0.1:65364 got event WatchedEvent state:SyncConnected type:None path:null path:null type:None
    [junit4] 2> 261864 INFO (TEST-CollectionsAPIDistributedZkTest.test-seed#[83754146B95FE8AA]) [ ] o.a.s.c.c.ConnectionManager Client is connected to ZooKeeper
    [junit4] 2> 261864 INFO (TEST-CollectionsAPIDistributedZkTest.test-seed#[83754146B95FE8AA]) [ ] o.a.s.c.c.SolrZkClient Using default ZkACLProvider
    [junit4] 2> 261865 INFO (TEST-CollectionsAPIDistributedZkTest.test-seed#[83754146B95FE8AA]) [ ] o.a.s.c.c.SolrZkClient makePath: /solr
    [junit4] 2> 261875 INFO (TEST-CollectionsAPIDistributedZkTest.test-seed#[83754146B95FE8AA]) [ ] o.a.s.c.c.SolrZkClient Using default ZkCredentialsProvider
    [junit4] 2> 261877 INFO (TEST-CollectionsAPIDistributedZkTest.test-seed#[83754146B95FE8AA]) [ ] o.a.s.c.c.ConnectionManager Waiting for client to connect to ZooKeeper
    [junit4] 2> 261878 INFO (zkCallback-250-thread-1) [ ] o.a.s.c.c.ConnectionManager Watcher org.apache.solr.common.cloud.ConnectionManager@72b5eefc name:ZooKeeperConnection Watcher:127.0.0.1:65364/solr got event WatchedEvent state:SyncConnected type:None path:null path:null type:None
    [junit4] 2> 261878 INFO (TEST-CollectionsAPIDistributedZkTest.test-seed#[83754146B95FE8AA]) [ ] o.a.s.c.c.ConnectionManager Client is connected to ZooKeeper
    [junit4] 2> 261878 INFO (TEST-CollectionsAPIDistributedZkTest.test-seed#[83754146B95FE8AA]) [ ] o.a.s.c.c.SolrZkClient Using default ZkACLProvider
    [junit4] 2> 261878 INFO (TEST-CollectionsAPIDistributedZkTest.test-seed#[83754146B95FE8AA]) [ ] o.a.s.c.c.SolrZkClient makePath: /collections/collection1
    [junit4] 2> 261883 INFO (TEST-CollectionsAPIDistributedZkTest.test-seed#[83754146B95FE8AA]) [ ] o.a.s.c.c.SolrZkClient makePath: /collections/collection1/shards
    [junit4] 2> 261886 INFO (TEST-CollectionsAPIDistributedZkTest.test-seed#[83754146B95FE8AA]) [ ] o.a.s.c.c.SolrZkClient makePath: /collections/control_collection
    [junit4] 2> 261889 INFO (TEST-CollectionsAPIDistributedZkTest.test-seed#[83754146B95FE8AA]) [ ] o.a.s.c.c.SolrZkClient makePath: /collections/control_collection/shards
    [junit4] 2> 261893 INFO (TEST-CollectionsAPIDistributedZkTest.test-seed#[83754146B95FE8AA]) [ ] o.a.s.c.AbstractZkTestCase put /Users/jenkins/workspace/Lucene-Solr-6.x-MacOSX/solr/core/src/test-files/solr/collection1/conf/solrconfig-tlog.xml to /configs/conf1/solrconfig.xml
    [junit4] 2> 261894 INFO (TEST-CollectionsAPIDistributedZkTest.test-seed#[83754146B95FE8AA]) [ ] o.a.s.c.c.SolrZkClient makePath: /configs/conf1/solrconfig.xml
    [junit4] 2> 261898 INFO (TEST-CollectionsAPIDistributedZkTest.test-seed#[83754146B95FE8AA]) [ ] o.a.s.c.AbstractZkTestCase put /Users/jenkins/workspace/Lucene-Solr-6.x-MacOSX/solr/core/src/test-files/solr/collection1/conf/schema.xml to /configs/conf1/schema.xml
    [junit4] 2> 261898 INFO (TEST-CollectionsAPIDistributedZkTest.test-seed#[83754146B95FE8AA]) [ ] o.a.s.c.c.SolrZkClient makePath: /configs/conf1/schema.xml
    [junit4] 2> 261903 INFO (TEST-CollectionsAPIDistributedZkTest.test-seed#[83754146B95FE8AA]) [ ] o.a.s.c.AbstractZkTestCase put /Users/jenkins/workspace/Lucene-Solr-6.x-MacOSX/solr/core/src/test-files/solr/collection1/conf/solrconfig.snippet.randomindexconfig.xml to /configs/conf1/solrconfig.snippet.randomindexconfig.xml
    [junit4] 2> 261903 INFO (TEST-CollectionsAPIDistributedZkTest.test-seed#[83754146B95FE8AA]) [ ] o.a.s.c.c.SolrZkClient makePath: /configs/conf1/solrconfig.snippet.randomindexconfig.xml
    [junit4] 2> 261907 INFO (TEST-CollectionsAPIDistributedZkTest.test-seed#[83754146B95FE8AA]) [ ] o.a.s.c.AbstractZkTestCase put /Users/jenkins/workspace/Lucene-Solr-6.x-MacOSX/solr/core/src/test-files/solr/collection1/conf/stopwords.txt to /configs/conf1/stopwords.txt
    [junit4] 2> 261907 INFO (TEST-CollectionsAPIDistributedZkTest.test-seed#[83754146B95FE8AA]) [ ] o.a.s.c.c.SolrZkClient makePath: /configs/conf1/stopwords.txt
    [junit4] 2> 261910 INFO (TEST-CollectionsAPIDistributedZkTest.test-seed#[83754146B95FE8AA]) [ ] o.a.s.c.AbstractZkTestCase put /Users/jenkins/workspace/Lucene-Solr-6.x-MacOSX/solr/core/src/test-files/solr/collection1/conf/protwords.txt to /configs/conf1/protwords.txt
    [junit4] 2> 261910 INFO (TEST-CollectionsAPIDistributedZkTest.test-seed#[83754146B95FE8AA]) [ ] o.a.s.c.c.SolrZkClient makePath: /configs/conf1/protwords.txt
    [junit4] 2> 261915 INFO (TEST-CollectionsAPIDistributedZkTest.test-seed#[83754146B95FE8AA]) [ ] o.a.s.c.AbstractZkTestCase put /Users/jenkins/workspace/Lucene-Solr-6.x-MacOSX/solr/core/src/test-files/solr/collection1/conf/currency.xml to /configs/conf1/currency.xml
    [junit4] 2> 261915 INFO (TEST-CollectionsAPIDistributedZkTest.test-seed#[83754146B95FE8AA]) [ ] o.a.s.c.c.SolrZkClient makePath: /configs/conf1/currency.xml
    [junit4] 2> 261919 INFO (TEST-CollectionsAPIDistributedZkTest.test-seed#[83754146B95FE8AA]) [ ] o.a.s.c.AbstractZkTestCase put /Users/jenkins/workspace/Lucene-Solr-6.x-MacOSX/solr/core/src/test-files/solr/collection1/conf/enumsConfig.xml to /configs/conf1/enumsConfig.xml
    [junit4] 2> 261919 INFO (TEST-CollectionsAPIDistributedZkTest.test-seed#[83754146B95FE8AA]) [ ] o.a.s.c.c.SolrZkClient makePath: /configs/conf1/enumsConfig.xml
    [junit4] 2> 261923 INFO (TEST-CollectionsAPIDistributedZkTest.test-seed#[83754146B95FE8AA]) [ ] o.a.s.c.AbstractZkTestCase put /Users/jenkins/workspace/Lucene-Solr-6.x-MacOSX/solr/core/src/test-files/solr/collection1/conf/open-exchange-rates.json to /configs/conf1/open-exchange-rates.json
    [junit4] 2> 261923 INFO (TEST-CollectionsAPIDistributedZkTest.test-seed#[83754146B95FE8AA]) [ ] o.a.s.c.c.SolrZkClient makePath: /configs/conf1/open-exchange-rates.json
    [junit4] 2> 261926 INFO (TEST-CollectionsAPIDistributedZkTest.test-seed#[83754146B95FE8AA]) [ ] o.a.s.c.AbstractZkTestCase put /Users/jenkins/workspace/Lucene-Solr-6.x-MacOSX/solr/core/src/test-files/solr/collection1/conf/mapping-ISOLatin1Accent.txt to /configs/conf1/mapping-ISOLatin1Accent.txt
    [junit4] 2> 261926 INFO (TEST-CollectionsAPIDistributedZkTest.test-seed#[83754146B95FE8AA]) [ ] o.a.s.c.c.SolrZkClient makePath: /configs/conf1/mapping-ISOLatin1Accent.txt
    [junit4] 2> 261930 INFO (TEST-CollectionsAPIDistributedZkTest.test-seed#[83754146B95FE8AA]) [ ] o.a.s.c.AbstractZkTestCase put /Users/jenkins/workspace/Lucene-Solr-6.x-MacOSX/solr/core/src/test-files/solr/collection1/conf/old_synonyms.txt to /configs/conf1/old_synonyms.txt
    [junit4] 2> 261930 INFO (TEST-CollectionsAPIDistributedZkTest.test-seed#[83754146B95FE8AA]) [ ] o.a.s.c.c.SolrZkClient makePath: /configs/conf1/old_synonyms.txt
    [junit4] 2> 261933 INFO (TEST-CollectionsAPIDistributedZkTest.test-seed#[83754146B95FE8AA]) [ ] o.a.s.c.AbstractZkTestCase put /Users/jenkins/workspace/Lucene-Solr-6.x-MacOSX/solr/core/src/test-files/solr/collection1/conf/synonyms.txt to /configs/conf1/synonyms.txt
    [junit4] 2> 261933 INFO (TEST-CollectionsAPIDistributedZkTest.test-seed#[83754146B95FE8AA]) [ ] o.a.s.c.c.SolrZkClient makePath: /configs/conf1/synonyms.txt
    [junit4] 2> 261938 INFO (TEST-CollectionsAPIDistributedZkTest.test-seed#[83754146B95FE8AA]) [ ] o.a.s.c.c.SolrZkClient Using default ZkCredentialsProvider
    [junit4] 2> 261940 INFO (TEST-CollectionsAPIDistributedZkTest.test-seed#[83754146B95FE8AA]) [ ] o.a.s.c.c.ConnectionManager Waiting for client to connect to ZooKeeper
    [junit4] 2> 261941 INFO (zkCallback-251-thread-1) [ ] o.a.s.c.c.ConnectionManager Watcher org.apache.solr.common.cloud.ConnectionManager@2e3034b5 name:ZooKeeperConnection Watcher:127.0.0.1:65364 got event WatchedEvent state:SyncConnected type:None path:null path:null type:None
    [junit4] 2> 261941 INFO (TEST-CollectionsAPIDistributedZkTest.test-seed#[83754146B95FE8AA]) [ ] o.a.s.c.c.ConnectionManager Client is connected to ZooKeeper
    [junit4] 2> 261941 INFO (TEST-CollectionsAPIDistributedZkTest.test-seed#[83754146B95FE8AA]) [ ] o.a.s.c.c.SolrZkClient Using default ZkACLProvider
    [junit4] 2> 261942 INFO (TEST-CollectionsAPIDistributedZkTest.test-seed#[83754146B95FE8AA]) [ ] o.a.s.c.c.SolrZkClient makePath: /solr
    [junit4] 2> 261946 INFO (TEST-CollectionsAPIDistributedZkTest.test-seed#[83754146B95FE8AA]) [ ] o.a.s.c.c.SolrZkClient Using default ZkCredentialsProvider
    [junit4] 2> 261947 INFO (TEST-CollectionsAPIDistributedZkTest.test-seed#[83754146B95FE8AA]) [ ] o.a.s.c.c.ConnectionManager Waiting for client to connect to ZooKeeper
    [junit4] 2> 261949 INFO (zkCallback-252-thread-1) [ ] o.a.s.c.c.ConnectionManager Watcher org.apache.solr.common.cloud.ConnectionManager@6495d46c name:ZooKeeperConnection Watcher:127.0.0.1:65364/solr got event WatchedEvent state:SyncConnected type:None path:null path:null type:None
    [junit4] 2> 261949 INFO (TEST-CollectionsAPIDistributedZkTest.test-seed#[83754146B95FE8AA]) [ ] o.a.s.c.c.ConnectionManager Client is connected to ZooKeeper
    [junit4] 2> 261949 INFO (TEST-CollectionsAPIDistributedZkTest.test-seed#[83754146B95FE8AA]) [ ] o.a.s.c.c.SolrZkClient Using default ZkACLProvider
    [junit4] 2> 261950 INFO (TEST-CollectionsAPIDistributedZkTest.test-seed#[83754146B95FE8AA]) [ ] o.a.s.c.AbstractZkTestCase put /Users/jenkins/workspace/Lucene-Solr-6.x-MacOSX/solr/core/src/test-files/solr/collection1/conf/solrconfig-tlog.xml to /configs/conf2/solrconfig.xml
    [junit4] 2> 261950 INFO (TEST-CollectionsAPIDistributedZkTest.test-seed#[83754146B95FE8AA]) [ ] o.a.s.c.c.SolrZkClient makePath: /configs/conf2/solrconfig.xml
    [junit4] 2> 261954 INFO (TEST-CollectionsAPIDistributedZkTest.test-seed#[83754146B95FE8AA]) [ ] o.a.s.c.AbstractZkTestCase put /Users/jenkins/workspace/Lucene-Solr-6.x-MacOSX/solr/core/src/test-files/solr/collection1/conf/schema.xml to /configs/conf2/schema.xml
    [junit4] 2> 261954 INFO (TEST-CollectionsAPIDistributedZkTest.test-seed#[83754146B95FE8AA]) [ ] o.a.s.c.c.SolrZkClient makePath: /configs/conf2/schema.xml
    [junit4] 2> 261958 INFO (TEST-CollectionsAPIDistributedZkTest.test-seed#[83754146B95FE8AA]) [ ] o.a.s.c.AbstractZkTestCase put /Users/jenkins/workspace/Lucene-Solr-6.x-MacOSX/solr/core/src/test-files/solr/collection1/conf/enumsConfig.xml to /configs/conf2/enumsConfig.xml
    [junit4] 2> 261958 INFO (TEST-CollectionsAPIDistributedZkTest.test-seed#[83754146B95FE8AA]) [ ] o.a.s.c.c.SolrZkClient makePath: /configs/conf2/enumsConfig.xml
    [junit4] 2> 261961 INFO (TEST-CollectionsAPIDistributedZkTest.test-seed#[83754146B95FE8AA]) [ ] o.a.s.c.AbstractZkTestCase put /Users/jenkins/workspace/Lucene-Solr-6.x-MacOSX/solr/core/src/test-files/solr/collection1/conf/solrconfig.snippet.randomindexconfig.xml to /configs/conf2/solrconfig.snippet.randomindexconfig.xml
    [junit4] 2> 261961 INFO (TEST-CollectionsAPIDistributedZkTest.test-seed#[83754146B95FE8AA]) [ ] o.a.s.c.c.SolrZkClient makePath: /configs/conf2/solrconfig.snippet.randomindexconfig.xml
    [junit4] 2> 261965 INFO (TEST-CollectionsAPIDistributedZkTest.test-seed#[83754146B95FE8AA]) [ ] o.a.s.c.AbstractZkTestCase put /Users/jenkins/workspace/Lucene-Solr-6.x-MacOSX/solr/core/src/test-files/solr/collection1/conf/stopwords.txt to /configs/conf2/stopwords.txt
    [junit4] 2> 261965 INFO (TEST-CollectionsAPIDistributedZkTest.test-seed#[83754146B95FE8AA]) [ ] o.a.s.c.c.SolrZkClient makePath: /configs/conf2/stopwords.txt
    [junit4] 2> 261968 INFO (TEST-CollectionsAPIDistributedZkTest.test-seed#[83754146B95FE8AA]) [ ] o.a.s.c.AbstractZkTestCase put /Users/jenkins/workspace/Lucene-Solr-6.x-MacOSX/solr/core/src/test-files/solr/collection1/conf/protwords.txt to /configs/conf2/protwords.txt
    [junit4] 2> 261968 INFO (TEST-CollectionsAPIDistributedZkTest.test-seed#[83754146B95FE8AA]) [ ] o.a.s.c.c.SolrZkClient makePath: /configs/conf2/protwords.txt
    [junit4] 2> 261971 INFO (TEST-CollectionsAPIDistributedZkTest.test-seed#[83754146B95FE8AA]) [ ] o.a.s.c.AbstractZkTestCase put /Users/jenkins/workspace/Lucene-Solr-6.x-MacOSX/solr/core/src/test-files/solr/collection1/conf/currency.xml to /configs/conf2/currency.xml
    [junit4] 2> 261971 INFO (TEST-CollectionsAPIDistributedZkTest.test-seed#[83754146B95FE8AA]) [ ] o.a.s.c.c.SolrZkClient makePath: /configs/conf2/currency.xml
    [junit4] 2> 261974 INFO (TEST-CollectionsAPIDistributedZkTest.test-seed#[83754146B95FE8AA]) [ ] o.a.s.c.AbstractZkTestCase put /Users/jenkins/workspace/Lucene-Solr-6.x-MacOSX/solr/core/src/test-files/solr/collection1/conf/open-exchange-rates.json to /configs/conf2/open-exchange-rates.json
    [junit4] 2> 261974 INFO (TEST-CollectionsAPIDistributedZkTest.test-seed#[83754146B95FE8AA]) [ ] o.a.s.c.c.SolrZkClient makePath: /configs/conf2/open-exchange-rates.json
    [junit4] 2> 261977 INFO (TEST-CollectionsAPIDistributedZkTest.test-seed#[83754146B95FE8AA]) [ ] o.a.s.c.AbstractZkTestCase put /Users/jenkins/workspace/Lucene-Solr-6.x-MacOSX/solr/core/src/test-files/solr/collection1/conf/mapping-ISOLatin1Accent.txt to /configs/conf2/mapping-ISOLatin1Accent.txt
    [junit4] 2> 261977 INFO (TEST-CollectionsAPIDistributedZkTest.test-seed#[83754146B95FE8AA]) [ ] o.a.s.c.c.SolrZkClient makePath: /configs/conf2/mapping-ISOLatin1Accent.txt
    [junit4] 2> 261980 INFO (TEST-CollectionsAPIDistributedZkTest.test-seed#[83754146B95FE8AA]) [ ] o.a.s.c.AbstractZkTestCase put /Users/jenkins/workspace/Lucene-Solr-6.x-MacOSX/solr/core/src/test-files/solr/collection1/conf/old_synonyms.txt to /configs/conf2/old_synonyms.txt
    [junit4] 2> 261980 INFO (TEST-CollectionsAPIDistributedZkTest.test-seed#[83754146B95FE8AA]) [ ] o.a.s.c.c.SolrZkClient makePath: /configs/conf2/old_synonyms.txt
    [junit4] 2> 261984 INFO (TEST-CollectionsAPIDistributedZkTest.test-seed#[83754146B95FE8AA]) [ ] o.a.s.c.AbstractZkTestCase put /Users/jenkins/workspace/Lucene-Solr-6.x-MacOSX/solr/core/src/test-files/solr/collection1/conf/synonyms.txt to /configs/conf2/synonyms.txt
    [junit4] 2> 261984 INFO (TEST-CollectionsAPIDistributedZkTest.test-seed#[83754146B95FE8AA]) [ ] o.a.s.c.c.SolrZkClient makePath: /configs/conf2/synonyms.txt
    [junit4] 2> 261987 INFO (TEST-CollectionsAPIDistributedZkTest.test-seed#[83754146B95FE8AA]) [ ] o.a.s.c.AbstractZkTestCase put /Users/jenkins/workspace/Lucene-Solr-6.x-MacOSX/solr/core/src/test-files/solr/collection1/conf/elevate.xml to /configs/conf2/elevate.xml
    [junit4] 2> 261987 INFO (TEST-CollectionsAPIDistributedZkTest.test-seed#[83754146B95FE8AA]) [ ] o.a.s.c.c.SolrZkClient makePath: /configs/conf2/elevate.xml
    [junit4] 2> 262364 INFO (TEST-CollectionsAPIDistributedZkTest.test-seed#[83754146B95FE8AA]) [ ] o.a.s.SolrTestCaseJ4 Writing core.properties file to /Users/jenkins/workspace/Lucene-Solr-6.x-MacOSX/solr/build/solr-core/test/J1/temp/solr.cloud.CollectionsAPIDistributedZkTest_83754146B95FE8AA-001/control-001/cores/collection1
    [junit4] 2> 262368 INFO (TEST-CollectionsAPIDistributedZkTest.test-seed#[83754146B95FE8AA]) [ ] o.e.j.s.Server jetty-9.3.8.v20160314
    [junit4] 2> 262371 INFO (TEST-CollectionsAPIDistributedZkTest.test-seed#[83754146B95FE8AA]) [ ] o.e.j.s.h.ContextHandler Started o.e.j.s.ServletContextHandler@148bb68{/,null,AVAILABLE}
    [junit4] 2> 262376 INFO (TEST-CollectionsAPIDistributedZkTest.test-seed#[83754146B95FE8AA]) [ ] o.e.j.s.ServerConnector Started ServerConnector@2f619609{HTTP/1.1,[http/1.1]}{127.0.0.1:65369}
    [junit4] 2> 262376 INFO (TEST-CollectionsAPIDistributedZkTest.test-seed#[83754146B95FE8AA]) [ ] o.e.j.s.Server Started @268228ms
    [junit4] 2> 262376 INFO (TEST-CollectionsAPIDistributedZkTest.test-seed#[83754146B95FE8AA]) [ ] o.a.s.c.s.e.JettySolrRunner Jetty properties: {solr.data.dir=/Users/jenkins/workspace/Lucene-Solr-6.x-MacOSX/solr/build/solr-core/test/J1/temp/solr.cloud.CollectionsAPIDistributedZkTest_83754146B95FE8AA-001/tempDir-001/control/data, hostContext=/, hostPort=65369, coreRootDirectory=/Users/jenkins/workspace/Lucene-Solr-6.x-MacOSX/solr/build/solr-core/test/J1/../../../../../../../../../Users/jenkins/workspace/Lucene-Solr-6.x-MacOSX/solr/build/solr-core/test/J1/temp/solr.cloud.CollectionsAPIDistributedZkTest_83754146B95FE8AA-001/control-001/cores}
    [junit4] 2> 262376 INFO (TEST-CollectionsAPIDistributedZkTest.test-seed#[83754146B95FE8AA]) [ ] o.a.s.s.SolrDispatchFilter SolrDispatchFilter.init(): sun.misc.Launcher$AppClassLoader@4554617c
    [junit4] 2> 262376 INFO (TEST-CollectionsAPIDistributedZkTest.test-seed#[83754146B95FE8AA]) [ ] o.a.s.c.SolrResourceLoader new SolrResourceLoader for directory: '/Users/jenkins/workspace/Lucene-Solr-6.x-MacOSX/solr/build/solr-core/test/J1/temp/solr.cloud.CollectionsAPIDistributedZkTest_83754146B95FE8AA-001/control-001'
    [junit4] 2> 262377 INFO (TEST-CollectionsAPIDistributedZkTest.test-seed#[83754146B95FE8AA]) [ ] o.a.s.c.SolrResourceLoader JNDI not configured for solr (NoInitialContextEx)
    [junit4] 2> 262377 INFO (TEST-CollectionsAPIDistributedZkTest.test-seed#[83754146B95FE8AA]) [ ] o.a.s.c.SolrResourceLoader solr home defaulted to 'solr/' (could not find system property or JNDI)
    [junit4] 2> 262377 INFO (TEST-CollectionsAPIDistributedZkTest.test-seed#[83754146B95FE8AA]) [ ] o.a.s.c.c.SolrZkClient Using default ZkCredentialsProvider
    [junit4] 2> 262378 INFO (TEST-CollectionsAPIDistributedZkTest.test-seed#[83754146B95FE8AA]) [ ] o.a.s.c.c.ConnectionManager Waiting for client to connect to ZooKeeper
    [junit4] 2> 262381 INFO (zkCallback-253-thread-1) [ ] o.a.s.c.c.ConnectionManager Watcher org.apache.solr.common.cloud.ConnectionManager@5d076d7f name:ZooKeeperConnection Watcher:127.0.0.1:65364/solr got event WatchedEvent state:SyncConnected type:None path:null path:null type:None
    [junit4] 2> 262381 INFO (TEST-CollectionsAPIDistributedZkTest.test-seed#[83754146B95FE8AA]) [ ] o.a.s.c.c.ConnectionManager Client is connected to ZooKeeper
    [junit4] 2> 262381 INFO (TEST-CollectionsAPIDistributedZkTest.test-seed#[83754146B95FE8AA]) [ ] o.a.s.c.c.SolrZkClient Using default ZkACLProvider
    [junit4] 2> 262384 INFO (TEST-CollectionsAPIDistributedZkTest.test-seed#[83754146B95FE8AA]) [ ] o.a.s.s.SolrDispatchFilter Loading solr.xml from SolrHome (not found in ZooKeeper)
    [junit4] 2> 262384 INFO (TEST-CollectionsAPIDistributedZkTest.test-seed#[83754146B95FE8AA]) [ ] o.a.s.c.SolrXmlConfig Loading container configuration from /Users/jenkins/workspace/Lucene-Solr-6.x-MacOSX/solr/build/solr-core/test/J1/temp/solr.cloud.CollectionsAPIDistributedZkTest_83754146B95FE8AA-001/control-001/solr.xml
    [junit4] 2> 262394 INFO (TEST-CollectionsAPIDistributedZkTest.test-seed#[83754146B95FE8AA]) [ ] o.a.s.c.CorePropertiesLocator Config-defined core root directory: /Users/jenkins/workspace/Lucene-Solr-6.x-MacOSX/solr/build/solr-core/test/J1/../../../../../../../../../Users/jenkins/workspace/Lucene-Solr-6.x-MacOSX/solr/build/solr-core/test/J1/temp/solr.cloud.CollectionsAPIDistributedZkTest_83754146B95FE8AA-001/control-001/cores
    [junit4] 2> 262395 INFO (TEST-CollectionsAPIDistributedZkTest.test-seed#[83754146B95FE8AA]) [ ] o.a.s.c.CoreContainer New CoreContainer 350745449
    [junit4] 2> 262395 INFO (TEST-CollectionsAPIDistributedZkTest.test-seed#[83754146B95FE8AA]) [ ] o.a.s.c.CoreContainer Loading cores into CoreContainer [instanceDir=/Users/jenkins/workspace/Lucene-Solr-6.x-MacOSX/solr/build/solr-core/test/J1/temp/solr.cloud.CollectionsAPIDistributedZkTest_83754146B95FE8AA-001/control-001]
    [junit4] 2> 262395 WARN (TEST-CollectionsAPIDistributedZkTest.test-seed#[83754146B95FE8AA]) [ ] o.a.s.c.CoreContainer Couldn't add files from /Users/jenkins/workspace/Lucene-Solr-6.x-MacOSX/solr/build/solr-core/test/J1/temp/solr.cloud.CollectionsAPIDistributedZkTest_83754146B95FE8AA-001/control-001/lib to classpath: /Users/jenkins/workspace/Lucene-Solr-6.x-MacOSX/solr/build/solr-core/test/J1/temp/solr.cloud.CollectionsAPIDistributedZkTest_83754146B95FE8AA-001/control-001/lib
    [junit4] 2> 262395 INFO (TEST-CollectionsAPIDistributedZkTest.test-seed#[83754146B95FE8AA]) [ ] o.a.s.h.c.HttpShardHandlerFactory created with socketTimeout : 90000,urlScheme : ,connTimeout : 15000,maxConnectionsPerHost : 20,maxConnections : 10000,corePoolSize : 0,maximumPoolSize : 2147483647,maxThreadIdleTime : 5,sizeOfQueue : -1,fairnessPolicy : false,useRetries : false,
    [junit4] 2> 262398 INFO (TEST-CollectionsAPIDistributedZkTest.test-seed#[83754146B95FE8AA]) [ ] o.a.s.u.UpdateShardHandler Creating UpdateShardHandler HTTP client with params: socketTimeout=340000&connTimeout=45000&retry=true
    [junit4] 2> 262400 INFO (TEST-CollectionsAPIDistributedZkTest.test-seed#[83754146B95FE8AA]) [ ] o.a.s.l.LogWatcher SLF4J impl is org.slf4j.impl.Log4jLoggerFactory
    [junit4] 2> 262400 INFO (TEST-CollectionsAPIDistributedZkTest.test-seed#[83754146B95FE8AA]) [ ] o.a.s.l.LogWatcher Registering Log Listener [Log4j (org.slf4j.impl.Log4jLoggerFactory)]
    [junit4] 2> 262400 INFO (TEST-CollectionsAPIDistributedZkTest.test-seed#[83754146B95FE8AA]) [ ] o.a.s.c.ZkContainer Zookeeper client=127.0.0.1:65364/solr
    [junit4] 2> 262400 INFO (TEST-CollectionsAPIDistributedZkTest.test-seed#[83754146B95FE8AA]) [ ] o.a.s.c.ZkController zkHost includes chroot
    [junit4] 2> 262400 INFO (TEST-CollectionsAPIDistributedZkTest.test-seed#[83754146B95FE8AA]) [ ] o.a.s.c.c.SolrZkClient Using default ZkCredentialsProvider
    [junit4] 2> 262401 INFO (TEST-CollectionsAPIDistributedZkTest.test-seed#[83754146B95FE8AA]) [ ] o.a.s.c.c.ConnectionManager Waiting for client to connect to ZooKeeper
    [junit4] 2> 262404 INFO (zkCallback-256-thread-1) [ ] o.a.s.c.c.ConnectionManager Watcher org.apache.solr.common.cloud.ConnectionManager@76dbabed name:ZooKeeperConnection Watcher:127.0.0.1:65364 got event WatchedEvent state:SyncConnected type:None path:null path:null type:None
    [junit4] 2> 262404 INFO (TEST-CollectionsAPIDistributedZkTest.test-seed#[83754146B95FE8AA]) [ ] o.a.s.c.c.ConnectionManager Client is connected to ZooKeeper
    [junit4] 2> 262404 INFO (TEST-CollectionsAPIDistributedZkTest.test-seed#[83754146B95FE8AA]) [ ] o.a.s.c.c.SolrZkClient Using default ZkACLProvider
    [junit4] 2> 262408 INFO (TEST-CollectionsAPIDistributedZkTest.test-seed#[83754146B95FE8AA]) [n:127.0.0.1:65369_ ] o.a.s.c.ZkController Added new OnReconnect listener org.apache.solr.cloud.ZkController$$Lambda$11/593422436@75ad22f
    [junit4] 2> 262408 INFO (TEST-CollectionsAPIDistributedZkTest.test-seed#[83754146B95FE8AA]) [n:127.0.0.1:65369_ ] o.a.s.c.c.ConnectionManager Waiting for client to connect to ZooKeeper
    [junit4] 2> 262412 INFO (zkCallback-257-thread-1-processing-n:127.0.0.1:65369_) [n:127.0.0.1:65369_ ] o.a.s.c.c.ConnectionManager Watcher org.apache.solr.common.cloud.ConnectionManager@17e69356 name:ZooKeeperConnection Watcher:127.0.0.1:65364/solr got event WatchedEvent state:SyncConnected type:None path:null path:null type:None
    [junit4] 2> 262412 INFO (TEST-CollectionsAPIDistributedZkTest.test-seed#[83754146B95FE8AA]) [n:127.0.0.1:65369_ ] o.a.s.c.c.ConnectionManager Client is connected to ZooKeeper
    [junit4] 2> 262416 INFO (TEST-CollectionsAPIDistributedZkTest.test-seed#[83754146B95FE8AA]) [n:127.0.0.1:65369_ ] o.a.s.c.c.SolrZkClient makePath: /overseer/queue
    [junit4] 2> 262424 INFO (TEST-CollectionsAPIDistributedZkTest.test-seed#[83754146B95FE8AA]) [n:127.0.0.1:65369_ ] o.a.s.c.c.SolrZkClient makePath: /overseer/collection-queue-work
    [junit4] 2> 262431 INFO (TEST-CollectionsAPIDistributedZkTest.test-seed#[83754146B95FE8AA]) [n:127.0.0.1:65369_ ] o.a.s.c.c.SolrZkClient makePath: /overseer/collection-map-running
    [junit4] 2> 262437 INFO (TEST-CollectionsAPIDistributedZkTest.test-seed#[83754146B95FE8AA]) [n:127.0.0.1:65369_ ] o.a.s.c.c.SolrZkClient makePath: /overseer/collection-map-completed
    [junit4] 2> 262441 INFO (TEST-CollectionsAPIDistributedZkTest.test-seed#[83754146B95FE8AA]) [n:127.0.0.1:65369_ ] o.a.s.c.c.SolrZkClient makePath: /overseer/collection-map-failure
    [junit4] 2> 262443 INFO (TEST-CollectionsAPIDistributedZkTest.test-seed#[83754146B95FE8AA]) [n:127.0.0.1:65369_ ] o.a.s.c.c.SolrZkClient makePath: /live_nodes
    [junit4] 2> 262447 INFO (TEST-CollectionsAPIDistributedZkTest.test-seed#[83754146B95FE8AA]) [n:127.0.0.1:65369_ ] o.a.s.c.c.SolrZkClient makePath: /aliases.json
    [junit4] 2> 262450 INFO (TEST-CollectionsAPIDistributedZkTest.test-seed#[83754146B95FE8AA]) [n:127.0.0.1:65369_ ] o.a.s.c.c.SolrZkClient makePath: /clusterstate.json
    [junit4] 2> 262453 INFO (TEST-CollectionsAPIDistributedZkTest.test-seed#[83754146B95FE8AA]) [n:127.0.0.1:65369_ ] o.a.s.c.c.SolrZkClient makePath: /security.json
    [junit4] 2> 262456 INFO (TEST-CollectionsAPIDistributedZkTest.test-seed#[83754146B95FE8AA]) [n:127.0.0.1:65369_ ] o.a.s.c.c.ZkStateReader Updating cluster state from ZooKeeper...
    [junit4] 2> 262457 INFO (TEST-CollectionsAPIDistributedZkTest.test-seed#[83754146B95FE8AA]) [n:127.0.0.1:65369_ ] o.a.s.c.c.ZkStateReader Loaded empty cluster properties
    [junit4] 2> 262459 INFO (TEST-CollectionsAPIDistributedZkTest.test-seed#[83754146B95FE8AA]) [n:127.0.0.1:65369_ ] o.a.s.c.c.ZkStateReader Updated live nodes from ZooKeeper... (0) -> (0)
    [junit4] 2> 262464 INFO (TEST-CollectionsAPIDistributedZkTest.test-seed#[83754146B95FE8AA]) [n:127.0.0.1:65369_ ] o.a.s.c.c.SolrZkClient makePath: /overseer_elect
    [junit4] 2> 262466 INFO (TEST-CollectionsAPIDistributedZkTest.test-seed#[83754146B95FE8AA]) [n:127.0.0.1:65369_ ] o.a.s.c.c.SolrZkClient makePath: /overseer_elect/election
    [junit4] 2> 262470 INFO (TEST-CollectionsAPIDistributedZkTest.test-seed#[83754146B95FE8AA]) [n:127.0.0.1:65369_ ] o.a.s.c.Overseer Overseer (id=null) closing
    [junit4] 2> 262471 INFO (TEST-CollectionsAPIDistributedZkTest.test-seed#[83754146B95FE8AA]) [n:127.0.0.1:65369_ ] o.a.s.c.LeaderElector Joined leadership election with path: /overseer_elect/election/96077329513316358-127.0.0.1:65369_-n_0000000000
    [junit4] 2> 262472 INFO (TEST-CollectionsAPIDistributedZkTest.test-seed#[83754146B95FE8AA]) [n:127.0.0.1:65369_ ] o.a.s.c.OverseerElectionContext I am going to be the leader 127.0.0.1:65369_
    [junit4] 2> 262472 INFO (TEST-CollectionsAPIDistributedZkTest.test-seed#[83754146B95FE8AA]) [n:127.0.0.1:65369_ ] o.a.s.c.c.SolrZkClient makePath: /overseer_elect/leader
    [junit4] 2> 262474 INFO (TEST-CollectionsAPIDistributedZkTest.test-seed#[83754146B95FE8AA]) [n:127.0.0.1:65369_ ] o.a.s.c.Overseer Overseer (id=96077329513316358-127.0.0.1:65369_-n_0000000000) starting
    [junit4] 2> 262478 INFO (TEST-CollectionsAPIDistributedZkTest.test-seed#[83754146B95FE8AA]) [n:127.0.0.1:65369_ ] o.a.s.c.c.SolrZkClient makePath: /overseer/queue-work
    [junit4] 2> 262491 INFO (TEST-CollectionsAPIDistributedZkTest.test-seed#[83754146B95FE8AA]) [n:127.0.0.1:65369_ ] o.a.s.c.OverseerAutoReplicaFailoverThread Starting OverseerAutoReplicaFailoverThread autoReplicaFailoverWorkLoopDelay=10000 autoReplicaFailoverWaitAfterExpiration=10000 autoReplicaFailoverBadNodeExpiration=60000
    [junit4] 2> 262492 INFO (OverseerCollectionConfigSetProcessor-96077329513316358-127.0.0.1:65369_-n_0000000000) [n:127.0.0.1:65369_ ] o.a.s.c.OverseerTaskProcessor Process current queue of overseer operations
    [junit4] 2> 262493 INFO (OverseerStateUpdate-96077329513316358-127.0.0.1:65369_-n_0000000000) [n:127.0.0.1:65369_ ] o.a.s.c.Overseer Starting to work on the main queue
    [junit4] 2> 262494 INFO (TEST-CollectionsAPIDistributedZkTest.test-seed#[83754146B95FE8AA]) [n:127.0.0.1:65369_ ] o.a.s.c.ZkController Register node as live in ZooKeeper:/live_nodes/127.0.0.1:65369_
    [junit4] 2> 262498 INFO (OverseerStateUpdate-96077329513316358-127.0.0.1:65369_-n_0000000000) [n:127.0.0.1:65369_ ] o.a.s.c.c.ZkStateReader Updated live nodes from ZooKeeper... (0) -> (0)
    [junit4] 2> 262498 INFO (TEST-CollectionsAPIDistributedZkTest.test-seed#[83754146B95FE8AA]) [n:127.0.0.1:65369_ ] o.a.s.c.c.SolrZkClient makePath: /live_nodes/127.0.0.1:65369_
    [junit4] 2> 262500 INFO (zkCallback-257-thread-1-processing-n:127.0.0.1:65369_) [n:127.0.0.1:65369_ ] o.a.s.c.c.ZkStateReader A live node change: [WatchedEvent state:SyncConnected type:NodeChildrenChanged path:/live_nodes], has occurred - updating... (live nodes size: [0])
    [junit4] 2> 262501 INFO (zkCallback-257-thread-1-processing-n:127.0.0.1:65369_) [n:127.0.0.1:65369_ ] o.a.s.c.c.ZkStateReader Updated live nodes from ZooKeeper... (0) -> (1)
    [junit4] 2> 262522 INFO (TEST-CollectionsAPIDistributedZkTest.test-seed#[83754146B95FE8AA]) [n:127.0.0.1:65369_ ] o.a.s.c.CoreContainer Security conf doesn't exist. Skipping setup for authorization module.
    [junit4] 2> 262522 INFO (TEST-CollectionsAPIDistributedZkTest.test-seed#[83754146B95FE8AA]) [n:127.0.0.1:65369_ ] o.a.s.c.CoreContainer No authentication plugin used.
    [junit4] 2> 262527 INFO (TEST-CollectionsAPIDistributedZkTest.test-seed#[83754146B95FE8AA]) [n:127.0.0.1:65369_ ] o.a.s.c.CorePropertiesLocator Looking for core definitions underneath /Users/jenkins/workspace/Lucene-Solr-6.x-MacOSX/solr/build/solr-core/test/J1/../../../../../../../../../Users/jenkins/workspace/Lucene-Solr-6.x-MacOSX/solr/build/solr-core/test/J1/temp/solr.cloud.CollectionsAPIDistributedZkTest_83754146B95FE8AA-001/control-001/cores
    [junit4] 2> 262530 INFO (TEST-CollectionsAPIDistributedZkTest.test-seed#[83754146B95FE8AA]) [n:127.0.0.1:65369_ ] o.a.s.c.CoreDescriptor Created CoreDescriptor: {name=collection1, config=solrconfig.xml, transient=false, schema=schema.xml, loadOnStartup=true, configSetProperties=configsetprops.json, collection=control_collection, coreNodeName=, dataDir=data/, shard=}
    [junit4] 2> 262530 INFO (TEST-CollectionsAPIDistributedZkTest.test-seed#[83754146B95FE8AA]) [n:127.0.0.1:65369_ ] o.a.s.c.CorePropertiesLocator Found core collection1 in /Users/jenkins/workspace/Lucene-Solr-6.x-MacOSX/solr/build/solr-core/test/J1/../../../../../../../../../Users/jenkins/workspace/Lucene-Solr-6.x-MacOSX/solr/build/solr-core/test/J1/temp/solr.cloud.CollectionsAPIDistributedZkTest_83754146B95FE8AA-001/control-001/cores/collection1
    [junit4] 2> 262530 INFO (TEST-CollectionsAPIDistributedZkTest.test-seed#[83754146B95FE8AA]) [n:127.0.0.1:65369_ ] o.a.s.c.CorePropertiesLocator Found 1 core definitions
    [junit4] 2> 262532 INFO (coreLoadExecutor-717-thread-1-processing-n:127.0.0.1:65369_) [n:127.0.0.1:65369_ c:control_collection x:collection1] o.a.s.c.ZkController publishing state=down
    [junit4] 2> 262532 INFO (coreLoadExecutor-717-thread-1-processing-n:127.0.0.1:65369_) [n:127.0.0.1:65369_ c:control_collection x:collection1] o.a.s.c.ZkController numShards not found on descriptor - reading it from system property
    [junit4] 2> 262534 INFO (coreLoadExecutor-717-thread-1-processing-n:127.0.0.1:65369_) [n:127.0.0.1:65369_ c:control_collection x:collection1] o.a.s.c.ZkController Collection control_collection not visible yet, but flagging it so a watch is registered when it becomes visible
    [junit4] 2> 262535 INFO (OverseerStateUpdate-96077329513316358-127.0.0.1:65369_-n_0000000000) [n:127.0.0.1:65369_ ] o.a.s.c.Overseer processMessage: queueSize: 1, message = {
    [junit4] 2> "core":"collection1",
    [junit4] 2> "roles":null,
    [junit4] 2> "base_url":"http://127.0.0.1:65369",
    [junit4] 2> "node_name":"127.0.0.1:65369_",
    [junit4] 2> "numShards":"1",
    [junit4] 2> "state":"down",
    [junit4] 2> "shard":null,
    [junit4] 2> "collection":"control_collection",
    [junit4] 2> "operation":"state"} current state version: 0
    [junit4] 2> 262536 INFO (coreLoadExecutor-717-thread-1-processing-n:127.0.0.1:65369_) [n:127.0.0.1:65369_ c:control_collection x:collection1] o.a.s.c.c.ZkStateReader Deleting data for [control_collection]
    [junit4] 2> 262536 INFO (OverseerStateUpdate-96077329513316358-127.0.0.1:65369_-n_0000000000) [n:127.0.0.1:65369_ ] o.a.s.c.o.ReplicaMutator Update state numShards=1 message={
    [junit4] 2> "core":"collection1",
    [junit4] 2> "roles":null,
    [junit4] 2> "base_url":"http://127.0.0.1:65369",
    [junit4] 2> "node_name":"127.0.0.1:65369_",
    [junit4] 2> "numShards":"1",
    [junit4] 2> "state":"down",
    [junit4] 2> "shard":null,
    [junit4] 2> "collection":"control_collection",
    [junit4] 2> "operation":"state"}
    [junit4] 2> 262537 INFO (OverseerStateUpdate-96077329513316358-127.0.0.1:65369_-n_0000000000) [n:127.0.0.1:65369_ ] o.a.s.c.o.ClusterStateMutator building a new cName: control_collection
    [junit4] 2> 262538 INFO (coreLoadExecutor-717-thread-1-processing-n:127.0.0.1:65369_) [n:127.0.0.1:65369_ c:control_collection x:collection1] o.a.s.c.ZkController look for our core node name
    [junit4] 2> 262538 INFO (OverseerStateUpdate-96077329513316358-127.0.0.1:65369_-n_0000000000) [n:127.0.0.1:65369_ ] o.a.s.c.o.ReplicaMutator Assigning new node to shard shard=shard1
    [junit4] 2> 262540 INFO (zkCallback-257-thread-1-processing-n:127.0.0.1:65369_) [n:127.0.0.1:65369_ ] o.a.s.c.c.ZkStateReader A cluster state change: [WatchedEvent state:SyncConnected type:NodeDataChanged path:/clusterstate.json], has occurred - updating... (live nodes size: [1])
    [junit4] 2> 262543 INFO (TEST-CollectionsAPIDistributedZkTest.test-seed#[83754146B95FE8AA]) [n:127.0.0.1:65369_ ] o.a.s.s.SolrDispatchFilter user.dir=/Users/jenkins/workspace/Lucene-Solr-6.x-MacOSX/solr/build/solr-core/test/J1
    [junit4] 2> 262547 INFO (TEST-CollectionsAPIDistributedZkTest.test-seed#[83754146B95FE8AA]) [n:127.0.0.1:65369_ ] o.a.s.s.SolrDispatchFilter SolrDispatchFilter.init() done
    [junit4] 2> 263544 INFO (coreLoadExecutor-717-thread-1-processing-n:127.0.0.1:65369_) [n:127.0.0.1:65369_ c:control_collection x:collection1] o.a.s.c.ZkController waiting to find shard id in clusterstate for collection1
    [junit4] 2> 263544 INFO (coreLoadExecutor-717-thread-1-processing-n:127.0.0.1:65369_) [n:127.0.0.1:65369_ c:control_collection x:collection1] o.a.s.c.ZkController Check for collection zkNode:control_collection
    [junit4] 2> 263545 INFO (coreLoadExecutor-717-thread-1-processing-n:127.0.0.1:65369_) [n:127.0.0.1:65369_ c:control_collection x:collection1] o.a.s.c.ZkController Collection zkNode exists
    [junit4] 2> 263545 INFO (coreLoadExecutor-717-thread-1-processing-n:127.0.0.1:65369_) [n:127.0.0.1:65369_ c:control_collection x:collection1] o.a.s.c.c.ZkStateReader Load collection config from: [/collections/control_collection]
    [junit4] 2> 263546 INFO (coreLoadExecutor-717-thread-1-processing-n:127.0.0.1:65369_) [n:127.0.0.1:65369_ c:control_collection x:collection1] o.a.s.c.c.ZkStateReader path=[/collections/control_collection] [configName]=[conf1] specified config exists in ZooKeeper
    [junit4] 2> 263546 INFO (coreLoadExecutor-717-thread-1-processing-n:127.0.0.1:65369_) [n:127.0.0.1:65369_ c:control_collection x:collection1] o.a.s.c.SolrResourceLoader new SolrResourceLoader for directory: '/Users/jenkins/workspace/Lucene-Solr-6.x-MacOSX/solr/build/solr-core/test/J1/temp/solr.cloud.CollectionsAPIDistributedZkTest_83754146B95FE8AA-001/control-001/cores/collection1'
    [junit4] 2> 263546 INFO (coreLoadExecutor-717-thread-1-processing-n:127.0.0.1:65369_) [n:127.0.0.1:65369_ c:control_collection x:collection1] o.a.s.c.SolrResourceLoader JNDI not configured for solr (NoInitialContextEx)
    [junit4] 2> 263546 INFO (coreLoadExecutor-717-thread-1-processing-n:127.0.0.1:65369_) [n:127.0.0.1:65369_ c:control_collection x:collection1] o.a.s.c.SolrResourceLoader solr home defaulted to 'solr/' (could not find system property or JNDI)
    [junit4] 2> 263548 INFO (coreLoadExecutor-717-thread-1-processing-n:127.0.0.1:65369_) [n:127.0.0.1:65369_ c:control_collection x:collection1] o.a.s.c.Config loaded config solrconfig.xml with version 0
    [junit4] 2> 263557 INFO (coreLoadExecutor-717-thread-1-processing-n:127.0.0.1:65369_) [n:127.0.0.1:65369_ c:control_collection x:collection1] o.a.s.c.SolrConfig current version of requestparams : -1
    [junit4] 2> 263561 INFO (coreLoadExecutor-717-thread-1-processing-n:127.0.0.1:65369_) [n:127.0.0.1:65369_ c:control_collection x:collection1] o.a.s.c.SolrConfig Using Lucene MatchVersion: 6.2.0
    [junit4] 2> 263579 INFO (coreLoadExecutor-717-thread-1-processing-n:127.0.0.1:65369_) [n:127.0.0.1:65369_ c:control_collection x:collection1] o.a.s.c.SolrConfig Loaded SolrConfig: solrconfig.xml
    [junit4] 2> 263589 INFO (coreLoadExecutor-717-thread-1-processing-n:127.0.0.1:65369_) [n:127.0.0.1:65369_ c:control_collection x:collection1] o.a.s.s.IndexSchema [collection1] Schema name=test
    [junit4] 2> 263690 INFO (coreLoadExecutor-717-thread-1-processing-n:127.0.0.1:65369_) [n:127.0.0.1:65369_ c:control_collection x:collection1] o.a.s.s.OpenExchangeRatesOrgProvider Initialized with rates=open-exchange-rates.json, refreshInterval=1440.
    [junit4] 2> 263704 INFO (coreLoadExecutor-717-thread-1-processing-n:127.0.0.1:65369_) [n:127.0.0.1:65369_ c:control_collection x:collection1] o.a.s.s.IndexSchema default search field in schema is text
    [junit4] 2> 263705 INFO (coreLoadExecutor-717-thread-1-processing-n:127.0.0.1:65369_) [n:127.0.0.1:65369_ c:control_collection x:collection1] o.a.s.s.IndexSchema unique key field: id
    [junit4] 2> 263725 INFO (coreLoadExecutor-717-thread-1-processing-n:127.0.0.1:65369_) [n:127.0.0.1:65369_ c:control_collection x:collection1] o.a.s.s.FileExchangeRateProvider Reloading exchange rates from file currency.xml
    [junit4] 2> 263731 INFO (coreLoadExecutor-717-thread-1-processing-n:127.0.0.1:65369_) [n:127.0.0.1:65369_ c:control_collection x:collection1] o.a.s.s.FileExchangeRateProvider Reloading exchange rates from file currency.xml
    [junit4] 2> 263735 INFO (coreLoadExecutor-717-thread-1-processing-n:127.0.0.1:65369_) [n:127.0.0.1:65369_ c:control_collection x:collection1] o.a.s.s.OpenExchangeRatesOrgProvider Reloading exchange rates from open-exchange-rates.json
    [junit4] 2> 263736 INFO (coreLoadExecutor-717-thread-1-processing-n:127.0.0.1:65369_) [n:127.0.0.1:65369_ c:control_collection x:collection1] o.a.s.s.OpenExchangeRatesOrgProvider Reloading exchange rates from open-exchange-rates.json
    [junit4] 2> 263741 INFO (coreLoadExecutor-717-thread-1-processing-n:127.0.0.1:65369_) [n:127.0.0.1:65369_ c:control_collection x:collection1] o.a.s.c.ConfigSetProperties Did not find ConfigSet properties, assuming default properties: Can't find resource 'configsetprops.json' in classpath or '/configs/conf1', cwd=/Users/jenkins/workspace/Lucene-Solr-6.x-MacOSX/solr/build/solr-core/test/J1
    [junit4] 2> 263741 INFO (coreLoadExecutor-717-thread-1-processing-n:127.0.0.1:65369_) [n:127.0.0.1:65369_ c:control_collection x:collection1] o.a.s.c.CoreContainer Creating SolrCore 'collection1' using configuration from collection control_collection
    [junit4] 2> 263742 INFO (coreLoadExecutor-717-thread-1-processing-n:127.0.0.1:65369_) [n:127.0.0.1:65369_ c:control_collection s:shard1 r:core_node1 x:collection1] o.a.s.c.SolrCore org.apache.solr.core.MockDirectoryFactory
    [junit4] 2> 263742 INFO (coreLoadExecutor-717-thread-1-processing-n:127.0.0.1:65369_) [n:127.0.0.1:65369_ c:control_collection s:shard1 r:core_node1 x:collection1] o.a.s.c.SolrCore [[collection1] ] Opening new SolrCore at [/Users/jenkins/workspace/Lucene-Solr-6.x-MacOSX/solr/build/solr-core/test/J1/temp/solr.cloud.CollectionsAPIDistributedZkTest_83754146B95FE8AA-001/control-001/cores/collection1], dataDir=[/Users/jenkins/workspace/Lucene-Solr-6.x-MacOSX/solr/build/solr-core/test/J1/../../../../../../../../../Users/jenkins/workspace/Lucene-Solr-6.x-MacOSX/solr/build/solr-core/test/J1/temp/solr.cloud.CollectionsAPIDistributedZkTest_83754146B95FE8AA-001/control-001/cores/collection1/data/]
    [junit4] 2> 263742 INFO (coreLoadExecutor-717-thread-1-processing-n:127.0.0.1:65369_) [n:127.0.0.1:65369_ c:control_collection s:shard1 r:core_node1 x:collection1] o.a.s.c.JmxMonitoredMap JMX monitoring is enabled. Adding Solr mbeans to JMX Server: com.sun.jmx.mbeanserver.JmxMBeanServer@410d1c
    [junit4] 2> 263743 INFO (coreLoadExecutor-717-thread-1-processing-n:127.0.0.1:65369_) [n:127.0.0.1:65369_ c:control_collection s:shard1 r:core_node1 x:collection1] o.a.s.c.CachingDirectoryFactory return new directory for /Users/jenkins/workspace/Lucene-Solr-6.x-MacOSX/solr/build/solr-core/test/J1/../../../../../../../../../Users/jenkins/workspace/Lucene-Solr-6.x-MacOSX/solr/build/solr-core/test/J1/temp/solr.cloud.CollectionsAPIDistributedZkTest_83754146B95FE8AA-001/control-001/cores/collection1/data
    [junit4] 2> 263743 INFO (coreLoadExecutor-717-thread-1-processing-n:127.0.0.1:65369_) [n:127.0.0.1:65369_ c:control_collection s:shard1 r:core_node1 x:collection1] o.a.s.c.SolrCore New index directory detected: old=null new=/Users/jenkins/workspace/Lucene-Solr-6.x-MacOSX/solr/build/solr-core/test/J1/../../../../../../../../../Users/jenkins/workspace/Lucene-Solr-6.x-MacOSX/solr/build/solr-core/test/J1/temp/solr.cloud.CollectionsAPIDistributedZkTest_83754146B95FE8AA-001/control-001/cores/collection1/data/index/
    [junit4] 2> 263743 WARN (coreLoadExecutor-717-thread-1-processing-n:127.0.0.1:65369_) [n:127.0.0.1:65369_ c:control_collection s:shard1 r:core_node1 x:collection1] o.a.s.c.SolrCore [collection1] Solr index directory '/Users/jenkins/workspace/Lucene-Solr-6.x-MacOSX/solr/build/solr-core/test/J1/../../../../../../../../../Users/jenkins/workspace/Lucene-Solr-6.x-MacOSX/solr/build/solr-core/test/J1/temp/solr.cloud.CollectionsAPIDistributedZkTest_83754146B95FE8AA-001/control-001/cores/collection1/data/index' doesn't exist. Creating new index...
    [junit4] 2> 263743 INFO (coreLoadExecutor-717-thread-1-processing-n:127.0.0.1:65369_) [n:127.0.0.1:65369_ c:control_collection s:shard1 r:core_node1 x:collection1] o.a.s.c.CachingDirectoryFactory return new directory for /Users/jenkins/workspace/Lucene-Solr-6.x-MacOSX/solr/build/solr-core/test/J1/../../../../../../../../../Users/jenkins/workspace/Lucene-Solr-6.x-MacOSX/solr/build/solr-core/test/J1/temp/solr.cloud.CollectionsAPIDistributedZkTest_83754146B95FE8AA-001/control-001/cores/collection1/data/index
    [junit4] 2> 263743 INFO (coreLoadExecutor-717-thread-1-processing-n:127.0.0.1:65369_) [n:127.0.0.1:65369_ c:control_collection s:shard1 r:core_node1 x:collection1] o.a.s.u.RandomMergePolicy RandomMergePolicy wrapping class org.apache.lucene.index.TieredMergePolicy: [TieredMergePolicy: maxMergeAtOnce=48, maxMergeAtOnceExplicit=11, maxMergedSegmentMB=58.1943359375, floorSegmentMB=1.6640625, forceMergeDeletesPctAllowed=18.267399298673592, segmentsPerTier=15.0, maxCFSSegmentSizeMB=8.796093022207999E12, noCFSRatio=0.748424873897906
    [junit4] 2> 263745 INFO (coreLoadExecutor-717-thread-1-processing-n:127.0.0.1:65369_) [n:127.0.0.1:65369_ c:control_collection s:shard1 r:core_node1 x:collection1] o.a.s.c.SolrDeletionPolicy SolrDeletionPolicy.onCommit: commits: num=1
    [junit4] 2> commit{dir=MockDirectoryWrapper(RAMDirectory@6e0b0b39 lockFactory=org.apache.lucene.store.SingleInstanceLockFactory@5004d811),segFN=segments_1,generation=1}
    [junit4] 2> 263745 INFO (coreLoadExecutor-717-thread-1-processing-n:127.0.0.1:65369_) [n:127.0.0.1:65369_ c:control_collection s:shard1 r:core_node1 x:collection1] o.a.s.c.SolrDeletionPolicy newest commit generation = 1
    [junit4] 2> 263746 INFO (OldIndexDirectoryCleanupThreadForCore-collection1) [n:127.0.0.1:65369_ c:control_collection s:shard1 r:core_node1 x:collection1] o.a.s.c.SolrCore Looking for old index directories to cleanup for core collection1 in /Users/jenkins/workspace/Lucene-Solr-6.x-MacOSX/solr/build/solr-core/test/J1/../../../../../../../../../Users/jenkins/workspace/Lucene-Solr-6.x-MacOSX/solr/build/solr-core/test/J1/temp/solr.cloud.CollectionsAPIDistributedZkTest_83754146B95FE8AA-001/control-001/cores/collection1/data/
    [junit4] 2> 263747 WARN (OldIndexDirectoryCleanupThreadForCore-collection1) [n:127.0.0.1:65369_ c:control_collection s:shard1 r:core_node1 x:collection1] o.a.s.c.DirectoryFactory /Users/jenkins/workspace/Lucene-Solr-6.x-MacOSX/solr/build/solr-core/test/J1/../../../../../../../../../Users/jenkins/workspace/Lucene-Solr-6.x-MacOSX/solr/build/solr-core/test/J1/temp/solr.cloud.CollectionsAPIDistributedZkTest_83754146B95FE8AA-001/control-001/cores/collection1/data/ does not point to a valid data directory; skipping clean-up of old index directories.
    [junit4] 2> 263749 INFO (coreLoadExecutor-717-thread-1-processing-n:127.0.0.1:65369_) [n:127.0.0.1:65369_ c:control_collection s:shard1 r:core_node1 x:collection1] o.a.s.u.p.UpdateRequestProcessorChain creating updateRequestProcessorChain "nodistrib"
    [junit4] 2> 263749 INFO (coreLoadExecutor-717-thread-1-processing-n:127.0.0.1:65369_) [n:127.0.0.1:65369_ c:control_collection s:shard1 r:core_node1 x:collection1] o.a.s.u.p.UpdateRequestProcessorChain creating updateRequestProcessorChain "dedupe"
    [junit4] 2> 263749 INFO (coreLoadExecutor-717-thread-1-processing-n:127.0.0.1:65369_) [n:127.0.0.1:65369_ c:control_collection s:shard1 r:core_node1 x:collection1] o.a.s.u.p.UpdateRequestProcessorChain inserting DistributedUpdateProcessorFactory into updateRequestProcessorChain "dedupe"
    [junit4] 2> 263749 INFO (coreLoadExecutor-717-thread-1-processing-n:127.0.0.1:65369_) [n:127.0.0.1:65369_ c:control_collection s:shard1 r:core_node1 x:collection1] o.a.s.u.p.UpdateRequestProcessorChain creating updateRequestProcessorChain "stored_sig"
    [junit4] 2> 263749 INFO (coreLoadExecutor-717-thread-1-processing-n:127.0.0.1:65369_) [n:127.0.0.1:65369_ c:control_collection s:shard1 r:core_node1 x:collection1] o.a.s.u.p.UpdateRequestProcessorChain inserting DistributedUpdateProcessorFactory into updateRequestProcessorChain "stored_sig"
    [junit4] 2> 263749 INFO (coreLoadExecutor-717-thread-1-processing-n:127.0.0.1:65369_) [n:127.0.0.1:65369_ c:control_collection s:shard1 r:core_node1 x:collection1] o.a.s.u.p.UpdateRequestProcessorChain creating updateRequestProcessorChain "distrib-dup-test-chain-explicit"
    [junit4] 2> 263749 INFO (coreLoadExecutor-717-thread-1-processing-n:127.0.0.1:65369_) [n:127.0.0.1:65369_ c:control_collection s:shard1 r:core_node1 x:collection1] o.a.s.u.p.UpdateRequestProcessorChain creating updateRequestProcessorChain "distrib-dup-test-chain-implicit"
    [junit4] 2> 263751 INFO (coreLoadExecutor-717-thread-1-processing-n:127.0.0.1:65369_) [n:127.0.0.1:65369_ c:control_collection s:shard1 r:core_node1 x:collection1] o.a.s.u.p.UpdateRequestProcessorChain inserting DistributedUpdateProcessorFactory into updateRequestProcessorChain "distrib-dup-test-chain-implicit"
    [junit4] 2> 263751 INFO (coreLoadExecutor-717-thread-1-processing-n:127.0.0.1:65369_) [n:127.0.0.1:65369_ c:control_collection s:shard1 r:core_node1 x:collection1] o.a.s.c.SolrCore no updateRequestProcessorChain defined as default, creating implicit default
    [junit4] 2> 263751 WARN (coreLoadExecutor-717-thread-1-processing-n:127.0.0.1:65369_) [n:127.0.0.1:65369_ c:control_collection s:shard1 r:core_node1 x:collection1] o.a.s.c.RequestHandlers INVALID paramSet a in requestHandler {type = requestHandler,name = /dump,class = DumpRequestHandler,args = {defaults={a=A,b=B}}}
    [junit4] 2> 263761 INFO (coreLoadExecutor-717-thread-1-processing-n:127.0.0.1:65369_) [n:127.0.0.1:65369_ c:control_collection s:shard1 r:core_node1 x:collection1] o.a.s.h.l.XMLLoader xsltCacheLifetimeSeconds=60
    [junit4] 2> 263763 INFO (coreLoadExecutor-717-thread-1-processing-n:127.0.0.1:65369_) [n:127.0.0.1:65369_ c:control_collection s:shard1 r:core_node1 x:collection1] o.a.s.h.l.XMLLoader xsltCacheLifetimeSeconds=60
    [junit4] 2> 263765 INFO (coreLoadExecutor-717-thread-1-processing-n:127.0.0.1:65369_) [n:127.0.0.1:65369_ c:control_collection s:shard1 r:core_node1 x:collection1] o.a.s.h.l.XMLLoader xsltCacheLifetimeSeconds=60
    [junit4] 2> 263767 INFO (coreLoadExecutor-717-thread-1-processing-n:127.0.0.1:65369_) [n:127.0.0.1:65369_ c:control_collection s:shard1 r:core_node1 x:collection1] o.a.s.h.l.XMLLoader xsltCacheLifetimeSeconds=60
    [junit4] 2> 263772 INFO (coreLoadExecutor-717-thread-1-processing-n:127.0.0.1:65369_) [n:127.0.0.1:65369_ c:control_collection s:shard1 r:core_node1 x:collection1] o.a.s.c.RequestHandlers Registered paths: /admin/mbeans,standard,/update/json/docs,/admin/luke,/export,/get,/admin/properties,/update/json,/admin/threads,/dump,/update/csv,/sql,/graph,/admin/segments,/admin/system,/replication,/config,/stream,/schema,/admin/plugins,/admin/logging,/admin/ping,/update,/admin/file
    [junit4] 2> 263773 INFO (coreLoadExecutor-717-thread-1-processing-n:127.0.0.1:65369_) [n:127.0.0.1:65369_ c:control_collection s:shard1 r:core_node1 x:collection1] o.a.s.c.SolrCore Using default statsCache cache: org.apache.solr.search.stats.LocalStatsCache
    [junit4] 2> 263774 INFO (coreLoadExecutor-717-thread-1-processing-n:127.0.0.1:65369_) [n:127.0.0.1:65369_ c:control_collection s:shard1 r:core_node1 x:collection1] o.a.s.u.UpdateHandler Using UpdateLog implementation: org.apache.solr.update.UpdateLog
    [junit4] 2> 263774 INFO (coreLoadExecutor-717-thread-1-processing-n:127.0.0.1:65369_) [n:127.0.0.1:65369_ c:control_collection s:shard1 r:core_node1 x:collection1] o.a.s.u.UpdateLog Initializing UpdateLog: dataDir= defaultSyncLevel=FLUSH numRecordsToKeep=100 maxNumLogsToKeep=10 numVersionBuckets=65536
    [junit4] 2> 263775 INFO (coreLoadExecutor-717-thread-1-processing-n:127.0.0.1:65369_) [n:127.0.0.1:65369_ c:control_collection s:shard1 r:core_node1 x:collection1] o.a.s.u.CommitTracker Hard AutoCommit: disabled
    [junit4] 2> 263775 INFO (coreLoadExecutor-717-thread-1-processing-n:127.0.0.1:65369_) [n:127.0.0.1:65369_ c:control_collection s:shard1 r:core_node1 x:collection1] o.a.s.u.CommitTracker Soft AutoCommit: disabled
    [junit4] 2> 263776 INFO (coreLoadExecutor-717-thread-1-processing-n:127.0.0.1:65369_) [n:127.0.0.1:65369_ c:control_collection s:shard1 r:core_node1 x:collection1] o.a.s.u.RandomMergePolicy RandomMergePolicy wrapping class org.apache.lucene.index.LogDocMergePolicy: [LogDocMergePolicy: minMergeSize=1000, mergeFactor=15, maxMergeSize=9223372036854775807, maxMergeSizeForForcedMerge=9223372036854775807, calibrateSizeByDeletes=true, maxMergeDocs=2147483647, maxCFSSegmentSizeMB=1.251953125, noCFSRatio=0.0]
    [junit4] 2> 263776 INFO (coreLoadExecutor-717-thread-1-processing-n:127.0.0.1:65369_) [n:127.0.0.1:65369_ c:control_collection s:shard1 r:core_node1 x:collection1] o.a.s.c.SolrDeletionPolicy SolrDeletionPolicy.onInit: commits: num=1
    [junit4] 2> commit{dir=MockDirectoryWrapper(RAMDirectory@6e0b0b39 lockFactory=org.apache.lucene.store.SingleInstanceLockFactory@5004d811),segFN=segments_1,generation=1}
    [junit4] 2> 263776 INFO (coreLoadExecutor-717-thread-1-processing-n:127.0.0.1:65369_) [n:127.0.0.1:65369_ c:control_collection s:shard1 r:core_node1 x:collection1] o.a.s.c.SolrDeletionPolicy newest commit generation = 1
    [junit4] 2> 263776 INFO (coreLoadExecutor-717-thread-1-processing-n:127.0.0.1:65369_) [n:127.0.0.1:65369_ c:control_collection s:shard1 r:core_node1 x:collection1] o.a.s.s.SolrIndexSearcher Opening [Searcher@4ed89a97[collection1] main]
    [junit4] 2> 263776 INFO (coreLoadExecutor-717-thread-1-processing-n:127.0.0.1:65369_) [n:127.0.0.1:65369_ c:control_collection s:shard1 r:core_node1 x:collection1] o.a.s.c.c.ZkStateReader Load collection config from: [/collections/control_collection]
    [junit4] 2> 263778 INFO (coreLoadExecutor-717-thread-1-processing-n:127.0.0.1:65369_) [n:127.0.0.1:65369_ c:control_collection s:shard1 r:core_node1 x:collection1] o.a.s.c.c.ZkStateReader path=[/collections/control_collection] [configName]=[conf1] specified config exists in ZooKeeper
    [junit4] 2> 263778 INFO (coreLoadExecutor-717-thread-1-processing-n:127.0.0.1:65369_) [n:127.0.0.1:65369_ c:control_collection s:shard1 r:core_node1 x:collection1] o.a.s.r.ManagedResourceStorage Setting up ZooKeeper-based storage for the RestManager with znodeBase: /configs/conf1
    [junit4] 2> 263779 INFO (coreLoadExecutor-717-thread-1-processing-n:127.0.0.1:65369_) [n:127.0.0.1:65369_ c:control_collection s:shard1 r:core_node1 x:collection1] o.a.s.r.ManagedResourceStorage Configured ZooKeeperStorageIO with znodeBase: /configs/conf1
    [junit4] 2> 263779 INFO (coreLoadExecutor-717-thread-1-processing-n:127.0.0.1:65369_) [n:127.0.0.1:65369_ c:control_collection s:shard1 r:core_node1 x:collection1] o.a.s.r.RestManager Initializing RestManager with initArgs: {}
    [junit4] 2> 263779 INFO (coreLoadExecutor-717-thread-1-processing-n:127.0.0.1:65369_) [n:127.0.0.1:65369_ c:control_collection s:shard1 r:core_node1 x:collection1] o.a.s.r.ManagedResourceStorage Reading _rest_managed.json using ZooKeeperStorageIO:path=/configs/conf1
    [junit4] 2> 263780 INFO (coreLoadExecutor-717-thread-1-processing-n:127.0.0.1:65369_) [n:127.0.0.1:65369_ c:control_collection s:shard1 r:core_node1 x:collection1] o.a.s.r.ManagedResourceStorage No data found for znode /configs/conf1/_rest_managed.json
    [junit4] 2> 263780 INFO (coreLoadExecutor-717-thread-1-processing-n:127.0.0.1:65369_) [n:127.0.0.1:65369_ c:control_collection s:shard1 r:core_node1 x:collection1] o.a.s.r.ManagedResourceStorage Loaded null at path _rest_managed.json using ZooKeeperStorageIO:path=/configs/conf1
    [junit4] 2> 263780 INFO (coreLoadExecutor-717-thread-1-processing-n:127.0.0.1:65369_) [n:127.0.0.1:65369_ c:control_collection s:shard1 r:core_node1 x:collection1] o.a.s.r.RestManager Initializing 0 registered ManagedResources
    [junit4] 2> 263780 INFO (coreLoadExecutor-717-thread-1-processing-n:127.0.0.1:65369_) [n:127.0.0.1:65369_ c:control_collection s:shard1 r:core_node1 x:collection1] o.a.s.h.ReplicationHandler Commits will be reserved for 10000
    [junit4] 2> 263781 INFO (searcherExecutor-718-thread-1-processing-n:127.0.0.1:65369_ x:collection1 s:shard1 c:control_collection r:core_node1) [n:127.0.0.1:65369_ c:control_collection s:shard1 r:core_node1 x:collection1] o.a.s.c.SolrCore [collection1] Registered new searcher Searcher@4ed89a97[collection1] main{ExitableDirectoryReader(UninvertingDirectoryReader())}
    [junit4] 2> 263782 INFO (coreLoadExecutor-717-thread-1-processing-n:127.0.0.1:65369_) [n:127.0.0.1:65369_ c:control_collection s:shard1 r:core_node1 x:collection1] o.a.s.u.UpdateLog Looking up max value of version field to seed version buckets
    [junit4] 2> 263782 INFO (coreLoadExecutor-717-thread-1-processing-n:127.0.0.1:65369_) [n:127.0.0.1:65369_ c:control_collection s:shard1 r:core_node1 x:collection1] o.a.s.u.VersionInfo Refreshing highest value of _version_ for 65536 version buckets from index
    [junit4] 2> 263782 INFO (coreLoadExecutor-717-thread-1-processing-n:127.0.0.1:65369_) [n:127.0.0.1:65369_ c:control_collection s:shard1 r:core_node1 x:collection1] o.a.s.u.VersionInfo No terms found for _version_, cannot seed version bucket highest value from index
    [junit4] 2> 263782 INFO (coreLoadExecutor-717-thread-1-processing-n:127.0.0.1:65369_) [n:127.0.0.1:65369_ c:control_collection s:shard1 r:core_node1 x:collection1] o.a.s.u.UpdateLog Could not find max version in index or recent updates, using new clock 1537237274353205248
    [junit4] 2> 263784 INFO (coreLoadExecutor-717-thread-1-processing-n:127.0.0.1:65369_) [n:127.0.0.1:65369_ c:control_collection s:shard1 r:core_node1 x:collection1] o.a.s.u.UpdateLog Took 2.0ms to seed version buckets with highest version 1537237274353205248
    [junit4] 2> 263785 INFO (coreLoadExecutor-717-thread-1-processing-n:127.0.0.1:65369_) [n:127.0.0.1:65369_ c:control_collection s:shard1 r:core_node1 x:collection1] o.a.s.c.ZkController watch zkdir /configs/conf1
    [junit4] 2> 263786 INFO (coreLoadExecutor-717-thread-1-processing-n:127.0.0.1:65369_) [n:127.0.0.1:65369_ c:control_collection s:shard1 r:core_node1 x:collection1] o.a.s.c.CoreContainer registering core: collection1
    [junit4] 2> 263787 INFO (coreZkRegister-711-thread-1-processing-n:127.0.0.1:65369_ x:collection1 s:shard1 c:control_collection r:core_node1) [n:127.0.0.1:65369_ c:control_collection s:shard1 r:core_node1 x:collection1] o.a.s.c.ZkController Register replica - core:collection1 address:http://127.0.0.1:65369 collection:control_collection shard:shard1
    [junit4] 2> 263788 INFO (coreZkRegister-711-thread-1-processing-n:127.0.0.1:65369_ x:collection1 s:shard1 c:control_collection r:core_node1) [n:127.0.0.1:65369_ c:control_collection s:shard1 r:core_node1 x:collection1] o.a.s.c.c.SolrZkClient makePath: /collections/control_collection/leader_elect/shard1/election
    [junit4] 2> 263795 INFO (coreZkRegister-711-thread-1-processing-n:127.0.0.1:65369_ x:collection1 s:shard1 c:control_collection r:core_node1) [n:127.0.0.1:65369_ c:control_collection s:shard1 r:core_node1 x:collection1] o.a.s.c.LeaderElector Joined leadership election with path: /collections/control_collection/leader_elect/shard1/election/96077329513316358-core_node1-n_0000000000
    [junit4] 2> 263796 INFO (coreZkRegister-711-thread-1-processing-n:127.0.0.1:65369_ x:collection1 s:shard1 c:control_collection r:core_node1) [n:127.0.0.1:65369_ c:control_collection s:shard1 r:core_node1 x:collection1] o.a.s.c.ShardLeaderElectionContext Running the leader process for shard=shard1 and weAreReplacement=false and leaderVoteWait=180000
    [junit4] 2> 263799 INFO (coreZkRegister-711-thread-1-processing-n:127.0.0.1:65369_ x:collection1 s:shard1 c:control_collection r:core_node1) [n:127.0.0.1:65369_ c:control_collection s:shard1 r:core_node1 x:collection1] o.a.s.c.ShardLeaderElectionContext Enough replicas found to continue.
    [junit4] 2> 263799 INFO (coreZkRegister-711-thread-1-processing-n:127.0.0.1:65369_ x:collection1 s:shard1 c:control_collection r:core_node1) [n:127.0.0.1:65369_ c:control_collection s:shard1 r:core_node1 x:collection1] o.a.s.c.ShardLeaderElectionContext I may be the new leader - try and sync
    [junit4] 2> 263799 INFO (coreZkRegister-711-thread-1-processing-n:127.0.0.1:65369_ x:collection1 s:shard1 c:control_collection r:core_node1) [n:127.0.0.1:65369_ c:control_collection s:shard1 r:core_node1 x:collection1] o.a.s.c.SyncStrategy Sync replicas to http://127.0.0.1:65369/collection1/
    [junit4] 2> 263799 INFO (coreZkRegister-711-thread-1-processing-n:127.0.0.1:65369_ x:collection1 s:shard1 c:control_collection r:core_node1) [n:127.0.0.1:65369_ c:control_collection s:shard1 r:core_node1 x:collection1] o.a.s.c.SyncStrategy Sync Success - now sync replicas to me
    [junit4] 2> 263799 INFO (coreZkRegister-711-thread-1-processing-n:127.0.0.1:65369_ x:collection1 s:shard1 c:control_collection r:core_node1) [n:127.0.0.1:65369_ c:control_collection s:shard1 r:core_node1 x:collection1] o.a.s.c.SyncStrategy http://127.0.0.1:65369/collection1/ has no replicas
    [junit4] 2> 263799 INFO (OverseerStateUpdate-96077329513316358-127.0.0.1:65369_-n_0000000000) [n:127.0.0.1:65369_ ] o.a.s.c.Overseer processMessage: queueSize: 1, message = {
    [junit4] 2> "operation":"leader",
    [junit4] 2> "shard":"shard1",
    [junit4] 2> "collection":"control_collection"} current state version: 1
    [junit4] 2> 263800 INFO (coreZkRegister-711-thread-1-processing-n:127.0.0.1:65369_ x:collection1 s:shard1 c:control_collection r:core_node1) [n:127.0.0.1:65369_ c:control_collection s:shard1 r:core_node1 x:collection1] o.a.s.c.c.SolrZkClient makePath: /collections/control_collection/leaders/shard1
    [junit4] 2> 263806 INFO (coreZkRegister-711-thread-1-processing-n:127.0.0.1:65369_ x:collection1 s:shard1 c:control_collection r:core_node1) [n:127.0.0.1:65369_ c:control_collection s:shard1 r:core_node1 x:collection1] o.a.s.c.ShardLeaderElectionContextBase Creating leader registration node /collections/control_collection/leaders/shard1/leader after winning as /collections/control_collection/leader_elect/shard1/election/96077329513316358-core_node1-n_0000000000
    [junit4] 2> 263809 INFO (coreZkRegister-711-thread-1-processing-n:127.0.0.1:65369_ x:collection1 s:shard1 c:control_collection r:core_node1) [n:127.0.0.1:65369_ c:control_collection s:shard1 r:core_node1 x:collection1] o.a.s.c.ShardLeaderElectionContext I am the new leader: http://127.0.0.1:65369/collection1/ shard1
    [junit4] 2> 263811 INFO (OverseerStateUpdate-96077329513316358-127.0.0.1:65369_-n_0000000000) [n:127.0.0.1:65369_ ] o.a.s.c.Overseer processMessage: queueSize: 1, message = {
    [junit4] 2> "operation":"leader",
    [junit4] 2> "shard":"shard1",
    [junit4] 2> "collection":"control_collection",
    [junit4] 2> "base_url":"http://127.0.0.1:65369",
    [junit4] 2> "core":"collection1",
    [junit4] 2> "state":"active"} current state version: 1
    [junit4] 2> 263916 INFO (zkCallback-257-thread-2-processing-n:127.0.0.1:65369_) [n:127.0.0.1:65369_ ] o.a.s.c.c.ZkStateReader A cluster state change: [WatchedEvent state:SyncConnected type:NodeDataChanged path:/clusterstate.json], has occurred - updating... (live nodes size: [1])
    [junit4] 2> 263964 INFO (coreZkRegister-711-thread-1-processing-n:127.0.0.1:65369_ x:collection1 s:shard1 c:control_collection r:core_node1) [n:127.0.0.1:65369_ c:control_collection s:shard1 r:core_node1 x:collection1] o.a.s.c.ZkController We are http://127.0.0.1:65369/collection1/ and leader is http://127.0.0.1:65369/collection1/
    [junit4] 2> 263965 INFO (coreZkRegister-711-thread-1-processing-n:127.0.0.1:65369_ x:collection1 s:shard1 c:control_collection r:core_node1) [n:127.0.0.1:65369_ c:control_collection s:shard1 r:core_node1 x:collection1] o.a.s.c.ZkController No LogReplay needed for core=collection1 baseURL=http://127.0.0.1:65369
    [junit4] 2> 263965 INFO (coreZkRegister-711-thread-1-processing-n:127.0.0.1:65369_ x:collection1 s:shard1 c:control_collection r:core_node1) [n:127.0.0.1:65369_ c:control_collection s:shard1 r:core_node1 x:collection1] o.a.s.c.ZkController I am the leader, no recovery necessary
    [junit4] 2> 263965 INFO (coreZkRegister-711-thread-1-processing-n:127.0.0.1:65369_ x:collection1 s:shard1 c:control_collection r:core_node1) [n:127.0.0.1:65369_ c:control_collection s:shard1 r:core_node1 x:collection1] o.a.s.c.ZkController publishing state=active
    [junit4] 2> 263965 INFO (coreZkRegister-711-thread-1-processing-n:127.0.0.1:65369_ x:collection1 s:shard1 c:control_collection r:core_node1) [n:127.0.0.1:65369_ c:control_collection s:shard1 r:core_node1 x:collection1] o.a.s.c.ZkController numShards not found on descriptor - reading it from system property
    [junit4] 2> 263968 INFO (OverseerStateUpdate-96077329513316358-127.0.0.1:65369_-n_0000000000) [n:127.0.0.1:65369_ ] o.a.s.c.Overseer processMessage: queueSize: 1, message = {
    [junit4] 2> "core":"collection1",
    [junit4] 2> "core_node_name":"core_node1",
    [junit4] 2> "roles":null,
    [junit4] 2> "base_url":"http://127.0.0.1:65369",
    [junit4] 2> "node_name":"127.0.0.1:65369_",
    [junit4] 2> "numShards":"1",
    [junit4] 2> "state":"active",
    [junit4] 2> "shard":"shard1",
    [junit4] 2> "collection":"control_collection",
    [junit4] 2> "operation":"state"} current state version: 2
    [junit4] 2> 263968 INFO (OverseerStateUpdate-96077329513316358-127.0.0.1:65369_-n_0000000000) [n:127.0.0.1:6536

[...truncated too long message...]

   [junit4] > at java.util.concurrent.ThreadPoolExecutor$Worker.run(ThreadPoolExecutor.java:617)
    [junit4] > at java.lang.Thread.run(Thread.java:745)
    [junit4] > 3) Thread[id=1936, name=zkCallback-295-thread-4, state=TIMED_WAITING, group=TGRP-CollectionsAPIDistributedZkTest]
    [junit4] > at sun.misc.Unsafe.park(Native Method)
    [junit4] > at java.util.concurrent.locks.LockSupport.parkNanos(LockSupport.java:215)
    [junit4] > at java.util.concurrent.SynchronousQueue$TransferStack.awaitFulfill(SynchronousQueue.java:460)
    [junit4] > at java.util.concurrent.SynchronousQueue$TransferStack.transfer(SynchronousQueue.java:362)
    [junit4] > at java.util.concurrent.SynchronousQueue.poll(SynchronousQueue.java:941)
    [junit4] > at java.util.concurrent.ThreadPoolExecutor.getTask(ThreadPoolExecutor.java:1066)
    [junit4] > at java.util.concurrent.ThreadPoolExecutor.runWorker(ThreadPoolExecutor.java:1127)
    [junit4] > at java.util.concurrent.ThreadPoolExecutor$Worker.run(ThreadPoolExecutor.java:617)
    [junit4] > at java.lang.Thread.run(Thread.java:745)
    [junit4] > 4) Thread[id=1877, name=TEST-CollectionsAPIDistributedZkTest.test-seed#[83754146B95FE8AA]-EventThread, state=WAITING, group=TGRP-CollectionsAPIDistributedZkTest]
    [junit4] > at sun.misc.Unsafe.park(Native Method)
    [junit4] > at java.util.concurrent.locks.LockSupport.park(LockSupport.java:175)
    [junit4] > at java.util.concurrent.locks.AbstractQueuedSynchronizer$ConditionObject.await(AbstractQueuedSynchronizer.java:2039)
    [junit4] > at java.util.concurrent.LinkedBlockingQueue.take(LinkedBlockingQueue.java:442)
    [junit4] > at org.apache.zookeeper.ClientCnxn$EventThread.run(ClientCnxn.java:494)
    [junit4] > 5) Thread[id=1894, name=zkCallback-295-thread-2, state=TIMED_WAITING, group=TGRP-CollectionsAPIDistributedZkTest]
    [junit4] > at sun.misc.Unsafe.park(Native Method)
    [junit4] > at java.util.concurrent.locks.LockSupport.parkNanos(LockSupport.java:215)
    [junit4] > at java.util.concurrent.SynchronousQueue$TransferStack.awaitFulfill(SynchronousQueue.java:460)
    [junit4] > at java.util.concurrent.SynchronousQueue$TransferStack.transfer(SynchronousQueue.java:362)
    [junit4] > at java.util.concurrent.SynchronousQueue.poll(SynchronousQueue.java:941)
    [junit4] > at java.util.concurrent.ThreadPoolExecutor.getTask(ThreadPoolExecutor.java:1066)
    [junit4] > at java.util.concurrent.ThreadPoolExecutor.runWorker(ThreadPoolExecutor.java:1127)
    [junit4] > at java.util.concurrent.ThreadPoolExecutor$Worker.run(ThreadPoolExecutor.java:617)
    [junit4] > at java.lang.Thread.run(Thread.java:745)
    [junit4] > 6) Thread[id=1878, name=zkCallback-295-thread-1, state=TIMED_WAITING, group=TGRP-CollectionsAPIDistributedZkTest]
    [junit4] > at sun.misc.Unsafe.park(Native Method)
    [junit4] > at java.util.concurrent.locks.LockSupport.parkNanos(LockSupport.java:215)
    [junit4] > at java.util.concurrent.SynchronousQueue$TransferStack.awaitFulfill(SynchronousQueue.java:460)
    [junit4] > at java.util.concurrent.SynchronousQueue$TransferStack.transfer(SynchronousQueue.java:362)
    [junit4] > at java.util.concurrent.SynchronousQueue.poll(SynchronousQueue.java:941)
    [junit4] > at java.util.concurrent.ThreadPoolExecutor.getTask(ThreadPoolExecutor.java:1066)
    [junit4] > at java.util.concurrent.ThreadPoolExecutor.runWorker(ThreadPoolExecutor.java:1127)
    [junit4] > at java.util.concurrent.ThreadPoolExecutor$Worker.run(ThreadPoolExecutor.java:617)
    [junit4] > at java.lang.Thread.run(Thread.java:745)
    [junit4] > at __randomizedtesting.SeedInfo.seed([83754146B95FE8AA]:0)Throwable #2: com.carrotsearch.randomizedtesting.ThreadLeakError: There are still zombie threads that couldn't be terminated:
    [junit4] > 1) Thread[id=1876, name=TEST-CollectionsAPIDistributedZkTest.test-seed#[83754146B95FE8AA]-SendThread(127.0.0.1:65364), state=TIMED_WAITING, group=TGRP-CollectionsAPIDistributedZkTest]
    [junit4] > at java.lang.Thread.sleep(Native Method)
    [junit4] > at org.apache.zookeeper.ClientCnxn$SendThread.run(ClientCnxn.java:994)
    [junit4] > 2) Thread[id=1935, name=zkCallback-295-thread-3, state=TIMED_WAITING, group=TGRP-CollectionsAPIDistributedZkTest]
    [junit4] > at sun.misc.Unsafe.park(Native Method)
    [junit4] > at java.util.concurrent.locks.LockSupport.parkNanos(LockSupport.java:215)
    [junit4] > at java.util.concurrent.SynchronousQueue$TransferStack.awaitFulfill(SynchronousQueue.java:460)
    [junit4] > at java.util.concurrent.SynchronousQueue$TransferStack.transfer(SynchronousQueue.java:362)
    [junit4] > at java.util.concurrent.SynchronousQueue.poll(SynchronousQueue.java:941)
    [junit4] > at java.util.concurrent.ThreadPoolExecutor.getTask(ThreadPoolExecutor.java:1066)
    [junit4] > at java.util.concurrent.ThreadPoolExecutor.runWorker(ThreadPoolExecutor.java:1127)
    [junit4] > at java.util.concurrent.ThreadPoolExecutor$Worker.run(ThreadPoolExecutor.java:617)
    [junit4] > at java.lang.Thread.run(Thread.java:745)
    [junit4] > 3) Thread[id=1936, name=zkCallback-295-thread-4, state=TIMED_WAITING, group=TGRP-CollectionsAPIDistributedZkTest]
    [junit4] > at sun.misc.Unsafe.park(Native Method)
    [junit4] > at java.util.concurrent.locks.LockSupport.parkNanos(LockSupport.java:215)
    [junit4] > at java.util.concurrent.SynchronousQueue$TransferStack.awaitFulfill(SynchronousQueue.java:460)
    [junit4] > at java.util.concurrent.SynchronousQueue$TransferStack.transfer(SynchronousQueue.java:362)
    [junit4] > at java.util.concurrent.SynchronousQueue.poll(SynchronousQueue.java:941)
    [junit4] > at java.util.concurrent.ThreadPoolExecutor.getTask(ThreadPoolExecutor.java:1066)
    [junit4] > at java.util.concurrent.ThreadPoolExecutor.runWorker(ThreadPoolExecutor.java:1127)
    [junit4] > at java.util.concurrent.ThreadPoolExecutor$Worker.run(ThreadPoolExecutor.java:617)
    [junit4] > at java.lang.Thread.run(Thread.java:745)
    [junit4] > 4) Thread[id=1894, name=zkCallback-295-thread-2, state=TIMED_WAITING, group=TGRP-CollectionsAPIDistributedZkTest]
    [junit4] > at sun.misc.Unsafe.park(Native Method)
    [junit4] > at java.util.concurrent.locks.LockSupport.parkNanos(LockSupport.java:215)
    [junit4] > at java.util.concurrent.SynchronousQueue$TransferStack.awaitFulfill(SynchronousQueue.java:460)
    [junit4] > at java.util.concurrent.SynchronousQueue$TransferStack.transfer(SynchronousQueue.java:362)
    [junit4] > at java.util.concurrent.SynchronousQueue.poll(SynchronousQueue.java:941)
    [junit4] > at java.util.concurrent.ThreadPoolExecutor.getTask(ThreadPoolExecutor.java:1066)
    [junit4] > at java.util.concurrent.ThreadPoolExecutor.runWorker(ThreadPoolExecutor.java:1127)
    [junit4] > at java.util.concurrent.ThreadPoolExecutor$Worker.run(ThreadPoolExecutor.java:617)
    [junit4] > at java.lang.Thread.run(Thread.java:745)
    [junit4] > 5) Thread[id=1878, name=zkCallback-295-thread-1, state=TIMED_WAITING, group=TGRP-CollectionsAPIDistributedZkTest]
    [junit4] > at sun.misc.Unsafe.park(Native Method)
    [junit4] > at java.util.concurrent.locks.LockSupport.parkNanos(LockSupport.java:215)
    [junit4] > at java.util.concurrent.SynchronousQueue$TransferStack.awaitFulfill(SynchronousQueue.java:460)
    [junit4] > at java.util.concurrent.SynchronousQueue$TransferStack.transfer(SynchronousQueue.java:362)
    [junit4] > at java.util.concurrent.SynchronousQueue.poll(SynchronousQueue.java:941)
    [junit4] > at java.util.concurrent.ThreadPoolExecutor.getTask(ThreadPoolExecutor.java:1066)
    [junit4] > at java.util.concurrent.ThreadPoolExecutor.runWorker(ThreadPoolExecutor.java:1127)
    [junit4] > at java.util.concurrent.ThreadPoolExecutor$Worker.run(ThreadPoolExecutor.java:617)
    [junit4] > at java.lang.Thread.run(Thread.java:745)
    [junit4] > at __randomizedtesting.SeedInfo.seed([83754146B95FE8AA]:0)
    [junit4] Completed [30/615 (1!)] on J1 in 105.19s, 1 test, 3 errors <<< FAILURES!

[...truncated 1841 lines...]
BUILD FAILED
/Users/jenkins/workspace/Lucene-Solr-6.x-MacOSX/build.xml:740: The following error occurred while executing this line:
/Users/jenkins/workspace/Lucene-Solr-6.x-MacOSX/build.xml:684: The following error occurred while executing this line:
/Users/jenkins/workspace/Lucene-Solr-6.x-MacOSX/build.xml:59: The following error occurred while executing this line:
/Users/jenkins/workspace/Lucene-Solr-6.x-MacOSX/solr/build.xml:233: The following error occurred while executing this line:
/Users/jenkins/workspace/Lucene-Solr-6.x-MacOSX/solr/common-build.xml:531: The following error occurred while executing this line:
/Users/jenkins/workspace/Lucene-Solr-6.x-MacOSX/lucene/common-build.xml:1427: The following error occurred while executing this line:
/Users/jenkins/workspace/Lucene-Solr-6.x-MacOSX/lucene/common-build.xml:984: There were test failures: 615 suites (10 ignored), 2591 tests, 2 suite-level errors, 1 error, 1852 ignored (63 assumptions) [seed: 83754146B95FE8AA]

Total time: 50 minutes 47 seconds
Build step 'Invoke Ant' marked build as failure
Archiving artifacts
[WARNINGS] Skipping publisher since build result is FAILURE
Recording test results
Email was triggered for: Failure - Any
Sending email for trigger: Failure - Any

Search Discussions

Related Discussions

Discussion Navigation
viewthread | post
posts ‹ prev | 1 of 1 | next ›
Discussion Overview
groupdev @
categorieslucene
postedJun 15, '16 at 9:12p
activeJun 15, '16 at 9:12p
posts1
users1
websitelucene.apache.org

1 user in discussion

Policeman Jenkins Server: 1 post

People

Translate

site design / logo © 2017 Grokbase