Grokbase Groups Lucene dev June 2016
FAQ
Build: http://jenkins.thetaphi.de/job/Lucene-Solr-6.1-Linux/38/
Java: 64bit/jdk1.8.0_92 -XX:-UseCompressedOops -XX:+UseConcMarkSweepGC

2 tests failed.
FAILED: junit.framework.TestSuite.org.apache.solr.security.BasicAuthIntegrationTest

Error Message:
Suite timeout exceeded (>= 7200000 msec).

Stack Trace:
java.lang.Exception: Suite timeout exceeded (>= 7200000 msec).
  at __randomizedtesting.SeedInfo.seed([3A33EBC4B9611095]:0)


FAILED: org.apache.solr.security.BasicAuthIntegrationTest.testBasics

Error Message:
Test abandoned because suite timeout was reached.

Stack Trace:
java.lang.Exception: Test abandoned because suite timeout was reached.
  at __randomizedtesting.SeedInfo.seed([3A33EBC4B9611095]:0)




Build Log:
[...truncated 12628 lines...]
    [junit4] Suite: org.apache.solr.security.BasicAuthIntegrationTest
    [junit4] 2> 1006362 INFO (TEST-BasicAuthIntegrationTest.testBasics-seed#[3A33EBC4B9611095]) [ ] o.a.s.c.ZkTestServer STARTING ZK TEST SERVER
    [junit4] 2> 1006363 INFO (Thread-2950) [ ] o.a.s.c.ZkTestServer client port:0.0.0.0/0.0.0.0:0
    [junit4] 2> 1006363 INFO (Thread-2950) [ ] o.a.s.c.ZkTestServer Starting server
    [junit4] 2> 1006463 INFO (TEST-BasicAuthIntegrationTest.testBasics-seed#[3A33EBC4B9611095]) [ ] o.a.s.c.ZkTestServer start zk server on port:41339
    [junit4] 2> 1006463 INFO (TEST-BasicAuthIntegrationTest.testBasics-seed#[3A33EBC4B9611095]) [ ] o.a.s.c.c.SolrZkClient Using default ZkCredentialsProvider
    [junit4] 2> 1006463 INFO (TEST-BasicAuthIntegrationTest.testBasics-seed#[3A33EBC4B9611095]) [ ] o.a.s.c.c.ConnectionManager Waiting for client to connect to ZooKeeper
    [junit4] 2> 1006488 INFO (zkCallback-23110-thread-1) [ ] o.a.s.c.c.ConnectionManager Watcher org.apache.solr.common.cloud.ConnectionManager@692d60c6 name:ZooKeeperConnection Watcher:127.0.0.1:41339 got event WatchedEvent state:SyncConnected type:None path:null path:null type:None
    [junit4] 2> 1006488 INFO (TEST-BasicAuthIntegrationTest.testBasics-seed#[3A33EBC4B9611095]) [ ] o.a.s.c.c.ConnectionManager Client is connected to ZooKeeper
    [junit4] 2> 1006488 INFO (TEST-BasicAuthIntegrationTest.testBasics-seed#[3A33EBC4B9611095]) [ ] o.a.s.c.c.SolrZkClient Using default ZkACLProvider
    [junit4] 2> 1006488 INFO (TEST-BasicAuthIntegrationTest.testBasics-seed#[3A33EBC4B9611095]) [ ] o.a.s.c.c.SolrZkClient makePath: /solr/solr.xml
    [junit4] 2> 1006496 INFO (jetty-launcher-23109-thread-2) [ ] o.e.j.s.Server jetty-9.3.8.v20160314
    [junit4] 2> 1006496 INFO (jetty-launcher-23109-thread-3) [ ] o.e.j.s.Server jetty-9.3.8.v20160314
    [junit4] 2> 1006496 INFO (jetty-launcher-23109-thread-1) [ ] o.e.j.s.Server jetty-9.3.8.v20160314
    [junit4] 2> 1006496 INFO (jetty-launcher-23109-thread-4) [ ] o.e.j.s.Server jetty-9.3.8.v20160314
    [junit4] 2> 1006496 INFO (jetty-launcher-23109-thread-5) [ ] o.e.j.s.Server jetty-9.3.8.v20160314
    [junit4] 2> 1006498 INFO (jetty-launcher-23109-thread-1) [ ] o.e.j.s.h.ContextHandler Started o.e.j.s.ServletContextHandler@385ede05{/solr,null,AVAILABLE}
    [junit4] 2> 1006498 INFO (jetty-launcher-23109-thread-5) [ ] o.e.j.s.h.ContextHandler Started o.e.j.s.ServletContextHandler@2622047f{/solr,null,AVAILABLE}
    [junit4] 2> 1006498 INFO (jetty-launcher-23109-thread-3) [ ] o.e.j.s.h.ContextHandler Started o.e.j.s.ServletContextHandler@633d97b{/solr,null,AVAILABLE}
    [junit4] 2> 1006498 INFO (jetty-launcher-23109-thread-2) [ ] o.e.j.s.h.ContextHandler Started o.e.j.s.ServletContextHandler@59f1fca{/solr,null,AVAILABLE}
    [junit4] 2> 1006498 INFO (jetty-launcher-23109-thread-4) [ ] o.e.j.s.h.ContextHandler Started o.e.j.s.ServletContextHandler@7da72220{/solr,null,AVAILABLE}
    [junit4] 2> 1006498 INFO (jetty-launcher-23109-thread-1) [ ] o.e.j.s.ServerConnector Started ServerConnector@1a5157f2{HTTP/1.1,[http/1.1]}{127.0.0.1:42635}
    [junit4] 2> 1006499 INFO (jetty-launcher-23109-thread-1) [ ] o.e.j.s.Server Started @1008528ms
    [junit4] 2> 1006499 INFO (jetty-launcher-23109-thread-2) [ ] o.e.j.s.ServerConnector Started ServerConnector@5df08126{HTTP/1.1,[http/1.1]}{127.0.0.1:35480}
    [junit4] 2> 1006499 INFO (jetty-launcher-23109-thread-1) [ ] o.a.s.c.s.e.JettySolrRunner Jetty properties: {hostContext=/solr, hostPort=42635}
    [junit4] 2> 1006500 INFO (jetty-launcher-23109-thread-2) [ ] o.e.j.s.Server Started @1008529ms
    [junit4] 2> 1006500 INFO (jetty-launcher-23109-thread-5) [ ] o.e.j.s.ServerConnector Started ServerConnector@5aabc29f{HTTP/1.1,[http/1.1]}{127.0.0.1:39256}
    [junit4] 2> 1006500 INFO (jetty-launcher-23109-thread-4) [ ] o.e.j.s.ServerConnector Started ServerConnector@4c2ec8{HTTP/1.1,[http/1.1]}{127.0.0.1:41466}
    [junit4] 2> 1006500 INFO (jetty-launcher-23109-thread-5) [ ] o.e.j.s.Server Started @1008529ms
    [junit4] 2> 1006499 INFO (jetty-launcher-23109-thread-3) [ ] o.e.j.s.ServerConnector Started ServerConnector@33600529{HTTP/1.1,[http/1.1]}{127.0.0.1:36028}
    [junit4] 2> 1006501 INFO (jetty-launcher-23109-thread-1) [ ] o.a.s.s.SolrDispatchFilter SolrDispatchFilter.init(): sun.misc.Launcher$AppClassLoader@73d16e93
    [junit4] 2> 1006501 INFO (jetty-launcher-23109-thread-3) [ ] o.e.j.s.Server Started @1008530ms
    [junit4] 2> 1006501 INFO (jetty-launcher-23109-thread-1) [ ] o.a.s.c.SolrResourceLoader new SolrResourceLoader for directory: '/home/jenkins/workspace/Lucene-Solr-6.1-Linux/solr/build/solr-core/test/J0/temp/solr.security.BasicAuthIntegrationTest_3A33EBC4B9611095-001/tempDir-001/node1'
    [junit4] 2> 1006501 INFO (jetty-launcher-23109-thread-3) [ ] o.a.s.c.s.e.JettySolrRunner Jetty properties: {hostContext=/solr, hostPort=36028}
    [junit4] 2> 1006501 INFO (jetty-launcher-23109-thread-5) [ ] o.a.s.c.s.e.JettySolrRunner Jetty properties: {hostContext=/solr, hostPort=39256}
    [junit4] 2> 1006501 INFO (jetty-launcher-23109-thread-1) [ ] o.a.s.c.SolrResourceLoader JNDI not configured for solr (NoInitialContextEx)
    [junit4] 2> 1006501 INFO (jetty-launcher-23109-thread-3) [ ] o.a.s.s.SolrDispatchFilter SolrDispatchFilter.init(): sun.misc.Launcher$AppClassLoader@73d16e93
    [junit4] 2> 1006501 INFO (jetty-launcher-23109-thread-1) [ ] o.a.s.c.SolrResourceLoader solr home defaulted to 'solr/' (could not find system property or JNDI)
    [junit4] 2> 1006501 INFO (jetty-launcher-23109-thread-5) [ ] o.a.s.s.SolrDispatchFilter SolrDispatchFilter.init(): sun.misc.Launcher$AppClassLoader@73d16e93
    [junit4] 2> 1006500 INFO (jetty-launcher-23109-thread-4) [ ] o.e.j.s.Server Started @1008529ms
    [junit4] 2> 1006501 INFO (jetty-launcher-23109-thread-5) [ ] o.a.s.c.SolrResourceLoader new SolrResourceLoader for directory: '/home/jenkins/workspace/Lucene-Solr-6.1-Linux/solr/build/solr-core/test/J0/temp/solr.security.BasicAuthIntegrationTest_3A33EBC4B9611095-001/tempDir-001/node5'
    [junit4] 2> 1006500 INFO (jetty-launcher-23109-thread-2) [ ] o.a.s.c.s.e.JettySolrRunner Jetty properties: {hostContext=/solr, hostPort=35480}
    [junit4] 2> 1006501 INFO (jetty-launcher-23109-thread-1) [ ] o.a.s.c.c.SolrZkClient Using default ZkCredentialsProvider
    [junit4] 2> 1006501 INFO (jetty-launcher-23109-thread-4) [ ] o.a.s.c.s.e.JettySolrRunner Jetty properties: {hostContext=/solr, hostPort=41466}
    [junit4] 2> 1006501 INFO (jetty-launcher-23109-thread-2) [ ] o.a.s.s.SolrDispatchFilter SolrDispatchFilter.init(): sun.misc.Launcher$AppClassLoader@73d16e93
    [junit4] 2> 1006501 INFO (jetty-launcher-23109-thread-3) [ ] o.a.s.c.SolrResourceLoader new SolrResourceLoader for directory: '/home/jenkins/workspace/Lucene-Solr-6.1-Linux/solr/build/solr-core/test/J0/temp/solr.security.BasicAuthIntegrationTest_3A33EBC4B9611095-001/tempDir-001/node3'
    [junit4] 2> 1006502 INFO (jetty-launcher-23109-thread-4) [ ] o.a.s.s.SolrDispatchFilter SolrDispatchFilter.init(): sun.misc.Launcher$AppClassLoader@73d16e93
    [junit4] 2> 1006501 INFO (jetty-launcher-23109-thread-2) [ ] o.a.s.c.SolrResourceLoader new SolrResourceLoader for directory: '/home/jenkins/workspace/Lucene-Solr-6.1-Linux/solr/build/solr-core/test/J0/temp/solr.security.BasicAuthIntegrationTest_3A33EBC4B9611095-001/tempDir-001/node2'
    [junit4] 2> 1006502 INFO (jetty-launcher-23109-thread-3) [ ] o.a.s.c.SolrResourceLoader JNDI not configured for solr (NoInitialContextEx)
    [junit4] 2> 1006501 INFO (jetty-launcher-23109-thread-5) [ ] o.a.s.c.SolrResourceLoader JNDI not configured for solr (NoInitialContextEx)
    [junit4] 2> 1006502 INFO (jetty-launcher-23109-thread-2) [ ] o.a.s.c.SolrResourceLoader JNDI not configured for solr (NoInitialContextEx)
    [junit4] 2> 1006502 INFO (jetty-launcher-23109-thread-3) [ ] o.a.s.c.SolrResourceLoader solr home defaulted to 'solr/' (could not find system property or JNDI)
    [junit4] 2> 1006502 INFO (jetty-launcher-23109-thread-2) [ ] o.a.s.c.SolrResourceLoader solr home defaulted to 'solr/' (could not find system property or JNDI)
    [junit4] 2> 1006502 INFO (jetty-launcher-23109-thread-4) [ ] o.a.s.c.SolrResourceLoader new SolrResourceLoader for directory: '/home/jenkins/workspace/Lucene-Solr-6.1-Linux/solr/build/solr-core/test/J0/temp/solr.security.BasicAuthIntegrationTest_3A33EBC4B9611095-001/tempDir-001/node4'
    [junit4] 2> 1006502 INFO (jetty-launcher-23109-thread-1) [ ] o.a.s.c.c.ConnectionManager Waiting for client to connect to ZooKeeper
    [junit4] 2> 1006502 INFO (jetty-launcher-23109-thread-3) [ ] o.a.s.c.c.SolrZkClient Using default ZkCredentialsProvider
    [junit4] 2> 1006502 INFO (jetty-launcher-23109-thread-4) [ ] o.a.s.c.SolrResourceLoader JNDI not configured for solr (NoInitialContextEx)
    [junit4] 2> 1006502 INFO (jetty-launcher-23109-thread-2) [ ] o.a.s.c.c.SolrZkClient Using default ZkCredentialsProvider
    [junit4] 2> 1006502 INFO (jetty-launcher-23109-thread-4) [ ] o.a.s.c.SolrResourceLoader solr home defaulted to 'solr/' (could not find system property or JNDI)
    [junit4] 2> 1006502 INFO (jetty-launcher-23109-thread-5) [ ] o.a.s.c.SolrResourceLoader solr home defaulted to 'solr/' (could not find system property or JNDI)
    [junit4] 2> 1006502 INFO (jetty-launcher-23109-thread-3) [ ] o.a.s.c.c.ConnectionManager Waiting for client to connect to ZooKeeper
    [junit4] 2> 1006502 INFO (jetty-launcher-23109-thread-4) [ ] o.a.s.c.c.SolrZkClient Using default ZkCredentialsProvider
    [junit4] 2> 1006502 INFO (jetty-launcher-23109-thread-2) [ ] o.a.s.c.c.ConnectionManager Waiting for client to connect to ZooKeeper
    [junit4] 2> 1006502 INFO (jetty-launcher-23109-thread-5) [ ] o.a.s.c.c.SolrZkClient Using default ZkCredentialsProvider
    [junit4] 2> 1006503 INFO (jetty-launcher-23109-thread-4) [ ] o.a.s.c.c.ConnectionManager Waiting for client to connect to ZooKeeper
    [junit4] 2> 1006503 INFO (jetty-launcher-23109-thread-5) [ ] o.a.s.c.c.ConnectionManager Waiting for client to connect to ZooKeeper
    [junit4] 2> 1006504 INFO (zkCallback-23111-thread-1) [ ] o.a.s.c.c.ConnectionManager Watcher org.apache.solr.common.cloud.ConnectionManager@6f98579f name:ZooKeeperConnection Watcher:127.0.0.1:41339/solr got event WatchedEvent state:SyncConnected type:None path:null path:null type:None
    [junit4] 2> 1006504 INFO (jetty-launcher-23109-thread-1) [ ] o.a.s.c.c.ConnectionManager Client is connected to ZooKeeper
    [junit4] 2> 1006504 INFO (zkCallback-23112-thread-1) [ ] o.a.s.c.c.ConnectionManager Watcher org.apache.solr.common.cloud.ConnectionManager@640c7be name:ZooKeeperConnection Watcher:127.0.0.1:41339/solr got event WatchedEvent state:SyncConnected type:None path:null path:null type:None
    [junit4] 2> 1006504 INFO (jetty-launcher-23109-thread-3) [ ] o.a.s.c.c.ConnectionManager Client is connected to ZooKeeper
    [junit4] 2> 1006504 INFO (jetty-launcher-23109-thread-1) [ ] o.a.s.c.c.SolrZkClient Using default ZkACLProvider
    [junit4] 2> 1006505 INFO (jetty-launcher-23109-thread-3) [ ] o.a.s.c.c.SolrZkClient Using default ZkACLProvider
    [junit4] 2> 1006506 INFO (zkCallback-23113-thread-1) [ ] o.a.s.c.c.ConnectionManager Watcher org.apache.solr.common.cloud.ConnectionManager@27f15c07 name:ZooKeeperConnection Watcher:127.0.0.1:41339/solr got event WatchedEvent state:SyncConnected type:None path:null path:null type:None
    [junit4] 2> 1006506 INFO (jetty-launcher-23109-thread-1) [ ] o.a.s.s.SolrDispatchFilter solr.xml found in ZooKeeper. Loading...
    [junit4] 2> 1006506 INFO (jetty-launcher-23109-thread-3) [ ] o.a.s.s.SolrDispatchFilter solr.xml found in ZooKeeper. Loading...
    [junit4] 2> 1006506 INFO (zkCallback-23115-thread-1) [ ] o.a.s.c.c.ConnectionManager Watcher org.apache.solr.common.cloud.ConnectionManager@452f48f5 name:ZooKeeperConnection Watcher:127.0.0.1:41339/solr got event WatchedEvent state:SyncConnected type:None path:null path:null type:None
    [junit4] 2> 1006506 INFO (jetty-launcher-23109-thread-5) [ ] o.a.s.c.c.ConnectionManager Client is connected to ZooKeeper
    [junit4] 2> 1006506 INFO (jetty-launcher-23109-thread-2) [ ] o.a.s.c.c.ConnectionManager Client is connected to ZooKeeper
    [junit4] 2> 1006506 INFO (zkCallback-23114-thread-1) [ ] o.a.s.c.c.ConnectionManager Watcher org.apache.solr.common.cloud.ConnectionManager@34811e29 name:ZooKeeperConnection Watcher:127.0.0.1:41339/solr got event WatchedEvent state:SyncConnected type:None path:null path:null type:None
    [junit4] 2> 1006506 INFO (jetty-launcher-23109-thread-5) [ ] o.a.s.c.c.SolrZkClient Using default ZkACLProvider
    [junit4] 2> 1006506 INFO (jetty-launcher-23109-thread-2) [ ] o.a.s.c.c.SolrZkClient Using default ZkACLProvider
    [junit4] 2> 1006506 INFO (jetty-launcher-23109-thread-4) [ ] o.a.s.c.c.ConnectionManager Client is connected to ZooKeeper
    [junit4] 2> 1006506 INFO (jetty-launcher-23109-thread-5) [ ] o.a.s.s.SolrDispatchFilter solr.xml found in ZooKeeper. Loading...
    [junit4] 2> 1006506 INFO (jetty-launcher-23109-thread-4) [ ] o.a.s.c.c.SolrZkClient Using default ZkACLProvider
    [junit4] 2> 1006506 INFO (jetty-launcher-23109-thread-2) [ ] o.a.s.s.SolrDispatchFilter solr.xml found in ZooKeeper. Loading...
    [junit4] 2> 1006507 INFO (jetty-launcher-23109-thread-4) [ ] o.a.s.s.SolrDispatchFilter solr.xml found in ZooKeeper. Loading...
    [junit4] 2> 1006512 INFO (jetty-launcher-23109-thread-3) [ ] o.a.s.c.CorePropertiesLocator Config-defined core root directory: /home/jenkins/workspace/Lucene-Solr-6.1-Linux/solr/build/solr-core/test/J0/temp/solr.security.BasicAuthIntegrationTest_3A33EBC4B9611095-001/tempDir-001/node3/.
    [junit4] 2> 1006512 INFO (jetty-launcher-23109-thread-4) [ ] o.a.s.c.CorePropertiesLocator Config-defined core root directory: /home/jenkins/workspace/Lucene-Solr-6.1-Linux/solr/build/solr-core/test/J0/temp/solr.security.BasicAuthIntegrationTest_3A33EBC4B9611095-001/tempDir-001/node4/.
    [junit4] 2> 1006512 INFO (jetty-launcher-23109-thread-3) [ ] o.a.s.c.CoreContainer New CoreContainer 1284115114
    [junit4] 2> 1006512 INFO (jetty-launcher-23109-thread-4) [ ] o.a.s.c.CoreContainer New CoreContainer 1896874330
    [junit4] 2> 1006512 INFO (jetty-launcher-23109-thread-3) [ ] o.a.s.c.CoreContainer Loading cores into CoreContainer [instanceDir=/home/jenkins/workspace/Lucene-Solr-6.1-Linux/solr/build/solr-core/test/J0/temp/solr.security.BasicAuthIntegrationTest_3A33EBC4B9611095-001/tempDir-001/node3]
    [junit4] 2> 1006512 INFO (jetty-launcher-23109-thread-4) [ ] o.a.s.c.CoreContainer Loading cores into CoreContainer [instanceDir=/home/jenkins/workspace/Lucene-Solr-6.1-Linux/solr/build/solr-core/test/J0/temp/solr.security.BasicAuthIntegrationTest_3A33EBC4B9611095-001/tempDir-001/node4]
    [junit4] 2> 1006512 WARN (NIOServerCxn.Factory:0.0.0.0/0.0.0.0:0) [ ] o.a.z.s.NIOServerCnxn caught end of stream exception
    [junit4] 2> EndOfStreamException: Unable to read additional data from client sessionid 0x15552e37df20005, likely client has closed socket
    [junit4] 2> at org.apache.zookeeper.server.NIOServerCnxn.doIO(NIOServerCnxn.java:228)
    [junit4] 2> at org.apache.zookeeper.server.NIOServerCnxnFactory.run(NIOServerCnxnFactory.java:208)
    [junit4] 2> at java.lang.Thread.run(Thread.java:745)
    [junit4] 2> 1006512 WARN (jetty-launcher-23109-thread-4) [ ] o.a.s.c.CoreContainer Couldn't add files from /home/jenkins/workspace/Lucene-Solr-6.1-Linux/solr/build/solr-core/test/J0/temp/solr.security.BasicAuthIntegrationTest_3A33EBC4B9611095-001/tempDir-001/node4/lib to classpath: /home/jenkins/workspace/Lucene-Solr-6.1-Linux/solr/build/solr-core/test/J0/temp/solr.security.BasicAuthIntegrationTest_3A33EBC4B9611095-001/tempDir-001/node4/lib
    [junit4] 2> 1006512 WARN (jetty-launcher-23109-thread-3) [ ] o.a.s.c.CoreContainer Couldn't add files from /home/jenkins/workspace/Lucene-Solr-6.1-Linux/solr/build/solr-core/test/J0/temp/solr.security.BasicAuthIntegrationTest_3A33EBC4B9611095-001/tempDir-001/node3/lib to classpath: /home/jenkins/workspace/Lucene-Solr-6.1-Linux/solr/build/solr-core/test/J0/temp/solr.security.BasicAuthIntegrationTest_3A33EBC4B9611095-001/tempDir-001/node3/lib
    [junit4] 2> 1006513 INFO (jetty-launcher-23109-thread-4) [ ] o.a.s.h.c.HttpShardHandlerFactory created with socketTimeout : 90000,urlScheme : ,connTimeout : 15000,maxConnectionsPerHost : 20,maxConnections : 10000,corePoolSize : 0,maximumPoolSize : 2147483647,maxThreadIdleTime : 5,sizeOfQueue : -1,fairnessPolicy : false,useRetries : false,
    [junit4] 2> 1006513 INFO (jetty-launcher-23109-thread-3) [ ] o.a.s.h.c.HttpShardHandlerFactory created with socketTimeout : 90000,urlScheme : ,connTimeout : 15000,maxConnectionsPerHost : 20,maxConnections : 10000,corePoolSize : 0,maximumPoolSize : 2147483647,maxThreadIdleTime : 5,sizeOfQueue : -1,fairnessPolicy : false,useRetries : false,
    [junit4] 2> 1006513 INFO (jetty-launcher-23109-thread-1) [ ] o.a.s.c.CorePropertiesLocator Config-defined core root directory: /home/jenkins/workspace/Lucene-Solr-6.1-Linux/solr/build/solr-core/test/J0/temp/solr.security.BasicAuthIntegrationTest_3A33EBC4B9611095-001/tempDir-001/node1/.
    [junit4] 2> 1006513 INFO (jetty-launcher-23109-thread-1) [ ] o.a.s.c.CoreContainer New CoreContainer 1063421554
    [junit4] 2> 1006514 INFO (jetty-launcher-23109-thread-3) [ ] o.a.s.u.UpdateShardHandler Creating UpdateShardHandler HTTP client with params: socketTimeout=340000&connTimeout=45000&retry=true
    [junit4] 2> 1006514 INFO (jetty-launcher-23109-thread-1) [ ] o.a.s.c.CoreContainer Loading cores into CoreContainer [instanceDir=/home/jenkins/workspace/Lucene-Solr-6.1-Linux/solr/build/solr-core/test/J0/temp/solr.security.BasicAuthIntegrationTest_3A33EBC4B9611095-001/tempDir-001/node1]
    [junit4] 2> 1006514 INFO (jetty-launcher-23109-thread-4) [ ] o.a.s.u.UpdateShardHandler Creating UpdateShardHandler HTTP client with params: socketTimeout=340000&connTimeout=45000&retry=true
    [junit4] 2> 1006514 WARN (jetty-launcher-23109-thread-1) [ ] o.a.s.c.CoreContainer Couldn't add files from /home/jenkins/workspace/Lucene-Solr-6.1-Linux/solr/build/solr-core/test/J0/temp/solr.security.BasicAuthIntegrationTest_3A33EBC4B9611095-001/tempDir-001/node1/lib to classpath: /home/jenkins/workspace/Lucene-Solr-6.1-Linux/solr/build/solr-core/test/J0/temp/solr.security.BasicAuthIntegrationTest_3A33EBC4B9611095-001/tempDir-001/node1/lib
    [junit4] 2> 1006514 INFO (jetty-launcher-23109-thread-1) [ ] o.a.s.h.c.HttpShardHandlerFactory created with socketTimeout : 90000,urlScheme : ,connTimeout : 15000,maxConnectionsPerHost : 20,maxConnections : 10000,corePoolSize : 0,maximumPoolSize : 2147483647,maxThreadIdleTime : 5,sizeOfQueue : -1,fairnessPolicy : false,useRetries : false,
    [junit4] 2> 1006514 INFO (jetty-launcher-23109-thread-3) [ ] o.a.s.l.LogWatcher SLF4J impl is org.slf4j.impl.Log4jLoggerFactory
    [junit4] 2> 1006514 INFO (jetty-launcher-23109-thread-3) [ ] o.a.s.l.LogWatcher Registering Log Listener [Log4j (org.slf4j.impl.Log4jLoggerFactory)]
    [junit4] 2> 1006514 INFO (jetty-launcher-23109-thread-4) [ ] o.a.s.l.LogWatcher SLF4J impl is org.slf4j.impl.Log4jLoggerFactory
    [junit4] 2> 1006514 INFO (jetty-launcher-23109-thread-4) [ ] o.a.s.l.LogWatcher Registering Log Listener [Log4j (org.slf4j.impl.Log4jLoggerFactory)]
    [junit4] 2> 1006514 INFO (jetty-launcher-23109-thread-3) [ ] o.a.s.c.ZkContainer Zookeeper client=127.0.0.1:41339/solr
    [junit4] 2> 1006515 INFO (jetty-launcher-23109-thread-4) [ ] o.a.s.c.ZkContainer Zookeeper client=127.0.0.1:41339/solr
    [junit4] 2> 1006515 INFO (jetty-launcher-23109-thread-3) [ ] o.a.s.c.ZkController zkHost includes chroot
    [junit4] 2> 1006515 INFO (jetty-launcher-23109-thread-1) [ ] o.a.s.u.UpdateShardHandler Creating UpdateShardHandler HTTP client with params: socketTimeout=340000&connTimeout=45000&retry=true
    [junit4] 2> 1006515 INFO (jetty-launcher-23109-thread-3) [ ] o.a.s.c.c.SolrZkClient Using default ZkCredentialsProvider
    [junit4] 2> 1006515 INFO (jetty-launcher-23109-thread-5) [ ] o.a.s.c.CorePropertiesLocator Config-defined core root directory: /home/jenkins/workspace/Lucene-Solr-6.1-Linux/solr/build/solr-core/test/J0/temp/solr.security.BasicAuthIntegrationTest_3A33EBC4B9611095-001/tempDir-001/node5/.
    [junit4] 2> 1006515 INFO (jetty-launcher-23109-thread-4) [ ] o.a.s.c.ZkController zkHost includes chroot
    [junit4] 2> 1006516 INFO (jetty-launcher-23109-thread-5) [ ] o.a.s.c.CoreContainer New CoreContainer 1931723690
    [junit4] 2> 1006516 INFO (jetty-launcher-23109-thread-4) [ ] o.a.s.c.c.SolrZkClient Using default ZkCredentialsProvider
    [junit4] 2> 1006516 INFO (jetty-launcher-23109-thread-5) [ ] o.a.s.c.CoreContainer Loading cores into CoreContainer [instanceDir=/home/jenkins/workspace/Lucene-Solr-6.1-Linux/solr/build/solr-core/test/J0/temp/solr.security.BasicAuthIntegrationTest_3A33EBC4B9611095-001/tempDir-001/node5]
    [junit4] 2> 1006515 INFO (jetty-launcher-23109-thread-2) [ ] o.a.s.c.CorePropertiesLocator Config-defined core root directory: /home/jenkins/workspace/Lucene-Solr-6.1-Linux/solr/build/solr-core/test/J0/temp/solr.security.BasicAuthIntegrationTest_3A33EBC4B9611095-001/tempDir-001/node2/.
    [junit4] 2> 1006516 INFO (jetty-launcher-23109-thread-1) [ ] o.a.s.l.LogWatcher SLF4J impl is org.slf4j.impl.Log4jLoggerFactory
    [junit4] 2> 1006516 WARN (jetty-launcher-23109-thread-5) [ ] o.a.s.c.CoreContainer Couldn't add files from /home/jenkins/workspace/Lucene-Solr-6.1-Linux/solr/build/solr-core/test/J0/temp/solr.security.BasicAuthIntegrationTest_3A33EBC4B9611095-001/tempDir-001/node5/lib to classpath: /home/jenkins/workspace/Lucene-Solr-6.1-Linux/solr/build/solr-core/test/J0/temp/solr.security.BasicAuthIntegrationTest_3A33EBC4B9611095-001/tempDir-001/node5/lib
    [junit4] 2> 1006516 INFO (jetty-launcher-23109-thread-1) [ ] o.a.s.l.LogWatcher Registering Log Listener [Log4j (org.slf4j.impl.Log4jLoggerFactory)]
    [junit4] 2> 1006516 INFO (jetty-launcher-23109-thread-5) [ ] o.a.s.h.c.HttpShardHandlerFactory created with socketTimeout : 90000,urlScheme : ,connTimeout : 15000,maxConnectionsPerHost : 20,maxConnections : 10000,corePoolSize : 0,maximumPoolSize : 2147483647,maxThreadIdleTime : 5,sizeOfQueue : -1,fairnessPolicy : false,useRetries : false,
    [junit4] 2> 1006516 INFO (jetty-launcher-23109-thread-2) [ ] o.a.s.c.CoreContainer New CoreContainer 1582609940
    [junit4] 2> 1006516 INFO (jetty-launcher-23109-thread-1) [ ] o.a.s.c.ZkContainer Zookeeper client=127.0.0.1:41339/solr
    [junit4] 2> 1006516 INFO (jetty-launcher-23109-thread-3) [ ] o.a.s.c.c.ConnectionManager Waiting for client to connect to ZooKeeper
    [junit4] 2> 1006517 INFO (jetty-launcher-23109-thread-1) [ ] o.a.s.c.ZkController zkHost includes chroot
    [junit4] 2> 1006516 INFO (jetty-launcher-23109-thread-4) [ ] o.a.s.c.c.ConnectionManager Waiting for client to connect to ZooKeeper
    [junit4] 2> 1006516 INFO (jetty-launcher-23109-thread-2) [ ] o.a.s.c.CoreContainer Loading cores into CoreContainer [instanceDir=/home/jenkins/workspace/Lucene-Solr-6.1-Linux/solr/build/solr-core/test/J0/temp/solr.security.BasicAuthIntegrationTest_3A33EBC4B9611095-001/tempDir-001/node2]
    [junit4] 2> 1006517 INFO (jetty-launcher-23109-thread-5) [ ] o.a.s.u.UpdateShardHandler Creating UpdateShardHandler HTTP client with params: socketTimeout=340000&connTimeout=45000&retry=true
    [junit4] 2> 1006517 INFO (jetty-launcher-23109-thread-1) [ ] o.a.s.c.c.SolrZkClient Using default ZkCredentialsProvider
    [junit4] 2> 1006517 WARN (jetty-launcher-23109-thread-2) [ ] o.a.s.c.CoreContainer Couldn't add files from /home/jenkins/workspace/Lucene-Solr-6.1-Linux/solr/build/solr-core/test/J0/temp/solr.security.BasicAuthIntegrationTest_3A33EBC4B9611095-001/tempDir-001/node2/lib to classpath: /home/jenkins/workspace/Lucene-Solr-6.1-Linux/solr/build/solr-core/test/J0/temp/solr.security.BasicAuthIntegrationTest_3A33EBC4B9611095-001/tempDir-001/node2/lib
    [junit4] 2> 1006517 INFO (jetty-launcher-23109-thread-1) [ ] o.a.s.c.c.ConnectionManager Waiting for client to connect to ZooKeeper
    [junit4] 2> 1006518 INFO (jetty-launcher-23109-thread-2) [ ] o.a.s.h.c.HttpShardHandlerFactory created with socketTimeout : 90000,urlScheme : ,connTimeout : 15000,maxConnectionsPerHost : 20,maxConnections : 10000,corePoolSize : 0,maximumPoolSize : 2147483647,maxThreadIdleTime : 5,sizeOfQueue : -1,fairnessPolicy : false,useRetries : false,
    [junit4] 2> 1006518 INFO (jetty-launcher-23109-thread-5) [ ] o.a.s.l.LogWatcher SLF4J impl is org.slf4j.impl.Log4jLoggerFactory
    [junit4] 2> 1006518 INFO (jetty-launcher-23109-thread-5) [ ] o.a.s.l.LogWatcher Registering Log Listener [Log4j (org.slf4j.impl.Log4jLoggerFactory)]
    [junit4] 2> 1006518 INFO (zkCallback-23122-thread-1) [ ] o.a.s.c.c.ConnectionManager Watcher org.apache.solr.common.cloud.ConnectionManager@47e3c244 name:ZooKeeperConnection Watcher:127.0.0.1:41339 got event WatchedEvent state:SyncConnected type:None path:null path:null type:None
    [junit4] 2> 1006518 INFO (jetty-launcher-23109-thread-3) [ ] o.a.s.c.c.ConnectionManager Client is connected to ZooKeeper
    [junit4] 2> 1006518 INFO (jetty-launcher-23109-thread-5) [ ] o.a.s.c.ZkContainer Zookeeper client=127.0.0.1:41339/solr
    [junit4] 2> 1006518 INFO (jetty-launcher-23109-thread-5) [ ] o.a.s.c.ZkController zkHost includes chroot
    [junit4] 2> 1006518 INFO (jetty-launcher-23109-thread-2) [ ] o.a.s.u.UpdateShardHandler Creating UpdateShardHandler HTTP client with params: socketTimeout=340000&connTimeout=45000&retry=true
    [junit4] 2> 1006518 INFO (jetty-launcher-23109-thread-5) [ ] o.a.s.c.c.SolrZkClient Using default ZkCredentialsProvider
    [junit4] 2> 1006518 INFO (jetty-launcher-23109-thread-3) [ ] o.a.s.c.c.SolrZkClient Using default ZkACLProvider
    [junit4] 2> 1006519 INFO (jetty-launcher-23109-thread-5) [ ] o.a.s.c.c.ConnectionManager Waiting for client to connect to ZooKeeper
    [junit4] 2> 1006519 INFO (jetty-launcher-23109-thread-2) [ ] o.a.s.l.LogWatcher SLF4J impl is org.slf4j.impl.Log4jLoggerFactory
    [junit4] 2> 1006519 INFO (jetty-launcher-23109-thread-2) [ ] o.a.s.l.LogWatcher Registering Log Listener [Log4j (org.slf4j.impl.Log4jLoggerFactory)]
    [junit4] 2> 1006519 INFO (jetty-launcher-23109-thread-2) [ ] o.a.s.c.ZkContainer Zookeeper client=127.0.0.1:41339/solr
    [junit4] 2> 1006519 INFO (jetty-launcher-23109-thread-2) [ ] o.a.s.c.ZkController zkHost includes chroot
    [junit4] 2> 1006519 INFO (jetty-launcher-23109-thread-2) [ ] o.a.s.c.c.SolrZkClient Using default ZkCredentialsProvider
    [junit4] 2> 1006519 INFO (jetty-launcher-23109-thread-2) [ ] o.a.s.c.c.ConnectionManager Waiting for client to connect to ZooKeeper
    [junit4] 2> 1006519 INFO (zkCallback-23123-thread-1) [ ] o.a.s.c.c.ConnectionManager Watcher org.apache.solr.common.cloud.ConnectionManager@2629281a name:ZooKeeperConnection Watcher:127.0.0.1:41339 got event WatchedEvent state:SyncConnected type:None path:null path:null type:None
    [junit4] 2> 1006520 INFO (jetty-launcher-23109-thread-4) [ ] o.a.s.c.c.ConnectionManager Client is connected to ZooKeeper
    [junit4] 2> 1006520 INFO (jetty-launcher-23109-thread-4) [ ] o.a.s.c.c.SolrZkClient Using default ZkACLProvider
    [junit4] 2> 1006531 INFO (zkCallback-23124-thread-1) [ ] o.a.s.c.c.ConnectionManager Watcher org.apache.solr.common.cloud.ConnectionManager@9b5e34f name:ZooKeeperConnection Watcher:127.0.0.1:41339 got event WatchedEvent state:SyncConnected type:None path:null path:null type:None
    [junit4] 2> 1006531 INFO (zkCallback-23129-thread-1) [ ] o.a.s.c.c.ConnectionManager Watcher org.apache.solr.common.cloud.ConnectionManager@779c705a name:ZooKeeperConnection Watcher:127.0.0.1:41339 got event WatchedEvent state:SyncConnected type:None path:null path:null type:None
    [junit4] 2> 1006531 INFO (zkCallback-23130-thread-1) [ ] o.a.s.c.c.ConnectionManager Watcher org.apache.solr.common.cloud.ConnectionManager@408f4042 name:ZooKeeperConnection Watcher:127.0.0.1:41339 got event WatchedEvent state:SyncConnected type:None path:null path:null type:None
    [junit4] 2> 1006531 INFO (jetty-launcher-23109-thread-1) [ ] o.a.s.c.c.ConnectionManager Client is connected to ZooKeeper
    [junit4] 2> 1006531 INFO (jetty-launcher-23109-thread-2) [ ] o.a.s.c.c.ConnectionManager Client is connected to ZooKeeper
    [junit4] 2> 1006531 INFO (jetty-launcher-23109-thread-5) [ ] o.a.s.c.c.ConnectionManager Client is connected to ZooKeeper
    [junit4] 2> 1006531 INFO (jetty-launcher-23109-thread-1) [ ] o.a.s.c.c.SolrZkClient Using default ZkACLProvider
    [junit4] 2> 1006531 INFO (jetty-launcher-23109-thread-5) [ ] o.a.s.c.c.SolrZkClient Using default ZkACLProvider
    [junit4] 2> 1006531 INFO (jetty-launcher-23109-thread-2) [ ] o.a.s.c.c.SolrZkClient Using default ZkACLProvider
    [junit4] 2> 1006533 INFO (jetty-launcher-23109-thread-3) [n:127.0.0.1:36028_solr ] o.a.s.c.ZkController Added new OnReconnect listener org.apache.solr.cloud.ZkController$$Lambda$67/411969294@7ac7e920
    [junit4] 2> 1006533 INFO (jetty-launcher-23109-thread-3) [n:127.0.0.1:36028_solr ] o.a.s.c.c.ConnectionManager Waiting for client to connect to ZooKeeper
    [junit4] 2> 1006534 INFO (jetty-launcher-23109-thread-4) [n:127.0.0.1:41466_solr ] o.a.s.c.ZkController Added new OnReconnect listener org.apache.solr.cloud.ZkController$$Lambda$67/411969294@1254790c
    [junit4] 2> 1006534 INFO (jetty-launcher-23109-thread-4) [n:127.0.0.1:41466_solr ] o.a.s.c.c.ConnectionManager Waiting for client to connect to ZooKeeper
    [junit4] 2> 1006536 INFO (zkCallback-23131-thread-1-processing-n:127.0.0.1:36028_solr) [n:127.0.0.1:36028_solr ] o.a.s.c.c.ConnectionManager Watcher org.apache.solr.common.cloud.ConnectionManager@532a2307 name:ZooKeeperConnection Watcher:127.0.0.1:41339/solr got event WatchedEvent state:SyncConnected type:None path:null path:null type:None
    [junit4] 2> 1006536 INFO (jetty-launcher-23109-thread-3) [n:127.0.0.1:36028_solr ] o.a.s.c.c.ConnectionManager Client is connected to ZooKeeper
    [junit4] 2> 1006544 INFO (jetty-launcher-23109-thread-2) [n:127.0.0.1:35480_solr ] o.a.s.c.ZkController Added new OnReconnect listener org.apache.solr.cloud.ZkController$$Lambda$67/411969294@e0d58b2
    [junit4] 2> 1006544 INFO (jetty-launcher-23109-thread-1) [n:127.0.0.1:42635_solr ] o.a.s.c.ZkController Added new OnReconnect listener org.apache.solr.cloud.ZkController$$Lambda$67/411969294@3fcd97d
    [junit4] 2> 1006544 INFO (jetty-launcher-23109-thread-5) [n:127.0.0.1:39256_solr ] o.a.s.c.ZkController Added new OnReconnect listener org.apache.solr.cloud.ZkController$$Lambda$67/411969294@721ac91e
    [junit4] 2> 1006545 INFO (jetty-launcher-23109-thread-2) [n:127.0.0.1:35480_solr ] o.a.s.c.c.ConnectionManager Waiting for client to connect to ZooKeeper
    [junit4] 2> 1006545 INFO (jetty-launcher-23109-thread-5) [n:127.0.0.1:39256_solr ] o.a.s.c.c.ConnectionManager Waiting for client to connect to ZooKeeper
    [junit4] 2> 1006545 INFO (zkCallback-23132-thread-1-processing-n:127.0.0.1:41466_solr) [n:127.0.0.1:41466_solr ] o.a.s.c.c.ConnectionManager Watcher org.apache.solr.common.cloud.ConnectionManager@46fee82e name:ZooKeeperConnection Watcher:127.0.0.1:41339/solr got event WatchedEvent state:SyncConnected type:None path:null path:null type:None
    [junit4] 2> 1006545 INFO (jetty-launcher-23109-thread-1) [n:127.0.0.1:42635_solr ] o.a.s.c.c.ConnectionManager Waiting for client to connect to ZooKeeper
    [junit4] 2> 1006545 INFO (jetty-launcher-23109-thread-4) [n:127.0.0.1:41466_solr ] o.a.s.c.c.ConnectionManager Client is connected to ZooKeeper
    [junit4] 2> 1006554 INFO (zkCallback-23133-thread-1-processing-n:127.0.0.1:35480_solr) [n:127.0.0.1:35480_solr ] o.a.s.c.c.ConnectionManager Watcher org.apache.solr.common.cloud.ConnectionManager@494e95aa name:ZooKeeperConnection Watcher:127.0.0.1:41339/solr got event WatchedEvent state:SyncConnected type:None path:null path:null type:None
    [junit4] 2> 1006554 INFO (jetty-launcher-23109-thread-2) [n:127.0.0.1:35480_solr ] o.a.s.c.c.ConnectionManager Client is connected to ZooKeeper
    [junit4] 2> 1006554 INFO (jetty-launcher-23109-thread-3) [n:127.0.0.1:36028_solr ] o.a.s.c.c.SolrZkClient makePath: /overseer/queue
    [junit4] 2> 1006554 INFO (zkCallback-23135-thread-1-processing-n:127.0.0.1:39256_solr) [n:127.0.0.1:39256_solr ] o.a.s.c.c.ConnectionManager Watcher org.apache.solr.common.cloud.ConnectionManager@293ccb63 name:ZooKeeperConnection Watcher:127.0.0.1:41339/solr got event WatchedEvent state:SyncConnected type:None path:null path:null type:None
    [junit4] 2> 1006554 INFO (jetty-launcher-23109-thread-5) [n:127.0.0.1:39256_solr ] o.a.s.c.c.ConnectionManager Client is connected to ZooKeeper
    [junit4] 2> 1006554 INFO (jetty-launcher-23109-thread-4) [n:127.0.0.1:41466_solr ] o.a.s.c.c.SolrZkClient makePath: /overseer/queue
    [junit4] 2> 1006554 INFO (zkCallback-23134-thread-1-processing-n:127.0.0.1:42635_solr) [n:127.0.0.1:42635_solr ] o.a.s.c.c.ConnectionManager Watcher org.apache.solr.common.cloud.ConnectionManager@56670690 name:ZooKeeperConnection Watcher:127.0.0.1:41339/solr got event WatchedEvent state:SyncConnected type:None path:null path:null type:None
    [junit4] 2> 1006555 INFO (jetty-launcher-23109-thread-1) [n:127.0.0.1:42635_solr ] o.a.s.c.c.ConnectionManager Client is connected to ZooKeeper
    [junit4] 2> 1006558 INFO (jetty-launcher-23109-thread-2) [n:127.0.0.1:35480_solr ] o.a.s.c.c.SolrZkClient makePath: /overseer/queue
    [junit4] 2> 1006564 INFO (jetty-launcher-23109-thread-5) [n:127.0.0.1:39256_solr ] o.a.s.c.c.SolrZkClient makePath: /overseer/collection-queue-work
    [junit4] 2> 1006564 INFO (jetty-launcher-23109-thread-1) [n:127.0.0.1:42635_solr ] o.a.s.c.c.SolrZkClient makePath: /overseer/collection-queue-work
    [junit4] 2> 1006564 INFO (jetty-launcher-23109-thread-3) [n:127.0.0.1:36028_solr ] o.a.s.c.c.SolrZkClient makePath: /overseer/collection-queue-work
    [junit4] 2> 1006564 INFO (jetty-launcher-23109-thread-4) [n:127.0.0.1:41466_solr ] o.a.s.c.c.SolrZkClient makePath: /overseer/collection-queue-work
    [junit4] 2> 1006598 INFO (jetty-launcher-23109-thread-1) [n:127.0.0.1:42635_solr ] o.a.s.c.c.SolrZkClient makePath: /overseer/collection-map-running
    [junit4] 2> 1006598 INFO (jetty-launcher-23109-thread-3) [n:127.0.0.1:36028_solr ] o.a.s.c.c.SolrZkClient makePath: /overseer/collection-map-running
    [junit4] 2> 1006598 INFO (jetty-launcher-23109-thread-2) [n:127.0.0.1:35480_solr ] o.a.s.c.c.SolrZkClient makePath: /overseer/collection-map-running
    [junit4] 2> 1006598 INFO (jetty-launcher-23109-thread-4) [n:127.0.0.1:41466_solr ] o.a.s.c.c.SolrZkClient makePath: /overseer/collection-map-running
    [junit4] 2> 1006598 INFO (jetty-launcher-23109-thread-5) [n:127.0.0.1:39256_solr ] o.a.s.c.c.SolrZkClient makePath: /overseer/collection-map-running
    [junit4] 2> 1006605 INFO (jetty-launcher-23109-thread-3) [n:127.0.0.1:36028_solr ] o.a.s.c.c.SolrZkClient makePath: /overseer/collection-map-completed
    [junit4] 2> 1006605 INFO (jetty-launcher-23109-thread-5) [n:127.0.0.1:39256_solr ] o.a.s.c.c.SolrZkClient makePath: /overseer/collection-map-completed
    [junit4] 2> 1006606 INFO (jetty-launcher-23109-thread-1) [n:127.0.0.1:42635_solr ] o.a.s.c.c.SolrZkClient makePath: /overseer/collection-map-completed
    [junit4] 2> 1006608 INFO (jetty-launcher-23109-thread-4) [n:127.0.0.1:41466_solr ] o.a.s.c.c.SolrZkClient makePath: /overseer/collection-map-completed
    [junit4] 2> 1006608 INFO (jetty-launcher-23109-thread-2) [n:127.0.0.1:35480_solr ] o.a.s.c.c.SolrZkClient makePath: /overseer/collection-map-completed
    [junit4] 2> 1006614 INFO (jetty-launcher-23109-thread-3) [n:127.0.0.1:36028_solr ] o.a.s.c.c.SolrZkClient makePath: /overseer/collection-map-failure
    [junit4] 2> 1006616 INFO (jetty-launcher-23109-thread-1) [n:127.0.0.1:42635_solr ] o.a.s.c.c.SolrZkClient makePath: /overseer/collection-map-failure
    [junit4] 2> 1006616 INFO (jetty-launcher-23109-thread-5) [n:127.0.0.1:39256_solr ] o.a.s.c.c.SolrZkClient makePath: /overseer/collection-map-failure
    [junit4] 2> 1006619 INFO (jetty-launcher-23109-thread-4) [n:127.0.0.1:41466_solr ] o.a.s.c.c.SolrZkClient makePath: /overseer/collection-map-failure
    [junit4] 2> 1006619 INFO (jetty-launcher-23109-thread-2) [n:127.0.0.1:35480_solr ] o.a.s.c.c.SolrZkClient makePath: /overseer/collection-map-failure
    [junit4] 2> 1006632 INFO (jetty-launcher-23109-thread-5) [n:127.0.0.1:39256_solr ] o.a.s.c.c.SolrZkClient makePath: /live_nodes
    [junit4] 2> 1006632 INFO (jetty-launcher-23109-thread-1) [n:127.0.0.1:42635_solr ] o.a.s.c.c.SolrZkClient makePath: /live_nodes
    [junit4] 2> 1006632 INFO (jetty-launcher-23109-thread-3) [n:127.0.0.1:36028_solr ] o.a.s.c.c.SolrZkClient makePath: /live_nodes
    [junit4] 2> 1006637 INFO (jetty-launcher-23109-thread-1) [n:127.0.0.1:42635_solr ] o.a.s.c.c.SolrZkClient makePath: /collections
    [junit4] 2> 1006637 INFO (jetty-launcher-23109-thread-5) [n:127.0.0.1:39256_solr ] o.a.s.c.c.SolrZkClient makePath: /collections
    [junit4] 2> 1006637 INFO (jetty-launcher-23109-thread-4) [n:127.0.0.1:41466_solr ] o.a.s.c.c.SolrZkClient makePath: /collections
    [junit4] 2> 1006637 INFO (jetty-launcher-23109-thread-2) [n:127.0.0.1:35480_solr ] o.a.s.c.c.SolrZkClient makePath: /collections
    [junit4] 2> 1006637 INFO (jetty-launcher-23109-thread-3) [n:127.0.0.1:36028_solr ] o.a.s.c.c.SolrZkClient makePath: /collections
    [junit4] 2> 1006642 INFO (jetty-launcher-23109-thread-5) [n:127.0.0.1:39256_solr ] o.a.s.c.c.SolrZkClient makePath: /aliases.json
    [junit4] 2> 1006642 INFO (jetty-launcher-23109-thread-1) [n:127.0.0.1:42635_solr ] o.a.s.c.c.SolrZkClient makePath: /aliases.json
    [junit4] 2> 1006642 INFO (jetty-launcher-23109-thread-3) [n:127.0.0.1:36028_solr ] o.a.s.c.c.SolrZkClient makePath: /aliases.json
    [junit4] 2> 1006642 INFO (jetty-launcher-23109-thread-2) [n:127.0.0.1:35480_solr ] o.a.s.c.c.SolrZkClient makePath: /aliases.json
    [junit4] 2> 1006642 INFO (jetty-launcher-23109-thread-4) [n:127.0.0.1:41466_solr ] o.a.s.c.c.SolrZkClient makePath: /aliases.json
    [junit4] 2> 1006646 INFO (jetty-launcher-23109-thread-3) [n:127.0.0.1:36028_solr ] o.a.s.c.c.SolrZkClient makePath: /clusterstate.json
    [junit4] 2> 1006646 INFO (jetty-launcher-23109-thread-1) [n:127.0.0.1:42635_solr ] o.a.s.c.c.SolrZkClient makePath: /clusterstate.json
    [junit4] 2> 1006647 INFO (jetty-launcher-23109-thread-5) [n:127.0.0.1:39256_solr ] o.a.s.c.c.SolrZkClient makePath: /clusterstate.json
    [junit4] 2> 1006647 INFO (jetty-launcher-23109-thread-4) [n:127.0.0.1:41466_solr ] o.a.s.c.c.SolrZkClient makePath: /clusterstate.json
    [junit4] 2> 1006649 INFO (jetty-launcher-23109-thread-1) [n:127.0.0.1:42635_solr ] o.a.s.c.c.SolrZkClient makePath: /security.json
    [junit4] 2> 1006650 INFO (jetty-launcher-23109-thread-3) [n:127.0.0.1:36028_solr ] o.a.s.c.c.SolrZkClient makePath: /security.json
    [junit4] 2> 1006650 INFO (jetty-launcher-23109-thread-2) [n:127.0.0.1:35480_solr ] o.a.s.c.c.SolrZkClient makePath: /security.json
    [junit4] 2> 1006652 INFO (jetty-launcher-23109-thread-5) [n:127.0.0.1:39256_solr ] o.a.s.c.c.SolrZkClient makePath: /security.json
    [junit4] 2> 1006655 INFO (jetty-launcher-23109-thread-3) [n:127.0.0.1:36028_solr ] o.a.s.c.c.ZkStateReader Updating cluster state from ZooKeeper...
    [junit4] 2> 1006655 INFO (jetty-launcher-23109-thread-4) [n:127.0.0.1:41466_solr ] o.a.s.c.c.ZkStateReader Updating cluster state from ZooKeeper...
    [junit4] 2> 1006655 INFO (jetty-launcher-23109-thread-2) [n:127.0.0.1:35480_solr ] o.a.s.c.c.ZkStateReader Updating cluster state from ZooKeeper...
    [junit4] 2> 1006655 INFO (jetty-launcher-23109-thread-1) [n:127.0.0.1:42635_solr ] o.a.s.c.c.ZkStateReader Updating cluster state from ZooKeeper...
    [junit4] 2> 1006657 INFO (jetty-launcher-23109-thread-5) [n:127.0.0.1:39256_solr ] o.a.s.c.c.ZkStateReader Updating cluster state from ZooKeeper...
    [junit4] 2> 1006657 INFO (jetty-launcher-23109-thread-3) [n:127.0.0.1:36028_solr ] o.a.s.c.c.ZkStateReader Loaded empty cluster properties
    [junit4] 2> 1006657 INFO (jetty-launcher-23109-thread-4) [n:127.0.0.1:41466_solr ] o.a.s.c.c.ZkStateReader Loaded empty cluster properties
    [junit4] 2> 1006657 INFO (jetty-launcher-23109-thread-2) [n:127.0.0.1:35480_solr ] o.a.s.c.c.ZkStateReader Loaded empty cluster properties
    [junit4] 2> 1006657 INFO (jetty-launcher-23109-thread-1) [n:127.0.0.1:42635_solr ] o.a.s.c.c.ZkStateReader Loaded empty cluster properties
    [junit4] 2> 1006657 INFO (jetty-launcher-23109-thread-5) [n:127.0.0.1:39256_solr ] o.a.s.c.c.ZkStateReader Loaded empty cluster properties
    [junit4] 2> 1006657 INFO (jetty-launcher-23109-thread-3) [n:127.0.0.1:36028_solr ] o.a.s.c.c.ZkStateReader Updated live nodes from ZooKeeper... (0) -> (0)
    [junit4] 2> 1006658 INFO (jetty-launcher-23109-thread-2) [n:127.0.0.1:35480_solr ] o.a.s.c.c.ZkStateReader Updated live nodes from ZooKeeper... (0) -> (0)
    [junit4] 2> 1006658 INFO (jetty-launcher-23109-thread-4) [n:127.0.0.1:41466_solr ] o.a.s.c.c.ZkStateReader Updated live nodes from ZooKeeper... (0) -> (0)
    [junit4] 2> 1006658 INFO (jetty-launcher-23109-thread-1) [n:127.0.0.1:42635_solr ] o.a.s.c.c.ZkStateReader Updated live nodes from ZooKeeper... (0) -> (0)
    [junit4] 2> 1006658 INFO (jetty-launcher-23109-thread-5) [n:127.0.0.1:39256_solr ] o.a.s.c.c.ZkStateReader Updated live nodes from ZooKeeper... (0) -> (0)
    [junit4] 2> 1006658 INFO (jetty-launcher-23109-thread-3) [n:127.0.0.1:36028_solr ] o.a.s.c.c.SolrZkClient makePath: /overseer_elect
    [junit4] 2> 1006659 INFO (jetty-launcher-23109-thread-4) [n:127.0.0.1:41466_solr ] o.a.s.c.c.SolrZkClient makePath: /overseer_elect
    [junit4] 2> 1006659 INFO (jetty-launcher-23109-thread-2) [n:127.0.0.1:35480_solr ] o.a.s.c.c.SolrZkClient makePath: /overseer_elect
    [junit4] 2> 1006659 INFO (jetty-launcher-23109-thread-1) [n:127.0.0.1:42635_solr ] o.a.s.c.c.SolrZkClient makePath: /overseer_elect
    [junit4] 2> 1006659 INFO (jetty-launcher-23109-thread-5) [n:127.0.0.1:39256_solr ] o.a.s.c.c.SolrZkClient makePath: /overseer_elect
    [junit4] 2> 1006662 INFO (jetty-launcher-23109-thread-4) [n:127.0.0.1:41466_solr ] o.a.s.c.c.SolrZkClient makePath: /overseer_elect/election
    [junit4] 2> 1006662 INFO (jetty-launcher-23109-thread-2) [n:127.0.0.1:35480_solr ] o.a.s.c.c.SolrZkClient makePath: /overseer_elect/election
    [junit4] 2> 1006670 INFO (jetty-launcher-23109-thread-3) [n:127.0.0.1:36028_solr ] o.a.s.c.c.SolrZkClient makePath: /overseer_elect/election
    [junit4] 2> 1006670 INFO (jetty-launcher-23109-thread-1) [n:127.0.0.1:42635_solr ] o.a.s.c.c.SolrZkClient makePath: /overseer_elect/election
    [junit4] 2> 1006671 INFO (jetty-launcher-23109-thread-5) [n:127.0.0.1:39256_solr ] o.a.s.c.c.SolrZkClient makePath: /overseer_elect/election
    [junit4] 2> 1006681 INFO (jetty-launcher-23109-thread-3) [n:127.0.0.1:36028_solr ] o.a.s.c.Overseer Overseer (id=null) closing
    [junit4] 2> 1006681 INFO (jetty-launcher-23109-thread-2) [n:127.0.0.1:35480_solr ] o.a.s.c.Overseer Overseer (id=null) closing
    [junit4] 2> 1006681 INFO (jetty-launcher-23109-thread-4) [n:127.0.0.1:41466_solr ] o.a.s.c.Overseer Overseer (id=null) closing
    [junit4] 2> 1006683 INFO (jetty-launcher-23109-thread-1) [n:127.0.0.1:42635_solr ] o.a.s.c.Overseer Overseer (id=null) closing
    [junit4] 2> 1006684 INFO (jetty-launcher-23109-thread-5) [n:127.0.0.1:39256_solr ] o.a.s.c.Overseer Overseer (id=null) closing
    [junit4] 2> 1006684 INFO (jetty-launcher-23109-thread-3) [n:127.0.0.1:36028_solr ] o.a.s.c.LeaderElector Joined leadership election with path: /overseer_elect/election/96074104082399243-127.0.0.1:36028_solr-n_0000000000
    [junit4] 2> 1006684 INFO (jetty-launcher-23109-thread-4) [n:127.0.0.1:41466_solr ] o.a.s.c.LeaderElector Joined leadership election with path: /overseer_elect/election/96074104082399244-127.0.0.1:41466_solr-n_0000000002
    [junit4] 2> 1006684 INFO (jetty-launcher-23109-thread-2) [n:127.0.0.1:35480_solr ] o.a.s.c.LeaderElector Joined leadership election with path: /overseer_elect/election/96074104082399245-127.0.0.1:35480_solr-n_0000000001
    [junit4] 2> 1006702 INFO (jetty-launcher-23109-thread-1) [n:127.0.0.1:42635_solr ] o.a.s.c.LeaderElector Joined leadership election with path: /overseer_elect/election/96074104082399247-127.0.0.1:42635_solr-n_0000000003
    [junit4] 2> 1006703 INFO (jetty-launcher-23109-thread-5) [n:127.0.0.1:39256_solr ] o.a.s.c.LeaderElector Joined leadership election with path: /overseer_elect/election/96074104082399246-127.0.0.1:39256_solr-n_0000000004
    [junit4] 2> 1006704 INFO (jetty-launcher-23109-thread-3) [n:127.0.0.1:36028_solr ] o.a.s.c.OverseerElectionContext I am going to be the leader 127.0.0.1:36028_solr
    [junit4] 2> 1006704 INFO (jetty-launcher-23109-thread-3) [n:127.0.0.1:36028_solr ] o.a.s.c.c.SolrZkClient makePath: /overseer_elect/leader
    [junit4] 2> 1006704 INFO (jetty-launcher-23109-thread-2) [n:127.0.0.1:35480_solr ] o.a.s.c.LeaderElector Watching path /overseer_elect/election/96074104082399243-127.0.0.1:36028_solr-n_0000000000 to know if I could be the leader
    [junit4] 2> 1006704 INFO (jetty-launcher-23109-thread-1) [n:127.0.0.1:42635_solr ] o.a.s.c.LeaderElector Watching path /overseer_elect/election/96074104082399244-127.0.0.1:41466_solr-n_0000000002 to know if I could be the leader
    [junit4] 2> 1006704 INFO (jetty-launcher-23109-thread-4) [n:127.0.0.1:41466_solr ] o.a.s.c.LeaderElector Watching path /overseer_elect/election/96074104082399245-127.0.0.1:35480_solr-n_0000000001 to know if I could be the leader
    [junit4] 2> 1006704 INFO (jetty-launcher-23109-thread-5) [n:127.0.0.1:39256_solr ] o.a.s.c.LeaderElector Watching path /overseer_elect/election/96074104082399247-127.0.0.1:42635_solr-n_0000000003 to know if I could be the leader
    [junit4] 2> 1006704 INFO (jetty-launcher-23109-thread-1) [n:127.0.0.1:42635_solr ] o.a.s.c.ZkController Register node as live in ZooKeeper:/live_nodes/127.0.0.1:42635_solr
    [junit4] 2> 1006704 INFO (jetty-launcher-23109-thread-2) [n:127.0.0.1:35480_solr ] o.a.s.c.ZkController Register node as live in ZooKeeper:/live_nodes/127.0.0.1:35480_solr
    [junit4] 2> 1006704 INFO (jetty-launcher-23109-thread-5) [n:127.0.0.1:39256_solr ] o.a.s.c.ZkController Register node as live in ZooKeeper:/live_nodes/127.0.0.1:39256_solr
    [junit4] 2> 1006704 INFO (jetty-launcher-23109-thread-4) [n:127.0.0.1:41466_solr ] o.a.s.c.ZkController Register node as live in ZooKeeper:/live_nodes/127.0.0.1:41466_solr
    [junit4] 2> 1006706 INFO (jetty-launcher-23109-thread-1) [n:127.0.0.1:42635_solr ] o.a.s.c.c.SolrZkClient makePath: /live_nodes/127.0.0.1:42635_solr
    [junit4] 2> 1006707 INFO (jetty-launcher-23109-thread-2) [n:127.0.0.1:35480_solr ] o.a.s.c.c.SolrZkClient makePath: /live_nodes/127.0.0.1:35480_solr
    [junit4] 2> 1006707 INFO (jetty-launcher-23109-thread-4) [n:127.0.0.1:41466_solr ] o.a.s.c.c.SolrZkClient makePath: /live_nodes/127.0.0.1:41466_solr
    [junit4] 2> 1006707 INFO (jetty-launcher-23109-thread-5) [n:127.0.0.1:39256_solr ] o.a.s.c.c.SolrZkClient makePath: /live_nodes/127.0.0.1:39256_solr
    [junit4] 2> 1006707 INFO (jetty-launcher-23109-thread-3) [n:127.0.0.1:36028_solr ] o.a.s.c.Overseer Overseer (id=96074104082399243-127.0.0.1:36028_solr-n_0000000000) starting
    [junit4] 2> 1006709 INFO (zkCallback-23131-thread-1-processing-n:127.0.0.1:36028_solr) [n:127.0.0.1:36028_solr ] o.a.s.c.c.ZkStateReader A live node change: [WatchedEvent state:SyncConnected type:NodeChildrenChanged path:/live_nodes], has occurred - updating... (live nodes size: [0])
    [junit4] 2> 1006709 INFO (zkCallback-23135-thread-1-processing-n:127.0.0.1:39256_solr) [n:127.0.0.1:39256_solr ] o.a.s.c.c.ZkStateReader A live node change: [WatchedEvent state:SyncConnected type:NodeChildrenChanged path:/live_nodes], has occurred - updating... (live nodes size: [0])
    [junit4] 2> 1006709 INFO (zkCallback-23132-thread-1-processing-n:127.0.0.1:41466_solr) [n:127.0.0.1:41466_solr ] o.a.s.c.c.ZkStateReader A live node change: [WatchedEvent state:SyncConnected type:NodeChildrenChanged path:/live_nodes], has occurred - updating... (live nodes size: [0])
    [junit4] 2> 1006709 INFO (zkCallback-23133-thread-1-processing-n:127.0.0.1:35480_solr) [n:127.0.0.1:35480_solr ] o.a.s.c.c.ZkStateReader A live node change: [WatchedEvent state:SyncConnected type:NodeChildrenChanged path:/live_nodes], has occurred - updating... (live nodes size: [0])
    [junit4] 2> 1006709 INFO (zkCallback-23134-thread-1-processing-n:127.0.0.1:42635_solr) [n:127.0.0.1:42635_solr ] o.a.s.c.c.ZkStateReader A live node change: [WatchedEvent state:SyncConnected type:NodeChildrenChanged path:/live_nodes], has occurred - updating... (live nodes size: [0])
    [junit4] 2> 1006711 INFO (zkCallback-23131-thread-1-processing-n:127.0.0.1:36028_solr) [n:127.0.0.1:36028_solr ] o.a.s.c.c.ZkStateReader Updated live nodes from ZooKeeper... (0) -> (1)
    [junit4] 2> 1006712 INFO (zkCallback-23132-thread-1-processing-n:127.0.0.1:41466_solr) [n:127.0.0.1:41466_solr ] o.a.s.c.c.ZkStateReader Updated live nodes from ZooKeeper... (0) -> (1)
    [junit4] 2> 1006711 INFO (zkCallback-23135-thread-1-processing-n:127.0.0.1:39256_solr) [n:127.0.0.1:39256_solr ] o.a.s.c.c.ZkStateReader Updated live nodes from ZooKeeper... (0) -> (1)
    [junit4] 2> 1006712 INFO (zkCallback-23134-thread-1-processing-n:127.0.0.1:42635_solr) [n:127.0.0.1:42635_solr ] o.a.s.c.c.ZkStateReader Updated live nodes from ZooKeeper... (0) -> (1)
    [junit4] 2> 1006711 INFO (zkCallback-23133-thread-1-processing-n:127.0.0.1:35480_solr) [n:127.0.0.1:35480_solr ] o.a.s.c.c.ZkStateReader Updated live nodes from ZooKeeper... (0) -> (1)
    [junit4] 2> 1006713 INFO (zkCallback-23131-thread-1-processing-n:127.0.0.1:36028_solr) [n:127.0.0.1:36028_solr ] o.a.s.c.c.ZkStateReader A live node change: [WatchedEvent state:SyncConnected type:NodeChildrenChanged path:/live_nodes], has occurred - updating... (live nodes size: [1])
    [junit4] 2> 1006713 INFO (zkCallback-23132-thread-1-processing-n:127.0.0.1:41466_solr) [n:127.0.0.1:41466_solr ] o.a.s.c.c.ZkStateReader A live node change: [WatchedEvent state:SyncConnected type:NodeChildrenChanged path:/live_nodes], has occurred - updating... (live nodes size: [1])
    [junit4] 2> 1006713 INFO (zkCallback-23134-thread-1-processing-n:127.0.0.1:42635_solr) [n:127.0.0.1:42635_solr ] o.a.s.c.c.ZkStateReader A live node change: [WatchedEvent state:SyncConnected type:NodeChildrenChanged path:/live_nodes], has occurred - updating... (live nodes size: [1])
    [junit4] 2> 1006713 INFO (zkCallback-23133-thread-1-processing-n:127.0.0.1:35480_solr) [n:127.0.0.1:35480_solr ] o.a.s.c.c.ZkStateReader A live node change: [WatchedEvent state:SyncConnected type:NodeChildrenChanged path:/live_nodes], has occurred - updating... (live nodes size: [1])
    [junit4] 2> 1006713 INFO (zkCallback-23135-thread-1-processing-n:127.0.0.1:39256_solr) [n:127.0.0.1:39256_solr ] o.a.s.c.c.ZkStateReader A live node change: [WatchedEvent state:SyncConnected type:NodeChildrenChanged path:/live_nodes], has occurred - updating... (live nodes size: [1])
    [junit4] 2> 1006714 INFO (zkCallback-23131-thread-1-processing-n:127.0.0.1:36028_solr) [n:127.0.0.1:36028_solr ] o.a.s.c.c.ZkStateReader Updated live nodes from ZooKeeper... (1) -> (4)
    [junit4] 2> 1006714 INFO (zkCallback-23134-thread-1-processing-n:127.0.0.1:42635_solr) [n:127.0.0.1:42635_solr ] o.a.s.c.c.ZkStateReader Updated live nodes from ZooKeeper... (1) -> (4)
    [junit4] 2> 1006717 INFO (zkCallback-23132-thread-1-processing-n:127.0.0.1:41466_solr) [n:127.0.0.1:41466_solr ] o.a.s.c.c.ZkStateReader Updated live nodes from ZooKeeper... (1) -> (4)
    [junit4] 2> 1006717 INFO (zkCallback-23135-thread-1-processing-n:127.0.0.1:39256_solr) [n:127.0.0.1:39256_solr ] o.a.s.c.c.ZkStateReader Updated live nodes from ZooKeeper... (1) -> (4)
    [junit4] 2> 1006718 INFO (zkCallback-23133-thread-1-processing-n:127.0.0.1:35480_solr) [n:127.0.0.1:35480_solr ] o.a.s.c.c.ZkStateReader Updated live nodes from ZooKeeper... (1) -> (4)
    [junit4] 2> 1006720 INFO (jetty-launcher-23109-thread-3) [n:127.0.0.1:36028_solr ] o.a.s.c.c.SolrZkClient makePath: /overseer/queue-work
    [junit4] 2> 1006723 INFO (jetty-launcher-23109-thread-1) [n:127.0.0.1:42635_solr ] o.a.s.c.CoreContainer Security conf doesn't exist. Skipping setup for authorization module.
    [junit4] 2> 1006723 INFO (jetty-launcher-23109-thread-1) [n:127.0.0.1:42635_solr ] o.a.s.c.CoreContainer No authentication plugin used.
    [junit4] 2> 1006723 INFO (jetty-launcher-23109-thread-1) [n:127.0.0.1:42635_solr ] o.a.s.c.CorePropertiesLocator Looking for core definitions underneath /home/jenkins/workspace/Lucene-Solr-6.1-Linux/solr/build/solr-core/test/J0/temp/solr.security.BasicAuthIntegrationTest_3A33EBC4B9611095-001/tempDir-001/node1/.
    [junit4] 2> 1006724 INFO (jetty-launcher-23109-thread-1) [n:127.0.0.1:42635_solr ] o.a.s.c.CorePropertiesLocator Found 0 core definitions
    [junit4] 2> 1006725 INFO (jetty-launcher-23109-thread-2) [n:127.0.0.1:35480_solr ] o.a.s.c.CoreContainer Security conf doesn't exist. Skipping setup for authorization module.
    [junit4] 2> 1006725 INFO (jetty-launcher-23109-thread-2) [n:127.0.0.1:35480_solr ] o.a.s.c.CoreContainer No authentication plugin used.
    [junit4] 2> 1006725 INFO (jetty-launcher-23109-thread-2) [n:127.0.0.1:35480_solr ] o.a.s.c.CorePropertiesLocator Looking for core definitions underneath /home/jenkins/workspace/Lucene-Solr-6.1-Linux/solr/build/solr-core/test/J0/temp/solr.security.BasicAuthIntegrationTest_3A33EBC4B9611095-001/tempDir-001/node2/.
    [junit4] 2> 1006725 INFO (jetty-launcher-23109-thread-1) [n:127.0.0.1:42635_solr ] o.a.s.s.SolrDispatchFilter user.dir=/home/jenkins/workspace/Lucene-Solr-6.1-Linux/solr/build/solr-core/test/J0
    [junit4] 2> 1006725 INFO (jetty-launcher-23109-thread-1) [n:127.0.0.1:42635_solr ] o.a.s.s.SolrDispatchFilter SolrDispatchFilter.init() done
    [junit4] 2> 1006725 INFO (jetty-launcher-23109-thread-2) [n:127.0.0.1:35480_solr ] o.a.s.c.CorePropertiesLocator Found 0 core definitions
    [junit4] 2> 1006734 INFO (jetty-launcher-23109-thread-5) [n:127.0.0.1:39256_solr ] o.a.s.c.CoreContainer Security conf doesn't exist. Skipping setup for authorization module.
    [junit4] 2> 1006734 INFO (jetty-launcher-23109-thread-5) [n:127.0.0.1:39256_solr ] o.a.s.c.CoreContainer No authentication plugin used.
    [junit4] 2> 1006734 INFO (jetty-launcher-23109-thread-5) [n:127.0.0.1:39256_solr ] o.a.s.c.CorePropertiesLocator Looking for core definitions underneath /home/jenkins/workspace/Lucene-Solr-6.1-Linux/solr/build/solr-core/test/J0/temp/solr.security.BasicAuthIntegrationTest_3A33EBC4B9611095-001/tempDir-001/node5/.
    [junit4] 2> 1006734 INFO (jetty-launcher-23109-thread-5) [n:127.0.0.1:39256_solr ] o.a.s.c.CorePropertiesLocator Found 0 core definitions
    [junit4] 2> 1006735 INFO (jetty-launcher-23109-thread-4) [n:127.0.0.1:41466_solr ] o.a.s.c.CoreContainer Security conf doesn't exist. Skipping setup for authorization module.
    [junit4] 2> 1006735 INFO (jetty-launcher-23109-thread-4) [n:127.0.0.1:41466_solr ] o.a.s.c.CoreContainer No authentication plugin used.
    [junit4] 2> 1006735 INFO (jetty-launcher-23109-thread-4) [n:127.0.0.1:41466_solr ] o.a.s.c.CorePropertiesLocator Looking for core definitions underneath /home/jenkins/workspace/Lucene-Solr-6.1-Linux/solr/build/solr-core/test/J0/temp/solr.security.BasicAuthIntegrationTest_3A33EBC4B9611095-001/tempDir-001/node4/.
    [junit4] 2> 1006735 INFO (jetty-launcher-23109-thread-4) [n:127.0.0.1:41466_solr ] o.a.s.c.CorePropertiesLocator Found 0 core definitions
    [junit4] 2> 1006736 INFO (jetty-launcher-23109-thread-2) [n:127.0.0.1:35480_solr ] o.a.s.s.SolrDispatchFilter user.dir=/home/jenkins/workspace/Lucene-Solr-6.1-Linux/solr/build/solr-core/test/J0
    [junit4] 2> 1006736 INFO (jetty-launcher-23109-thread-5) [n:127.0.0.1:39256_solr ] o.a.s.s.SolrDispatchFilter user.dir=/home/jenkins/workspace/Lucene-Solr-6.1-Linux/solr/build/solr-core/test/J0
    [junit4] 2> 1006737 INFO (jetty-launcher-23109-thread-2) [n:127.0.0.1:35480_solr ] o.a.s.s.SolrDispatchFilter SolrDispatchFilter.init() done
    [junit4] 2> 1006737 INFO (jetty-launcher-23109-thread-5) [n:127.0.0.1:39256_solr ] o.a.s.s.SolrDispatchFilter SolrDispatchFilter.init() done
    [junit4] 2> 1006737 INFO (jetty-launcher-23109-thread-4) [n:127.0.0.1:41466_solr ] o.a.s.s.SolrDispatchFilter user.dir=/home/jenkins/workspace/Lucene-Solr-6.1-Linux/solr/build/solr-core/test/J0
    [junit4] 2> 1006737 INFO (jetty-launcher-23109-thread-4) [n:127.0.0.1:41466_solr ] o.a.s.s.SolrDispatchFilter SolrDispatchFilter.init() done
    [junit4] 2> 1006743 INFO (jetty-launcher-23109-thread-3) [n:127.0.0.1:36028_solr ] o.a.s.c.OverseerAutoReplicaFailoverThread Starting OverseerAutoReplicaFailoverThread autoReplicaFailoverWorkLoopDelay=10000 autoReplicaFailoverWaitAfterExpiration=30000 autoReplicaFailoverBadNodeExpiration=60000
    [junit4] 2> 1006744 INFO (OverseerCollectionConfigSetProcessor-96074104082399243-127.0.0.1:36028_solr-n_0000000000) [n:127.0.0.1:36028_solr ] o.a.s.c.OverseerTaskProcessor Process current queue of overseer operations
    [junit4] 2> 1006744 INFO (jetty-launcher-23109-thread-3) [n:127.0.0.1:36028_solr ] o.a.s.c.ZkController Publish node=127.0.0.1:36028_solr as DOWN
    [junit4] 2> 1006744 INFO (OverseerStateUpdate-96074104082399243-127.0.0.1:36028_solr-n_0000000000) [n:127.0.0.1:36028_solr ] o.a.s.c.Overseer Starting to work on the main queue
    [junit4] 2> 1006747 INFO (OverseerStateUpdate-96074104082399243-127.0.0.1:36028_solr-n_0000000000) [n:127.0.0.1:36028_solr ] o.a.s.c.c.ZkStateReader Updated live nodes from ZooKeeper... (4) -> (4)
    [junit4] 2> 1006748 INFO (OverseerStateUpdate-96074104082399243-127.0.0.1:36028_solr-n_0000000000) [n:127.0.0.1:36028_solr ] o.a.s.c.Overseer processMessage: queueSize: 1, message = {
    [junit4] 2> "operation":"downnode",
    [junit4] 2> "node_name":"127.0.0.1:36028_solr"} current state version: 0
    [junit4] 2> 1006748 INFO (OverseerStateUpdate-96074104082399243-127.0.0.1:36028_solr-n_0000000000) [n:127.0.0.1:36028_solr ] o.a.s.c.o.NodeMutator DownNode state invoked for node: 127.0.0.1:36028_solr
    [junit4] 2> 1007747 INFO (jetty-launcher-23109-thread-3) [n:127.0.0.1:36028_solr ] o.a.s.c.ZkController Register node as live in ZooKeeper:/live_nodes/127.0.0.1:36028_solr
    [junit4] 2> 1007752 INFO (jetty-launcher-23109-thread-3) [n:127.0.0.1:36028_solr ] o.a.s.c.c.SolrZkClient makePath: /live_nodes/127.0.0.1:36028_solr
    [junit4] 2> 1007754 INFO (zkCallback-23131-thread-1-processing-n:127.0.0.1:36028_solr) [n:127.0.0.1:36028_solr ] o.a.s.c.c.ZkStateReader A live node change: [WatchedEvent state:SyncConnected type:NodeChildrenChanged path:/live_nodes], has occurred - updating... (live nodes size: [4])
    [junit4] 2> 1007754 INFO (zkCallback-23135-thread-1-processing-n:127.0.0.1:39256_solr) [n:127.0.0.1:39256_solr ] o.a.s.c.c.ZkStateReader A live node change: [WatchedEvent state:SyncConnected type:NodeChildrenChanged path:/live_nodes], has occurred - updating... (live nodes size: [4])
    [junit4] 2> 1007754 INFO (zkCallback-23132-thread-1-processing-n:127.0.0.1:41466_solr) [n:127.0.0.1:41466_solr ] o.a.s.c.c.ZkStateReader A live node change: [WatchedEvent state:SyncConnected type:NodeChildrenChanged path:/live_nodes], has occurred - updating... (live nodes size: [4])
    [junit4] 2> 1007754 INFO (zkCallback-23131-thread-1-processing-n:127.0.0.1:36028_solr) [n:127.0.0.1:36028_solr ] o.a.s.c.c.ZkStateReader Updated live nodes from ZooKeeper... (4) -> (5)
    [junit4] 2> 1007754 INFO (zkCallback-23135-thread-1-processing-n:127.0.0.1:39256_solr) [n:127.0.0.1:39256_solr ] o.a.s.c.c.ZkStateReader Updated live nodes from ZooKeeper... (4) -> (5)
    [junit4] 2> 1007754 INFO (zkCallback-23132-thread-1-processing-n:127.0.0.1:41466_solr) [n:127.0.0.1:41466_solr ] o.a.s.c.c.ZkStateReader Updated live nodes from ZooKeeper... (4) -> (5)
    [junit4] 2> 1007754 INFO (zkCallback-23134-thread-1-processing-n:127.0.0.1:42635_solr) [n:127.0.0.1:42635_solr ] o.a.s.c.c.ZkStateReader A live node change: [WatchedEvent state:SyncConnected type:NodeChildrenChanged path:/live_nodes], has occurred - updating... (live nodes size: [4])
    [junit4] 2> 1007754 INFO (zkCallback-23133-thread-1-processing-n:127.0.0.1:35480_solr) [n:127.0.0.1:35480_solr ] o.a.s.c.c.ZkStateReader A live node change: [WatchedEvent state:SyncConnected type:NodeChildrenChanged path:/live_nodes], has occurred - updating... (live nodes size: [4])
    [junit4] 2> 1007755 INFO (zkCallback-23134-thread-1-processing-n:127.0.0.1:42635_solr) [n:127.0.0.1:42635_solr ] o.a.s.c.c.ZkStateReader Updated live nodes from ZooKeeper... (4) -> (5)
    [junit4] 2> 1007755 INFO (zkCallback-23133-thread-1-processing-n:127.0.0.1:35480_solr) [n:127.0.0.1:35480_solr ] o.a.s.c.c.ZkStateReader Updated live nodes from ZooKeeper... (4) -> (5)
    [junit4] 2> 1007764 INFO (jetty-launcher-23109-thread-3) [n:127.0.0.1:36028_solr ] o.a.s.c.CoreContainer Security conf doesn't exist. Skipping setup for authorization module.
    [junit4] 2> 1007764 INFO (jetty-launcher-23109-thread-3) [n:127.0.0.1:36028_solr ] o.a.s.c.CoreContainer No authentication plugin used.
    [junit4] 2> 1007764 INFO (jetty-launcher-23109-thread-3) [n:127.0.0.1:36028_solr ] o.a.s.c.CorePropertiesLocator Looking for core definitions underneath /home/jenkins/workspace/Lucene-Solr-6.1-Linux/solr/build/solr-core/test/J0/temp/solr.security.BasicAuthIntegrationTest_3A33EBC4B9611095-001/tempDir-001/node3/.
    [junit4] 2> 1007765 INFO (jetty-launcher-23109-thread-3) [n:127.0.0.1:36028_solr ] o.a.s.c.CorePropertiesLocator Found 0 core definitions
    [junit4] 2> 1007765 INFO (jetty-launcher-23109-thread-3) [n:127.0.0.1:36028_solr ] o.a.s.s.SolrDispatchFilter user.dir=/home/jenkins/workspace/Lucene-Solr-6.1-Linux/solr/build/solr-core/test/J0
    [junit4] 2> 1007765 INFO (jetty-launcher-23109-thread-3) [n:127.0.0.1:36028_solr ] o.a.s.s.SolrDispatchFilter SolrDispatchFilter.init() done
    [junit4] 2> 1007765 INFO (TEST-BasicAuthIntegrationTest.testBasics-seed#[3A33EBC4B9611095]) [ ] o.a.s.c.c.SolrZkClient Using default ZkCredentialsProvider
    [junit4] 2> 1007766 INFO (TEST-BasicAuthIntegrationTest.testBasics-seed#[3A33EBC4B9611095]) [ ] o.a.s.c.c.ConnectionManager Waiting for client to connect to ZooKeeper
    [junit4] 2> 1007768 INFO (zkCallback-23141-thread-1) [ ] o.a.s.c.c.ConnectionManager Watcher org.apache.solr.common.cloud.ConnectionManager@f887278 name:ZooKeeperConnection Watcher:127.0.0.1:41339 got event WatchedEvent state:SyncConnected type:None path:null path:null type:None
    [junit4] 2> 1007768 INFO (TEST-BasicAuthIntegrationTest.testBasics-seed#[3A33EBC4B9611095]) [ ] o.a.s.c.c.ConnectionManager Client is connected to ZooKeeper
    [junit4] 2> 1007768 INFO (TEST-BasicAuthIntegrationTest.testBasics-seed#[3A33EBC4B9611095]) [ ] o.a.s.c.c.SolrZkClient Using default ZkACLProvider
    [junit4] 2> 1007770 INFO (TEST-BasicAuthIntegrationTest.testBasics-seed#[3A33EBC4B9611095]) [ ] o.a.s.c.s.i.CloudSolrClient Final constructed zkHost string: 127.0.0.1:41339/solr
    [junit4] 2> 1007770 INFO (TEST-BasicAuthIntegrationTest.testBasics-seed#[3A33EBC4B9611095]) [ ] o.e.j.s.ServerConnector Stopped ServerConnector@1a5157f2{HTTP/1.1,[http/1.1]}{127.0.0.1:0}
    [junit4] 2> 1007772 INFO (TEST-BasicAuthIntegrationTest.testBasics-seed#[3A33EBC4B9611095]) [ ] o.a.s.c.CoreContainer Shutting down CoreContainer instance=1063421554
    [junit4] 2> 1007772 INFO (TEST-BasicAuthIntegrationTest.testBasics-seed#[3A33EBC4B9611095]) [ ] o.a.s.c.ZkController Publish node=127.0.0.1:42635_solr as DOWN
    [junit4] 2> 1007776 INFO (OverseerStateUpdate-96074104082399243-127.0.0.1:36028_solr-n_0000000000) [n:127.0.0.1:36028_solr ] o.a.s.c.Overseer processMessage: queueSize: 1, message = {
    [junit4] 2> "operation":"downnode",
    [junit4] 2> "node_name":"127.0.0.1:42635_solr"} current state version: 0
    [junit4] 2> 1007776 INFO (OverseerStateUpdate-96074104082399243-127.0.0.1:36028_solr-n_0000000000) [n:127.0.0.1:36028_solr ] o.a.s.c.o.NodeMutator DownNode state invoked for node: 127.0.0.1:42635_solr
    [junit4] 2> 1007778 INFO (zkCallback-23131-thread-2-processing-n:127.0.0.1:36028_solr) [n:127.0.0.1:36028_solr ] o.a.s.c.c.ZkStateReader A live node change: [WatchedEvent state:SyncConnected type:NodeChildrenChanged path:/live_nodes], has occurred - updating... (live nodes size: [5])
    [junit4] 2> 1007778 INFO (zkCallback-23132-thread-1-processing-n:127.0.0.1:41466_solr) [n:127.0.0.1:41466_solr ] o.a.s.c.c.ZkStateReader A live node change: [WatchedEvent state:SyncConnected type:NodeChildrenChanged path:/live_nodes], has occurred - updating... (live nodes size: [5])
    [junit4] 2> 1007778 INFO (zkCallback-23134-thread-1-processing-n:127.0.0.1:42635_solr) [n:127.0.0.1:42635_solr ] o.a.s.c.c.ZkStateReader A live node change: [WatchedEvent state:SyncConnected type:NodeChildrenChanged path:/live_nodes], has occurred - updating... (live nodes size: [5])
    [junit4] 2> 1007778 INFO (zkCallback-23133-thread-1-processing-n:127.0.0.1:35480_solr) [n:127.0.0.1:35480_solr ] o.a.s.c.c.ZkStateReader A live node change: [WatchedEvent state:SyncConnected type:NodeChildrenChanged path:/live_nodes], has occurred - updating... (live nodes size: [5])
    [junit4] 2> 1007778 INFO (zkCallback-23131-thread-2-processing-n:127.0.0.1:36028_solr) [n:127.0.0.1:36028_solr ] o.a.s.c.c.ZkStateReader Updated live nodes from ZooKeeper... (5) -> (4)
    [junit4] 2> 1007778 WARN (zkCallback-23134-thread-1-processing-n:127.0.0.1:42635_solr) [n:127.0.0.1:42635_solr ] o.a.s.c.c.ZkStateReader ZooKeeper watch triggered, but Solr cannot talk to ZK: [KeeperErrorCode = Session expired for /live_nodes]
    [junit4] 2> 1007779 INFO (zkCallback-23135-thread-2-processing-n:127.0.0.1:39256_solr) [n:127.0.0.1:39256_solr ] o.a.s.c.c.ZkStateReader A live node change: [WatchedEvent state:SyncConnected type:NodeChildrenChanged path:/live_nodes], has occurred - updating... (live nodes size: [5])
    [junit4] 2> 1007779 INFO (TEST-BasicAuthIntegrationTest.testBasics-seed#[3A33EBC4B9611095]) [ ] o.e.j.s.h.ContextHandler Stopped o.e.j.s.ServletContextHandler@385ede05{/solr,null,UNAVAILABLE}
    [junit4] 2> 1007779 INFO (zkCallback-23132-thread-1-processing-n:127.0.0.1:41466_solr) [n:127.0.0.1:41466_solr ] o.a.s.c.c.ZkStateReader Updated live nodes from ZooKeeper... (5) -> (4)
    [junit4] 2> 1007779 INFO (zkCallback-23133-thread-1-processing-n:127.0.0.1:35480_solr) [n:127.0.0.1:35480_solr ] o.a.s.c.c.ZkStateReader Updated live nodes from ZooKeeper... (5) -> (4)
    [junit4] 2> 1007779 INFO (zkCallback-23135-thread-2-processing-n:127.0.0.1:39256_solr) [n:127.0.0.1:39256_solr ] o.a.s.c.c.ZkStateReader Updated live nodes from ZooKeeper... (5) -> (4)
    [junit4] 2> 1007780 INFO (zkCallback-23135-thread-1-processing-n:127.0.0.1:39256_solr) [n:127.0.0.1:39256_solr ] o.a.s.c.LeaderElector Watching path /overseer_elect/election/96074104082399244-127.0.0.1:41466_solr-n_0000000002 to know if I could be the leader
    [junit4] 2> 1007780 INFO (TEST-BasicAuthIntegrationTest.testBasics-seed#[3A33EBC4B9611095]) [ ] o.e.j.s.Server jetty-9.3.8.v20160314
    [junit4] 2> 1007781 INFO (TEST-BasicAuthIntegrationTest.testBasics-seed#[3A33EBC4B9611095]) [ ] o.e.j.s.h.ContextHandler Started o.e.j.s.ServletContextHandler@193fb91c{/solr,null,AVAILABLE}
    [junit4] 2> 1007781 INFO (TEST-BasicAuthIntegrationTest.testBasics-seed#[3A33EBC4B9611095]) [ ] o.e.j.s.ServerConnector Started ServerConnector@9381859{HTTP/1.1,[http/1.1]}{127.0.0.1:40365}
    [junit4] 2> 1007781 INFO (TEST-BasicAuthIntegrationTest.testBasics-seed#[3A33EBC4B9611095]) [ ] o.e.j.s.Server Started @1009811ms
    [junit4] 2> 1007781 INFO (TEST-BasicAuthIntegrationTest.testBasics-seed#[3A33EBC4B9611095]) [ ] o.a.s.c.s.e.JettySolrRunner Jetty properties: {hostContext=/solr, hostPort=40365}
    [junit4] 2> 1007782 INFO (TEST-BasicAuthIntegrationTest.testBasics-seed#[3A33EBC4B9611095]) [ ] o.a.s.s.SolrDispatchFilter SolrDispatchFilter.init(): sun.misc.Launcher$AppClassLoader@73d16e93
    [junit4] 2> 1007782 INFO (TEST-BasicAuthIntegrationTest.testBasics-seed#[3A33EBC4B9611095]) [ ] o.a.s.c.SolrResourceLoader new SolrResourceLoader for directory: '/home/jenkins/workspace/Lucene-Solr-6.1-Linux/solr/build/solr-core/test/J0/temp/solr.security.BasicAuthIntegrationTest_3A33EBC4B9611095-001/tempDir-001/node6'
    [junit4] 2> 1007782 INFO (TEST-BasicAuthIntegrationTest.testBasics-seed#[3A33EBC4B9611095]) [ ] o.a.s.c.SolrResourceLoader JNDI not configured for solr (NoInitialContextEx)
    [junit4] 2> 1007782 INFO (TEST-BasicAuthIntegrationTest.testBasics-seed#[3A33EBC4B9611095]) [ ] o.a.s.c.SolrResourceLoader solr home defaulted to 'solr/' (could not find system property or JNDI)
    [junit4] 2> 1007782 INFO (TEST-BasicAuthIntegrationTest.testBasics-seed#[3A33EBC4B9611095]) [ ] o.a.s.c.c.SolrZkClient Using default ZkCredentialsProvider
    [junit4] 2> 1007782 INFO (TEST-BasicAuthIntegrationTest.testBasics-seed#[3A33EBC4B9611095]) [ ] o.a.s.c.c.ConnectionManager Waiting for client to connect to ZooKeeper
    [junit4] 2> 1007785 INFO (zkCallback-23143-thread-1) [ ] o.a.s.c.c.ConnectionManager Watcher org.apache.solr.common.cloud.ConnectionManager@57380c0a name:ZooKeeperConnection Watcher:127.0.0.1:41339/solr got event WatchedEvent state:SyncConnected type:None path:null path:null type:None
    [junit4] 2> 1007785 INFO (TEST-BasicAuthIntegrationTest.testBasics-seed#[3A33EBC4B9611095]) [ ] o.a.s.c.c.ConnectionManager Client is connected to ZooKeeper
    [junit4] 2> 1007786 INFO (TEST-BasicAuthIntegrationTest.testBasics-seed#[3A33EBC4B9611095]) [ ] o.a.s.c.c.SolrZkClient Using default ZkACLProvider
    [junit4] 2> 1007786 INFO (TEST-BasicAuthIntegrationTest.testBasics-seed#[3A33EBC4B9611095]) [ ] o.a.s.s.SolrDispatchFilter solr.xml found in ZooKeeper. Loading...
    [junit4] 2> 1007791 INFO (TEST-BasicAuthIntegrationTest.testBasics-seed#[3A33EBC4B9611095]) [ ] o.a.s.c.CorePropertiesLocator Config-defined core root directory: /home/jenkins/workspace/Lucene-Solr-6.1-Linux/solr/build/solr-core/test/J0/temp/solr.security.BasicAuthIntegrationTest_3A33EBC4B9611095-001/tempDir-001/node6/.
    [junit4] 2> 1007791 INFO (TEST-BasicAuthIntegrationTest.testBasics-seed#[3A33EBC4B9611095]) [ ] o.a.s.c.CoreContainer New CoreContainer 2099271091
    [junit4] 2> 1007791 INFO (TEST-BasicAuthIntegrationTest.testBasics-seed#[3A33EBC4B9611095]) [ ] o.a.s.c.CoreContainer Loading cores into CoreContainer [instanceDir=/home/jenkins/workspace/Lucene-Solr-6.1-Linux/solr/build/solr-core/test/J0/temp/solr.security.BasicAuthIntegrationTest_3A33EBC4B9611095-001/tempDir-001/node6]
    [junit4] 2> 1007791 WARN (TEST-BasicAuthIntegrationTest.testBasics-seed#[3A33EBC4B9611095]) [ ] o.a.s.c.CoreContainer Couldn't add files from /home/jenkins/workspace/Lucene-Solr-6.1-Linux/solr/build/solr-core/test/J0/temp/solr.security.BasicAuthIntegrationTest_3A33EBC4B9611095-001/tempDir-001/node6/lib to classpath: /home/jenkins/workspace/Lucene-Solr-6.1-Linux/solr/build/solr-core/test/J0/temp/solr.security.BasicAuthIntegrationTest_3A33EBC4B9611095-001/tempDir-001/node6/lib
    [junit4] 2> 1007792 INFO (TEST-BasicAuthIntegrationTest.testBasics-seed#[3A33EBC4B9611095]) [ ] o.a.s.h.c.HttpShardHandlerFactory created with socketTimeout : 90000,urlScheme : ,connTimeout : 15000,maxConnectionsPerHost : 20,maxConnections : 10000,corePoolSize : 0,maximumPoolSize : 2147483647,maxThreadIdleTime : 5,sizeOfQueue : -1,fairnessPolicy : false,useRetries : false,
    [junit4] 2> 1007793 INFO (TEST-BasicAuthIntegrationTest.testBasics-seed#[3A33EBC4B9611095]) [ ] o.a.s.u.UpdateShardHandler Creating UpdateShardHandler HTTP client with params: socketTimeout=340000&connTimeout=45000&retry=true
    [junit4] 2> 1007793 INFO (TEST-BasicAuthIntegrationTest.testBasics-seed#[3A33EBC4B9611095]) [ ] o.a.s.l.LogWatcher SLF4J impl is org.slf4j.impl.Log4jLoggerFactory
    [junit4] 2> 1007793 INFO (TEST-BasicAuthIntegrationTest.testBasics-seed#[3A33EBC4B9611095]) [ ] o.a.s.l.LogWatcher Registering Log Listener [Log4j (org.slf4j.impl.Log4jLoggerFactory)]
    [junit4] 2> 1007793 INFO (TEST-BasicAuthIntegrationTest.testBasics-seed#[3A33EBC4B9611095]) [ ] o.a.s.c.ZkContainer Zookeeper client=127.0.0.1:41339/solr
    [junit4] 2> 1007793 INFO (TEST-BasicAuthIntegrationTest.testBasics-seed#[3A33EBC4B9611095]) [ ] o.a.s.c.ZkController zkHost includes chroot
    [junit4] 2> 1007793 INFO (TEST-BasicAuthIntegrationTest.testBasics-seed#[3A33EBC4B9611095]) [ ] o.a.s.c.c.SolrZkClient Using default ZkCredentialsProvider
    [junit4] 2> 1007794 INFO (TEST-BasicAuthIntegrationTest.testBasics-seed#[3A33EBC4B9611095]) [ ] o.a.s.c.c.ConnectionManager Waiting for client to connect to ZooKeeper
    [junit4] 2> 1007796 INFO (zkCallback-23146-thread-1) [ ] o.a.s.c.c.ConnectionManager Watcher org.apache.solr.common.cloud.ConnectionManager@2fb13fc9 name:ZooKeeperConnection Watcher:127.0.0.1:41339 got event WatchedEvent state:SyncConnected type:None path:null path:null type:None
    [junit4] 2> 1007797 INFO (TEST-BasicAuthIntegrationTest.testBasics-seed#[3A33EBC4B9611095]) [ ] o.a.s.c.c.ConnectionManager Client is connected to ZooKeeper
    [junit4] 2> 1007798 INFO (TEST-BasicAuthIntegrationTest.testBasics-seed#[3A33EBC4B9611095]) [ ] o.a.s.c.c.SolrZkClient Using default ZkACLProvider
    [junit4] 2> 1007812 INFO (TEST-BasicAuthIntegrationTest.testBasics-seed#[3A33EBC4B9611095]) [n:127.0.0.1:40365_solr ] o.a.s.c.ZkController Added new OnReconnect listener org.apache.solr.cloud.ZkController$$Lambda$67/411969294@6dd05e3c
    [junit4] 2> 1007812 INFO (TEST-BasicAuthIntegrationTest.testBasics-seed#[3A33EBC4B9611095]) [n:127.0.0.1:40365_solr ] o.a.s.c.c.ConnectionManager Waiting for client to connect to ZooKeeper
    [junit4] 2> 1007827 INFO (zkCallback-23147-thread-1-processing-n:127.0.0.1:40365_solr) [n:127.0.0.1:40365_solr ] o.a.s.c.c.ConnectionManager Watcher org.apache.solr.common.cloud.ConnectionManager@1bf64353 name:ZooKeeperConnection Watcher:127.0.0.1:41339/solr got event WatchedEvent state:SyncConnected type:None path:null path:null type:None
    [junit4] 2> 1007827 INFO (TEST-BasicAuthIntegrationTest.testBasics-seed#[3A33EBC4B9611095]) [n:127.0.0.1:40365_solr ] o.a.s.c.c.ConnectionManager Client is connected to ZooKeeper
    [junit4] 2> 1007840 INFO (TEST-BasicAuthIntegrationTest.testBasics-seed#[3A33EBC4B9611095]) [n:127.0.0.1:40365_solr ] o.a.s.c.c.ZkStateReader Updating cluster state from ZooKeeper...
    [junit4] 2> 1007840 INFO (TEST-BasicAuthIntegrationTest.testBasics-seed#[3A33EBC4B9611095]) [n:127.0.0.1:40365_solr ] o.a.s.c.c.ZkStateReader Loaded empty cluster properties
    [junit4] 2> 1007840 INFO (TEST-BasicAuthIntegrationTest.testBasics-seed#[3A33EBC4B9611095]) [n:127.0.0.1:40365_solr ] o.a.s.c.c.ZkStateReader Updated live nodes from ZooKeeper... (0) -> (4)
    [junit4] 2> 1007841 INFO (TEST-BasicAuthIntegrationTest.testBasics-seed#[3A33EBC4B9611095]) [n:127.0.0.1:40365_solr ] o.a.s.c.Overseer Overseer (id=null) closing
    [junit4] 2> 1007842 INFO (TEST-BasicAuthIntegrationTest.testBasics-seed#[3A33EBC4B9611095]) [n:127.0.0.1:40365_solr ] o.a.s.c.LeaderElector Joined leadership election with path: /overseer_elect/election/96074104082399251-127.0.0.1:40365_solr-n_0000000005
    [junit4] 2> 1007843 INFO (TEST-BasicAuthIntegrationTest.testBasics-seed#[3A33EBC4B9611095]) [n:127.0.0.1:40365_solr ] o.a.s.c.LeaderElector Watching path /overseer_elect/election/96074104082399246-127.0.0.1:39256_solr-n_0000000004 to know if I could be the leader
    [junit4] 2> 1007843 INFO (TEST-BasicAuthIntegrationTest.testBasics-seed#[3A33EBC4B9611095]) [n:127.0.0.1:40365_solr ] o.a.s.c.ZkController Publish node=127.0.0.1:40365_solr as DOWN
    [junit4] 2> 1007853 INFO (OverseerStateUpdate-96074104082399243-127.0.0.1:36028_solr-n_0000000000) [n:127.0.0.1:36028_solr ] o.a.s.c.Overseer processMessage: queueSize: 1, message = {
    [junit4] 2> "operation":"downnode",
    [junit4] 2> "node_name":"127.0.0.1:40365_solr"} current state version: 0
    [junit4] 2> 1007853 INFO (OverseerStateUpdate-96074104082399243-127.0.0.1:36028_solr-n_0000000000) [n:127.0.0.1:36028_solr ] o.a.s.c.o.NodeMutator DownNode state invoked for node: 127.0.0.1:40365_solr
    [junit4] 2> 1008853 INFO (TEST-BasicAuthIntegrationTest.testBasics-seed#[3A33EBC4B9611095]) [n:127.0.0.1:40365_solr ] o.a.s.c.ZkController Register node as live in ZooKeeper:/live_nodes/127.0.0.1:40365_solr
    [junit4] 2> 1008857 INFO (TEST-BasicAuthIntegrationTest.testBasics-seed#[3A33EBC4B9611095]) [n:127.0.0.1:40365_solr ] o.a.s.c.c.SolrZkClient makePath: /live_nodes/127.0.0.1:40365_solr
    [junit4] 2> 1008859 INFO (zkCallback-23131-thread-2-processing-n:127.0.0.1:36028_solr) [n:127.0.0.1:36028_solr ] o.a.s.c.c.ZkStateReader A live node change: [WatchedEvent state:SyncConnected type:NodeChildrenChanged path:/live_nodes], has occurred - updating... (live nodes size: [4])
    [junit4] 2> 1008859 INFO (zkCallback-23147-thread-1-processing-n:127.0.0.1:40365_solr) [n:127.0.0.1:40365_solr ] o.a.s.c.c.ZkStateReader A live node change: [WatchedEvent state:SyncConnected type:NodeChildrenChanged path:/live_nodes], has occurred - updating... (live nodes size: [4])
    [junit4] 2> 1008859 INFO (zkCallback-23133-thread-1-processing-n:127.0.0.1:35480_solr) [n:127.0.0.1:35480_solr ] o.a.s.c.c.ZkStateReader A live node change: [WatchedEvent state:SyncConnected type:NodeChildrenChanged path:/live_nodes], has occurred - updating... (live nodes size: [4])
    [junit4] 2> 1008859 INFO (zkCallback-23132-thread-1-processing-n:127.0.0.1:41466_solr) [n:127.0.0.1:41466_solr ] o.a.s.c.c.ZkStateReader A live node change: [WatchedEvent state:SyncConnected type:NodeChildrenChanged path:/live_nodes], has occurred - updating... (live nodes size: [4])
    [junit4] 2> 1008859 INFO (zkCallback-23135-thread-1-processing-n:127.0.0.1:39256_solr) [n:127.0.0.1:39256_solr ] o.a.s.c.c.ZkStateReader A live node change: [WatchedEvent state:SyncConnected type:NodeChildrenChanged path:/live_nodes], has occurred - updating... (live nodes size: [4])
    [junit4] 2> 1008860 INFO (zkCallback-23147-thread-1-processing-n:127.0.0.1:40365_solr) [n:127.0.0.1:40365_solr ] o.a.s.c.c.ZkStateReader Updated live nodes from ZooKeeper... (4) -> (5)
    [junit4] 2> 1008859 INFO (zkCallback-23131-thread-2-processing-n:127.0.0.1:36028_solr) [n:127.0.0.1:36028_solr ] o.a.s.c.c.ZkStateReader Updated live nodes from ZooKeeper... (4) -> (5)
    [junit4] 2> 1008860 INFO (zkCallback-23133-thread-1-processing-n:127.0.0.1:35480_solr) [n:127.0.0.1:35480_solr ] o.a.s.c.c.ZkStateReader Updated live nodes from ZooKeeper... (4) -> (5)
    [junit4] 2> 1008860 INFO (zkCallback-23132-thread-1-processing-n:127.0.0.1:41466_solr) [n:127.0.0.1:41466_solr ] o.a.s.c.c.ZkStateReader Updated live nodes from ZooKeeper... (4) -> (5)
    [junit4] 2> 1008860 INFO (zkCallback-23135-thread-1-processing-n:127.0.0.1:39256_solr) [n:127.0.0.1:39256_solr ] o.a.s.c.c.ZkStateReader Updated live nodes from ZooKeeper... (4) -> (5)
    [junit4] 2> 1008883 INFO (TEST-BasicAuthIntegrationTest.testBasics-seed#[3A33EBC4B9611095]) [n:127.0.0.1:40365_solr ] o.a.s.c.CoreContainer Security conf doesn't exist. Skipping setup for authorization module.
    [junit4] 2> 1008884 INFO (TEST-BasicAuthIntegrationTest.testBasics-seed#[3A33EBC4B9611095]) [n:127.0.0.1:40365_solr ] o.a.s.c.CoreContainer No authentication plugin used.
    [junit4] 2> 1008884 INFO (TEST-BasicAuthIntegrationTest.testBasics-seed#[3A33EBC4B9611095]) [n:127.0.0.1:40365_solr ] o.a.s.c.CorePropertiesLocator Looking for core definitions underneath /home/jenkins/workspace/Lucene-Solr-6.1-Linux/solr/build/solr-core/test/J0/temp/solr.security.BasicAuthIntegrationTest_3A33EBC4B9611095-001/tempDir-001/node6/.
    [junit4] 2> 1008885 INFO (TEST-BasicAuthIntegrationTest.testBasics-seed#[3A33EBC4B9611095]) [n:127.0.0.1:40365_solr ] o.a.s.c.CorePropertiesLocator Found 0 core definitions
    [junit4] 2> 1008885 INFO (TEST-BasicAuthIntegrationTest.testBasics-seed#[3A33EBC4B9611095]) [n:127.0.0.1:40365_solr ] o.a.s.s.SolrDispatchFilter user.dir=/home/jenkins/workspace/Lucene-Solr-6.1-Linux/solr/build/solr-core/test/J0
    [junit4] 2> 1008885 INFO (TEST-BasicAuthIntegrationTest.testBasics-seed#[3A33EBC4B9611095]) [n:127.0.0.1:40365_solr ] o.a.s.s.SolrDispatchFilter SolrDispatchFilter.init() done
    [junit4] 2> 1008886 INFO (TEST-BasicAuthIntegrationTest.testBasics-seed#[3A33EBC4B9611095]) [ ] o.a.s.c.c.SolrZkClient Using default ZkCredentialsProvider
    [junit4] 2> 1008886 INFO (TEST-BasicAuthIntegrationTest.testBasics-seed#[3A33EBC4B9611095]) [ ] o.a.s.c.c.ConnectionManager Waiting for client to connect to ZooKeeper
    [junit4] 2> 1008888 INFO (zkCallback-23149-thread-1) [ ] o.a.s.c.c.ConnectionManager Watcher org.apache.solr.common.cloud.ConnectionManager@6fd7494c name:ZooKeeperConnection Watcher:127.0.0.1:41339/solr got event WatchedEvent state:SyncConnected type:None path:null path:null type:None
    [junit4] 2> 1008888 INFO (TEST-BasicAuthIntegrationTest.testBasics-seed#[3A33EBC4B9611095]) [ ] o.a.s.c.c.ConnectionManager Client is connected to ZooKeeper
    [junit4] 2> 1008888 INFO (TEST-BasicAuthIntegrationTest.testBasics-seed#[3A33EBC4B9611095]) [ ] o.a.s.c.c.SolrZkClient Using default ZkACLProvider
    [junit4] 2> 1008889 INFO (TEST-BasicAuthIntegrationTest.testBasics-seed#[3A33EBC4B9611095]) [ ] o.a.s.c.c.SolrZkClient makePath: /configs/solrCloudCollectionConfig/protwords.txt
    [junit4] 2> 1008925 INFO (TEST-BasicAuthIntegrationTest.testBasics-seed#[3A33EBC4B9611095]) [ ] o.a.s.c.c.SolrZkClient makePath: /configs/solrCloudCollectionConfig/solrconfig-delaying-component.xml
    [junit4] 2> 1008928 INFO (TEST-BasicAuthIntegrationTest.testBasics-seed#[3A33EBC4B9611095]) [ ] o.a.s.c.c.SolrZkClient makePath: /configs/solrCloudCollectionConfig/bad_solrconfig.xml
    [junit4] 2> 1008942 INFO (TEST-BasicAuthIntegrationTest.testBasics-seed#[3A33EBC4B9611095]) [ ] o.a.s.c.c.SolrZkClient makePath: /configs/solrCloudCollectionConfig/solrconfig-sortingmergepolicyfactory.xml
    [junit4] 2> 1008944 INFO (TEST-BasicAuthIntegrationTest.testBasics-seed#[3A33EBC4B9611095]) [ ] o.a.s.c.c.SolrZkClient makePath: /configs/solrCloudCollectionConfig/solrconfig-nocache.xml
    [junit4] 2> 1008956 INFO (TEST-BasicAuthIntegrationTest.testBasics-seed#[3A33EBC4B9611095]) [ ] o.a.s.c.c.SolrZkClient makePath: /configs/solrCloudCollectionConfig/solrconfig-implicitproperties.xml
    [junit4] 2> 1008958 INFO (TEST-BasicAuthIntegrationTest.testBasics-seed#[3A33EBC4B9611095]) [ ] o.a.s.c.c.SolrZkClient makePath: /configs/solrCloudCollectionConfig/solrconfig-mergepolicy-legacy.xml
    [junit4] 2> 1008969 INFO (TEST-BasicAuthIntegrationTest.testBasics-seed#[3A33EBC4B9611095]) [ ] o.a.s.c.c.SolrZkClient makePath: /configs/solrCloudCollectionConfig/bad-schema-uniquekey-uses-default.xml
    [junit4] 2> 1008972 INFO (TEST-BasicAuthIntegrationTest.testBasics-seed#[3A33EBC4B9611095]) [ ] o.a.s.c.c.SolrZkClient makePath: /configs/solrCloudCollectionConfig/bad-schema-sim-default-has-no-explicit-sim.xml
    [junit4] 2> 1008974 INFO (TEST-BasicAuthIntegrationTest.testBasics-seed#[3A33EBC4B9611095]) [ ] o.a.s.c.c.SolrZkClient makePath: /configs/solrCloudCollectionConfig/bad-schema-uniquekey-multivalued.xml
    [junit4] 2> 1008980 INFO (TEST-BasicAuthIntegrationTest.testBasics-seed#[3A33EBC4B9611095]) [ ] o.a.s.c.c.SolrZkClient makePath: /configs/solrCloudCollectionConfig/analyzingInfixSuggest.txt
    [junit4] 2> 1008984 INFO (TEST-BasicAuthIntegrationTest.testBasics-seed#[3A33EBC4B9611095]) [ ] o.a.s.c.c.SolrZkClient makePath: /configs/solrCloudCollectionConfig/missleading.extension.updateprocessor.js.txt
    [junit4] 2> 1008986 INFO (TEST-BasicAuthIntegrationTest.testBasics-seed#[3A33EBC4B9611095]) [ ] o.a.s.c.c.SolrZkClient makePath: /configs/solrCloudCollectionConfig/bad-schema-multiple-asterisk-copyfield-source-should-fail-test.xml
    [junit4] 2> 1008996 INFO (TEST-BasicAuthIntegrationTest.testBasics-seed#[3A33EBC4B9611095]) [ ] o.a.s.c.c.SolrZkClient makePath: /configs/solrCloudCollectionConfig/schema-replication2.xml
    [junit4] 2> 1009008 INFO (TEST-BasicAuthIntegrationTest.testBasics-seed#[3A33EBC4B9611095]) [ ] o.a.s.c.c.SolrZkClient makePath: /configs/solrCloudCollectionConfig/solrconfig-infostream-logging.xml
    [junit4] 2> 1009021 INFO (TEST-BasicAuthIntegrationTest.testBasics-seed#[3A33EBC4B9611095]) [ ] o.a.s.c.c.SolrZkClient makePath: /configs/solrCloudCollectionConfig/solrconfig-collapseqparser.xml
    [junit4] 2> 1009036 INFO (TEST-BasicAuthIntegrationTest.testBasics-seed#[3A33EBC4B9611095]) [ ] o.a.s.c.c.SolrZkClient makePath: /configs/solrCloudCollectionConfig/bad-schema-currency-ft-bogus-code-in-xml.xml
    [junit4] 2> 1009048 INFO (TEST-BasicAuthIntegrationTest.testBasics-seed#[3A33EBC4B9611095]) [ ] o.a.s.c.c.SolrZkClient makePath: /configs/solrCloudCollectionConfig/old_synonyms.txt
    [junit4] 2> 1009050 INFO (TEST-BasicAuthIntegrationTest.testBasics-seed#[3A33EBC4B9611095]) [ ] o.a.s.c.c.SolrZkClient makePath: /configs/solrCloudCollectionConfig/enumsConfig.xml
    [junit4] 2> 1009052 INFO (TEST-BasicAuthIntegrationTest.testBasics-seed#[3A33EBC4B9611095]) [ ] o.a.s.c.c.SolrZkClient makePath: /configs/solrCloudCollectionConfig/solrconfig-script-updateprocessor.xml
    [junit4] 2> 1009073 INFO (TEST-BasicAuthIntegrationTest.testBasics-seed#[3A33EBC4B9611095]) [ ] o.a.s.c.c.SolrZkClient makePath: /configs/solrCloudCollectionConfig/schema-add-schema-fields-update-processor.xml
    [junit4] 2> 1009075 INFO (TEST-BasicAuthIntegrationTest.testBasics-seed#[3A33EBC4B9611095]) [ ] o.a.s.c.c.SolrZkClient makePath: /configs/solrCloudCollectionConfig/solrconfig-mergepolicyfactory-nocfs.xml
    [junit4] 2> 1009081 INFO (TEST-BasicAuthIntegrationTest.testBasics-seed#[3A33EBC4B9611095]) [ ] o.a.s.c.c.SolrZkClient makePath: /configs/solrCloudCollectionConfig/bad-schema-sweetspot-both-tf.xml
    [junit4] 2> 1009083 INFO (TEST-BasicAuthIntegrationTest.testBasics-seed#[3A33EBC4B9611095]) [ ] o.a.s.c.c.SolrZkClient makePath: /configs/solrCloudCollectionConfig/schema-phrasesuggest.xml
    [junit4] 2> 1009095 INFO (TEST-BasicAuthIntegrationTest.testBasics-seed#[3A33EBC4B9611095]) [ ] o.a.s.c.c.SolrZkClient makePath: /configs/solrCloudCollectionConfig/solrconfig.xml
    [junit4] 2> 1009126 INFO (TEST-BasicAuthIntegrationTest.testBasics-seed#[3A33EBC4B9611095]) [ ] o.a.s.c.c.SolrZkClient makePath: /configs/solrCloudCollectionConfig/solrconfig-delpolicy1.xml
    [junit4] 2> 1009133 INFO (TEST-BasicAuthIntegrationTest.testBasics-seed#[3A33EBC4B9611095]) [ ] o

[...truncated too long message...]

1_replica1] o.a.s.c.CachingDirectoryFactory Closing RAMDirectoryFactory - 2 directories currently being tracked
    [junit4] 2> 8227837 INFO (coreCloseExecutor-7923-thread-1) [n:127.0.0.1:41466_solr c:testSolrCloudCollection s:shard1 r:core_node2 x:testSolrCloudCollection_shard1_replica1] o.a.s.c.CachingDirectoryFactory looking to close data [CachedDir<<refCount=0;path=data;done=false>>]
    [junit4] 2> 8227837 INFO (coreCloseExecutor-7923-thread-1) [n:127.0.0.1:41466_solr c:testSolrCloudCollection s:shard1 r:core_node2 x:testSolrCloudCollection_shard1_replica1] o.a.s.c.CachingDirectoryFactory Closing directory, CoreContainer#isShutdown=true
    [junit4] 2> 8227837 INFO (coreCloseExecutor-7923-thread-1) [n:127.0.0.1:41466_solr c:testSolrCloudCollection s:shard1 r:core_node2 x:testSolrCloudCollection_shard1_replica1] o.a.s.c.CachingDirectoryFactory Closing directory: data
    [junit4] 2> 8227838 INFO (coreCloseExecutor-7923-thread-1) [n:127.0.0.1:41466_solr c:testSolrCloudCollection s:shard1 r:core_node2 x:testSolrCloudCollection_shard1_replica1] o.a.s.c.CachingDirectoryFactory looking to close data/index [CachedDir<<refCount=0;path=data/index;done=false>>]
    [junit4] 2> 8227838 INFO (coreCloseExecutor-7923-thread-1) [n:127.0.0.1:41466_solr c:testSolrCloudCollection s:shard1 r:core_node2 x:testSolrCloudCollection_shard1_replica1] o.a.s.c.CachingDirectoryFactory Closing directory, CoreContainer#isShutdown=true
    [junit4] 2> 8227838 INFO (coreCloseExecutor-7923-thread-1) [n:127.0.0.1:41466_solr c:testSolrCloudCollection s:shard1 r:core_node2 x:testSolrCloudCollection_shard1_replica1] o.a.s.c.CachingDirectoryFactory Closing directory: data/index
    [junit4] 2> 8227842 INFO (coreCloseExecutor-7922-thread-1) [n:127.0.0.1:35480_solr c:testSolrCloudCollection s:shard2 r:core_node4 x:testSolrCloudCollection_shard2_replica1] o.a.s.c.CachingDirectoryFactory Closing RAMDirectoryFactory - 2 directories currently being tracked
    [junit4] 2> 8227842 INFO (coreCloseExecutor-7922-thread-1) [n:127.0.0.1:35480_solr c:testSolrCloudCollection s:shard2 r:core_node4 x:testSolrCloudCollection_shard2_replica1] o.a.s.c.CachingDirectoryFactory looking to close data [CachedDir<<refCount=0;path=data;done=false>>]
    [junit4] 2> 8227842 INFO (coreCloseExecutor-7922-thread-1) [n:127.0.0.1:35480_solr c:testSolrCloudCollection s:shard2 r:core_node4 x:testSolrCloudCollection_shard2_replica1] o.a.s.c.CachingDirectoryFactory Closing directory, CoreContainer#isShutdown=true
    [junit4] 2> 8227843 INFO (coreCloseExecutor-7922-thread-1) [n:127.0.0.1:35480_solr c:testSolrCloudCollection s:shard2 r:core_node4 x:testSolrCloudCollection_shard2_replica1] o.a.s.c.CachingDirectoryFactory Closing directory: data
    [junit4] 2> 8227843 INFO (coreCloseExecutor-7922-thread-1) [n:127.0.0.1:35480_solr c:testSolrCloudCollection s:shard2 r:core_node4 x:testSolrCloudCollection_shard2_replica1] o.a.s.c.CachingDirectoryFactory looking to close data/index [CachedDir<<refCount=0;path=data/index;done=false>>]
    [junit4] 2> 8227843 INFO (coreCloseExecutor-7922-thread-1) [n:127.0.0.1:35480_solr c:testSolrCloudCollection s:shard2 r:core_node4 x:testSolrCloudCollection_shard2_replica1] o.a.s.c.CachingDirectoryFactory Closing directory, CoreContainer#isShutdown=true
    [junit4] 2> 8227843 INFO (coreCloseExecutor-7922-thread-1) [n:127.0.0.1:35480_solr c:testSolrCloudCollection s:shard2 r:core_node4 x:testSolrCloudCollection_shard2_replica1] o.a.s.c.CachingDirectoryFactory Closing directory: data/index
    [junit4] 2> 8227849 INFO (jetty-launcher-23109-thread-9) [ ] o.a.s.c.Overseer Overseer (id=96074104082399243-127.0.0.1:36028_solr-n_0000000000) closing
    [junit4] 2> 8227849 INFO (jetty-launcher-23109-thread-7) [ ] o.e.j.s.h.ContextHandler Stopped o.e.j.s.ServletContextHandler@2622047f{/solr,null,UNAVAILABLE}
    [junit4] 2> 8227855 INFO (jetty-launcher-23109-thread-6) [ ] o.e.j.s.h.ContextHandler Stopped o.e.j.s.ServletContextHandler@59f1fca{/solr,null,UNAVAILABLE}
    [junit4] 2> 8227855 INFO (jetty-launcher-23109-thread-9) [ ] o.e.j.s.h.ContextHandler Stopped o.e.j.s.ServletContextHandler@633d97b{/solr,null,UNAVAILABLE}
    [junit4] 2> 8227900 INFO (jetty-launcher-23109-thread-8) [ ] o.e.j.s.h.ContextHandler Stopped o.e.j.s.ServletContextHandler@7cb48f2e{/solr,null,UNAVAILABLE}
    [junit4] 2> 8227900 INFO (TEST-BasicAuthIntegrationTest.testBasics-seed#[3A33EBC4B9611095]) [ ] o.a.s.c.ZkTestServer connecting to 127.0.0.1:41339 41339
    [junit4] 2> NOTE: leaving temporary files on disk at: /home/jenkins/workspace/Lucene-Solr-6.1-Linux/solr/build/solr-core/test/J0/temp/solr.security.BasicAuthIntegrationTest_3A33EBC4B9611095-001
    [junit4] 2> 8228313 WARN (jetty-launcher-23109-thread-2-SendThread(127.0.0.1:41339)) [n:127.0.0.1:35480_solr ] o.a.z.c.StaticHostProvider Unexpected exception
    [junit4] 2> java.lang.InterruptedException: sleep interrupted
    [junit4] 2> at java.lang.Thread.sleep(Native Method)
    [junit4] 2> at org.apache.zookeeper.client.StaticHostProvider.next(StaticHostProvider.java:101)
    [junit4] 2> at org.apache.zookeeper.ClientCnxn$SendThread.startConnect(ClientCnxn.java:940)
    [junit4] 2> at org.apache.zookeeper.ClientCnxn$SendThread.run(ClientCnxn.java:1003)
    [junit4] 2> Jun 15, 2016 9:08:30 AM com.carrotsearch.randomizedtesting.ThreadLeakControl tryToInterruptAll
    [junit4] 2> INFO: All leaked threads terminated.
    [junit4] 2> NOTE: test params are: codec=Asserting(Lucene60), sim=ClassicSimilarity, locale=ca, timezone=America/Rainy_River
    [junit4] 2> NOTE: Linux 4.4.0-24-generic amd64/Oracle Corporation 1.8.0_92 (64-bit)/cpus=12,threads=2,free=255579064,total=518979584
    [junit4] 2> NOTE: All tests run in this JVM: [TestBulkSchemaAPI, TestDocTermOrds, PrimUtilsTest, DisMaxRequestHandlerTest, TestMergePolicyConfig, UUIDFieldTest, HdfsSyncSliceTest, TestMiniSolrCloudCluster, BlockJoinFacetSimpleTest, DistributedSpellCheckComponentTest, AnalysisAfterCoreReloadTest, TestRecoveryHdfs, TestSolr4Spatial, BasicZkTest, CloudExitableDirectoryReaderTest, TestReplicationHandler, TestSolrFieldCacheMBean, TestImplicitCoreProperties, SignatureUpdateProcessorFactoryTest, TestCloudBackupRestore, AlternateDirectoryTest, TestSizeLimitedDistributedMap, TestArbitraryIndexDir, LeaderInitiatedRecoveryOnCommitTest, TestLuceneMatchVersion, TestClusterStateMutator, TestReplicationHandlerBackup, PreAnalyzedFieldTest, QueryElevationComponentTest, CreateCollectionCleanupTest, ExplicitHLLTest, TestNRTOpen, LeaderElectionIntegrationTest, SolrRequestParserTest, TestValueSourceCache, TestFunctionQuery, TestManagedStopFilterFactory, DocExpirationUpdateProcessorFactoryTest, TestBinaryField, DistribJoinFromCollectionTest, ConcurrentDeleteAndCreateCollectionTest, TestExpandComponent, DistributedSuggestComponentTest, EchoParamsTest, ForceLeaderTest, TestInitQParser, TlogReplayBufferedWhileIndexingTest, PeerSyncTest, TestMiniSolrCloudClusterSSL, BlobRepositoryCloudTest, SyncSliceTest, TestNonDefinedSimilarityFactory, UUIDUpdateProcessorFallbackTest, TestFieldTypeResource, ResponseLogComponentTest, PingRequestHandlerTest, JsonLoaderTest, TestLazyCores, DirectoryFactoryTest, TestFoldingMultitermQuery, TestStressLucene, CoreAdminCreateDiscoverTest, DateFieldTest, HdfsBasicDistributedZk2Test, DeleteStatusTest, StandardRequestHandlerTest, TestRTGBase, TestRTimerTree, OverseerTaskQueueTest, TestTrieFacet, TestStressLiveNodes, IndexSchemaRuntimeFieldTest, TestDefaultSearchFieldResource, ReturnFieldsTest, TestSolrQueryParserDefaultOperatorResource, PathHierarchyTokenizerFactoryTest, HLLUtilTest, TestOmitPositions, TestFieldCacheSanityChecker, TestRandomCollapseQParserPlugin, TestMinMaxOnMultiValuedField, AnalyticsMergeStrategyTest, SSLMigrationTest, TestSQLHandler, ChangedSchemaMergeTest, CopyFieldTest, TestSubQueryTransformer, ActionThrottleTest, OutputWriterTest, ZkNodePropsTest, DefaultValueUpdateProcessorTest, AddBlockUpdateTest, TestRandomDVFaceting, EnumFieldTest, SolrCloudExampleTest, TestAnalyzedSuggestions, CdcrReplicationDistributedZkTest, BasicAuthIntegrationTest]
    [junit4] 2> NOTE: reproduce with: ant test -Dtestcase=BasicAuthIntegrationTest -Dtests.seed=3A33EBC4B9611095 -Dtests.multiplier=3 -Dtests.slow=true -Dtests.locale=ca -Dtests.timezone=America/Rainy_River -Dtests.asserts=true -Dtests.file.encoding=UTF-8
    [junit4] ERROR 0.00s J0 | BasicAuthIntegrationTest (suite) <<<
    [junit4] > Throwable #1: java.lang.Exception: Suite timeout exceeded (>= 7200000 msec).
    [junit4] > at __randomizedtesting.SeedInfo.seed([3A33EBC4B9611095]:0)
    [junit4] Completed [612/614 (1!)] on J0 in 7222.06s, 1 test, 2 errors <<< FAILURES!

[...truncated 22 lines...]
BUILD FAILED
/home/jenkins/workspace/Lucene-Solr-6.1-Linux/build.xml:740: The following error occurred while executing this line:
/home/jenkins/workspace/Lucene-Solr-6.1-Linux/build.xml:684: The following error occurred while executing this line:
/home/jenkins/workspace/Lucene-Solr-6.1-Linux/build.xml:59: The following error occurred while executing this line:
/home/jenkins/workspace/Lucene-Solr-6.1-Linux/solr/build.xml:233: The following error occurred while executing this line:
/home/jenkins/workspace/Lucene-Solr-6.1-Linux/solr/common-build.xml:531: The following error occurred while executing this line:
/home/jenkins/workspace/Lucene-Solr-6.1-Linux/lucene/common-build.xml:1427: The following error occurred while executing this line:
/home/jenkins/workspace/Lucene-Solr-6.1-Linux/lucene/common-build.xml:984: There were test failures: 614 suites (10 ignored), 2580 tests, 1 suite-level error, 1 error, 116 ignored (72 assumptions) [seed: 3A33EBC4B9611095]

Total time: 159 minutes 25 seconds
Build step 'Invoke Ant' marked build as failure
Archiving artifacts
[WARNINGS] Skipping publisher since build result is FAILURE
Recording test results
Email was triggered for: Failure - Any
Sending email for trigger: Failure - Any

Search Discussions

Related Discussions

Discussion Navigation
viewthread | post
posts ‹ prev | 1 of 1 | next ›
Discussion Overview
groupdev @
categorieslucene
postedJun 15, '16 at 9:09a
activeJun 15, '16 at 9:09a
posts1
users1
websitelucene.apache.org

1 user in discussion

Policeman Jenkins Server: 1 post

People

Translate

site design / logo © 2017 Grokbase