Grokbase Groups Lucene dev June 2016
FAQ
Build: http://jenkins.thetaphi.de/job/Lucene-Solr-6.x-Windows/249/
Java: 64bit/jdk1.8.0_92 -XX:+UseCompressedOops -XX:+UseG1GC

1 tests failed.
FAILED: junit.framework.TestSuite.org.apache.solr.schema.TestManagedSchemaAPI

Error Message:
ObjectTracker found 2 object(s) that were not released!!! [MockDirectoryWrapper, MockDirectoryWrapper]

Stack Trace:
java.lang.AssertionError: ObjectTracker found 2 object(s) that were not released!!! [MockDirectoryWrapper, MockDirectoryWrapper]
  at __randomizedtesting.SeedInfo.seed([85DB1BA594E5B03A]:0)
  at org.junit.Assert.fail(Assert.java:93)
  at org.junit.Assert.assertTrue(Assert.java:43)
  at org.junit.Assert.assertNull(Assert.java:551)
  at org.apache.solr.SolrTestCaseJ4.teardownTestCases(SolrTestCaseJ4.java:257)
  at sun.reflect.GeneratedMethodAccessor19.invoke(Unknown Source)
  at sun.reflect.DelegatingMethodAccessorImpl.invoke(DelegatingMethodAccessorImpl.java:43)
  at java.lang.reflect.Method.invoke(Method.java:498)
  at com.carrotsearch.randomizedtesting.RandomizedRunner.invoke(RandomizedRunner.java:1764)
  at com.carrotsearch.randomizedtesting.RandomizedRunner$7.evaluate(RandomizedRunner.java:834)
  at com.carrotsearch.randomizedtesting.rules.StatementAdapter.evaluate(StatementAdapter.java:36)
  at com.carrotsearch.randomizedtesting.rules.SystemPropertiesRestoreRule$1.evaluate(SystemPropertiesRestoreRule.java:57)
  at org.apache.lucene.util.AbstractBeforeAfterRule$1.evaluate(AbstractBeforeAfterRule.java:45)
  at com.carrotsearch.randomizedtesting.rules.StatementAdapter.evaluate(StatementAdapter.java:36)
  at org.apache.lucene.util.TestRuleStoreClassName$1.evaluate(TestRuleStoreClassName.java:41)
  at com.carrotsearch.randomizedtesting.rules.NoShadowingOrOverridesOnMethodsRule$1.evaluate(NoShadowingOrOverridesOnMethodsRule.java:40)
  at com.carrotsearch.randomizedtesting.rules.NoShadowingOrOverridesOnMethodsRule$1.evaluate(NoShadowingOrOverridesOnMethodsRule.java:40)
  at com.carrotsearch.randomizedtesting.rules.StatementAdapter.evaluate(StatementAdapter.java:36)
  at com.carrotsearch.randomizedtesting.rules.StatementAdapter.evaluate(StatementAdapter.java:36)
  at com.carrotsearch.randomizedtesting.rules.StatementAdapter.evaluate(StatementAdapter.java:36)
  at org.apache.lucene.util.TestRuleAssertionsRequired$1.evaluate(TestRuleAssertionsRequired.java:53)
  at org.apache.lucene.util.TestRuleMarkFailure$1.evaluate(TestRuleMarkFailure.java:47)
  at org.apache.lucene.util.TestRuleIgnoreAfterMaxFailures$1.evaluate(TestRuleIgnoreAfterMaxFailures.java:64)
  at org.apache.lucene.util.TestRuleIgnoreTestSuites$1.evaluate(TestRuleIgnoreTestSuites.java:54)
  at com.carrotsearch.randomizedtesting.rules.StatementAdapter.evaluate(StatementAdapter.java:36)
  at com.carrotsearch.randomizedtesting.ThreadLeakControl$StatementRunner.run(ThreadLeakControl.java:367)
  at java.lang.Thread.run(Thread.java:745)




Build Log:
[...truncated 12331 lines...]
    [junit4] Suite: org.apache.solr.schema.TestManagedSchemaAPI
    [junit4] 2> Creating dataDir: C:\Users\jenkins\workspace\Lucene-Solr-6.x-Windows\solr\build\solr-core\test\J0\temp\solr.schema.TestManagedSchemaAPI_85DB1BA594E5B03A-001\init-core-data-001
    [junit4] 2> 2925746 INFO (SUITE-TestManagedSchemaAPI-seed#[85DB1BA594E5B03A]-worker) [ ] o.a.s.SolrTestCaseJ4 Randomized ssl (false) and clientAuth (false) via: @org.apache.solr.util.RandomizeSSL(reason=, value=NaN, ssl=NaN, clientAuth=NaN)
    [junit4] 2> 2925748 INFO (SUITE-TestManagedSchemaAPI-seed#[85DB1BA594E5B03A]-worker) [ ] o.a.s.c.ZkTestServer STARTING ZK TEST SERVER
    [junit4] 2> 2925748 INFO (Thread-8763) [ ] o.a.s.c.ZkTestServer client port:0.0.0.0/0.0.0.0:0
    [junit4] 2> 2925748 INFO (Thread-8763) [ ] o.a.s.c.ZkTestServer Starting server
    [junit4] 2> 2925848 INFO (SUITE-TestManagedSchemaAPI-seed#[85DB1BA594E5B03A]-worker) [ ] o.a.s.c.ZkTestServer start zk server on port:65232
    [junit4] 2> 2925848 INFO (SUITE-TestManagedSchemaAPI-seed#[85DB1BA594E5B03A]-worker) [ ] o.a.s.c.c.SolrZkClient Using default ZkCredentialsProvider
    [junit4] 2> 2925850 INFO (SUITE-TestManagedSchemaAPI-seed#[85DB1BA594E5B03A]-worker) [ ] o.a.s.c.c.ConnectionManager Waiting for client to connect to ZooKeeper
    [junit4] 2> 2925855 INFO (zkCallback-10165-thread-1) [ ] o.a.s.c.c.ConnectionManager Watcher org.apache.solr.common.cloud.ConnectionManager@74112a43 name:ZooKeeperConnection Watcher:127.0.0.1:65232 got event WatchedEvent state:SyncConnected type:None path:null path:null type:None
    [junit4] 2> 2925855 INFO (SUITE-TestManagedSchemaAPI-seed#[85DB1BA594E5B03A]-worker) [ ] o.a.s.c.c.ConnectionManager Client is connected to ZooKeeper
    [junit4] 2> 2925855 INFO (SUITE-TestManagedSchemaAPI-seed#[85DB1BA594E5B03A]-worker) [ ] o.a.s.c.c.SolrZkClient Using default ZkACLProvider
    [junit4] 2> 2925855 INFO (SUITE-TestManagedSchemaAPI-seed#[85DB1BA594E5B03A]-worker) [ ] o.a.s.c.c.SolrZkClient makePath: /solr/solr.xml
    [junit4] 2> 2925866 INFO (jetty-launcher-10164-thread-2) [ ] o.e.j.s.Server jetty-9.3.8.v20160314
    [junit4] 2> 2925866 INFO (jetty-launcher-10164-thread-1) [ ] o.e.j.s.Server jetty-9.3.8.v20160314
    [junit4] 2> 2925868 INFO (jetty-launcher-10164-thread-2) [ ] o.e.j.s.h.ContextHandler Started o.e.j.s.ServletContextHandler@11a3e3b2{/solr,null,AVAILABLE}
    [junit4] 2> 2925868 INFO (jetty-launcher-10164-thread-1) [ ] o.e.j.s.h.ContextHandler Started o.e.j.s.ServletContextHandler@7eb0d347{/solr,null,AVAILABLE}
    [junit4] 2> 2925873 INFO (jetty-launcher-10164-thread-2) [ ] o.e.j.s.ServerConnector Started ServerConnector@39d0a9d2{HTTP/1.1,[http/1.1]}{127.0.0.1:65236}
    [junit4] 2> 2925875 INFO (jetty-launcher-10164-thread-1) [ ] o.e.j.s.ServerConnector Started ServerConnector@54caaba{HTTP/1.1,[http/1.1]}{127.0.0.1:65239}
    [junit4] 2> 2925875 INFO (jetty-launcher-10164-thread-2) [ ] o.e.j.s.Server Started @2930328ms
    [junit4] 2> 2925875 INFO (jetty-launcher-10164-thread-1) [ ] o.e.j.s.Server Started @2930328ms
    [junit4] 2> 2925876 INFO (jetty-launcher-10164-thread-2) [ ] o.a.s.c.s.e.JettySolrRunner Jetty properties: {hostContext=/solr, hostPort=65236}
    [junit4] 2> 2925876 INFO (jetty-launcher-10164-thread-1) [ ] o.a.s.c.s.e.JettySolrRunner Jetty properties: {hostContext=/solr, hostPort=65239}
    [junit4] 2> 2925876 INFO (jetty-launcher-10164-thread-2) [ ] o.a.s.s.SolrDispatchFilter SolrDispatchFilter.init(): sun.misc.Launcher$AppClassLoader@73d16e93
    [junit4] 2> 2925876 INFO (jetty-launcher-10164-thread-1) [ ] o.a.s.s.SolrDispatchFilter SolrDispatchFilter.init(): sun.misc.Launcher$AppClassLoader@73d16e93
    [junit4] 2> 2925876 INFO (jetty-launcher-10164-thread-2) [ ] o.a.s.c.SolrResourceLoader new SolrResourceLoader for directory: 'C:\Users\jenkins\workspace\Lucene-Solr-6.x-Windows\solr\build\solr-core\test\J0\temp\solr.schema.TestManagedSchemaAPI_85DB1BA594E5B03A-001\tempDir-001\node2'
    [junit4] 2> 2925876 INFO (jetty-launcher-10164-thread-1) [ ] o.a.s.c.SolrResourceLoader new SolrResourceLoader for directory: 'C:\Users\jenkins\workspace\Lucene-Solr-6.x-Windows\solr\build\solr-core\test\J0\temp\solr.schema.TestManagedSchemaAPI_85DB1BA594E5B03A-001\tempDir-001\node1'
    [junit4] 2> 2925876 INFO (jetty-launcher-10164-thread-2) [ ] o.a.s.c.SolrResourceLoader JNDI not configured for solr (NoInitialContextEx)
    [junit4] 2> 2925876 INFO (jetty-launcher-10164-thread-2) [ ] o.a.s.c.SolrResourceLoader solr home defaulted to 'solr/' (could not find system property or JNDI)
    [junit4] 2> 2925876 INFO (jetty-launcher-10164-thread-1) [ ] o.a.s.c.SolrResourceLoader JNDI not configured for solr (NoInitialContextEx)
    [junit4] 2> 2925876 INFO (jetty-launcher-10164-thread-1) [ ] o.a.s.c.SolrResourceLoader solr home defaulted to 'solr/' (could not find system property or JNDI)
    [junit4] 2> 2925877 INFO (jetty-launcher-10164-thread-2) [ ] o.a.s.c.c.SolrZkClient Using default ZkCredentialsProvider
    [junit4] 2> 2925877 INFO (jetty-launcher-10164-thread-1) [ ] o.a.s.c.c.SolrZkClient Using default ZkCredentialsProvider
    [junit4] 2> 2925879 INFO (jetty-launcher-10164-thread-2) [ ] o.a.s.c.c.ConnectionManager Waiting for client to connect to ZooKeeper
    [junit4] 2> 2925879 INFO (jetty-launcher-10164-thread-1) [ ] o.a.s.c.c.ConnectionManager Waiting for client to connect to ZooKeeper
    [junit4] 2> 2925882 INFO (zkCallback-10167-thread-1) [ ] o.a.s.c.c.ConnectionManager Watcher org.apache.solr.common.cloud.ConnectionManager@10be57b9 name:ZooKeeperConnection Watcher:127.0.0.1:65232/solr got event WatchedEvent state:SyncConnected type:None path:null path:null type:None
    [junit4] 2> 2925882 INFO (jetty-launcher-10164-thread-1) [ ] o.a.s.c.c.ConnectionManager Client is connected to ZooKeeper
    [junit4] 2> 2925883 INFO (jetty-launcher-10164-thread-1) [ ] o.a.s.c.c.SolrZkClient Using default ZkACLProvider
    [junit4] 2> 2925883 INFO (zkCallback-10166-thread-1) [ ] o.a.s.c.c.ConnectionManager Watcher org.apache.solr.common.cloud.ConnectionManager@6ff91adc name:ZooKeeperConnection Watcher:127.0.0.1:65232/solr got event WatchedEvent state:SyncConnected type:None path:null path:null type:None
    [junit4] 2> 2925883 INFO (jetty-launcher-10164-thread-2) [ ] o.a.s.c.c.ConnectionManager Client is connected to ZooKeeper
    [junit4] 2> 2925883 INFO (jetty-launcher-10164-thread-1) [ ] o.a.s.s.SolrDispatchFilter solr.xml found in ZooKeeper. Loading...
    [junit4] 2> 2925883 INFO (jetty-launcher-10164-thread-2) [ ] o.a.s.c.c.SolrZkClient Using default ZkACLProvider
    [junit4] 2> 2925884 INFO (jetty-launcher-10164-thread-2) [ ] o.a.s.s.SolrDispatchFilter solr.xml found in ZooKeeper. Loading...
    [junit4] 2> 2925898 WARN (NIOServerCxn.Factory:0.0.0.0/0.0.0.0:0) [ ] o.a.z.s.NIOServerCnxn caught end of stream exception
    [junit4] 2> EndOfStreamException: Unable to read additional data from client sessionid 0x155529bff0c0001, likely client has closed socket
    [junit4] 2> at org.apache.zookeeper.server.NIOServerCnxn.doIO(NIOServerCnxn.java:228)
    [junit4] 2> at org.apache.zookeeper.server.NIOServerCnxnFactory.run(NIOServerCnxnFactory.java:208)
    [junit4] 2> at java.lang.Thread.run(Thread.java:745)
    [junit4] 2> 2925899 INFO (jetty-launcher-10164-thread-1) [ ] o.a.s.c.CorePropertiesLocator Config-defined core root directory: C:\Users\jenkins\workspace\Lucene-Solr-6.x-Windows\solr\build\solr-core\test\J0\temp\solr.schema.TestManagedSchemaAPI_85DB1BA594E5B03A-001\tempDir-001\node1\.
    [junit4] 2> 2925899 INFO (jetty-launcher-10164-thread-1) [ ] o.a.s.c.CoreContainer New CoreContainer 2120132508
    [junit4] 2> 2925899 INFO (jetty-launcher-10164-thread-1) [ ] o.a.s.c.CoreContainer Loading cores into CoreContainer [instanceDir=C:\Users\jenkins\workspace\Lucene-Solr-6.x-Windows\solr\build\solr-core\test\J0\temp\solr.schema.TestManagedSchemaAPI_85DB1BA594E5B03A-001\tempDir-001\node1]
    [junit4] 2> 2925899 WARN (jetty-launcher-10164-thread-1) [ ] o.a.s.c.CoreContainer Couldn't add files from C:\Users\jenkins\workspace\Lucene-Solr-6.x-Windows\solr\build\solr-core\test\J0\temp\solr.schema.TestManagedSchemaAPI_85DB1BA594E5B03A-001\tempDir-001\node1\lib to classpath: C:\Users\jenkins\workspace\Lucene-Solr-6.x-Windows\solr\build\solr-core\test\J0\temp\solr.schema.TestManagedSchemaAPI_85DB1BA594E5B03A-001\tempDir-001\node1\lib
    [junit4] 2> 2925900 WARN (NIOServerCxn.Factory:0.0.0.0/0.0.0.0:0) [ ] o.a.z.s.NIOServerCnxn caught end of stream exception
    [junit4] 2> EndOfStreamException: Unable to read additional data from client sessionid 0x155529bff0c0002, likely client has closed socket
    [junit4] 2> at org.apache.zookeeper.server.NIOServerCnxn.doIO(NIOServerCnxn.java:228)
    [junit4] 2> at org.apache.zookeeper.server.NIOServerCnxnFactory.run(NIOServerCnxnFactory.java:208)
    [junit4] 2> at java.lang.Thread.run(Thread.java:745)
    [junit4] 2> 2925900 INFO (jetty-launcher-10164-thread-1) [ ] o.a.s.h.c.HttpShardHandlerFactory created with socketTimeout : 90000,urlScheme : ,connTimeout : 15000,maxConnectionsPerHost : 20,maxConnections : 10000,corePoolSize : 0,maximumPoolSize : 2147483647,maxThreadIdleTime : 5,sizeOfQueue : -1,fairnessPolicy : false,useRetries : false,
    [junit4] 2> 2925900 INFO (jetty-launcher-10164-thread-2) [ ] o.a.s.c.CorePropertiesLocator Config-defined core root directory: C:\Users\jenkins\workspace\Lucene-Solr-6.x-Windows\solr\build\solr-core\test\J0\temp\solr.schema.TestManagedSchemaAPI_85DB1BA594E5B03A-001\tempDir-001\node2\.
    [junit4] 2> 2925900 INFO (jetty-launcher-10164-thread-2) [ ] o.a.s.c.CoreContainer New CoreContainer 226841847
    [junit4] 2> 2925900 INFO (jetty-launcher-10164-thread-2) [ ] o.a.s.c.CoreContainer Loading cores into CoreContainer [instanceDir=C:\Users\jenkins\workspace\Lucene-Solr-6.x-Windows\solr\build\solr-core\test\J0\temp\solr.schema.TestManagedSchemaAPI_85DB1BA594E5B03A-001\tempDir-001\node2]
    [junit4] 2> 2925900 WARN (jetty-launcher-10164-thread-2) [ ] o.a.s.c.CoreContainer Couldn't add files from C:\Users\jenkins\workspace\Lucene-Solr-6.x-Windows\solr\build\solr-core\test\J0\temp\solr.schema.TestManagedSchemaAPI_85DB1BA594E5B03A-001\tempDir-001\node2\lib to classpath: C:\Users\jenkins\workspace\Lucene-Solr-6.x-Windows\solr\build\solr-core\test\J0\temp\solr.schema.TestManagedSchemaAPI_85DB1BA594E5B03A-001\tempDir-001\node2\lib
    [junit4] 2> 2925901 INFO (jetty-launcher-10164-thread-2) [ ] o.a.s.h.c.HttpShardHandlerFactory created with socketTimeout : 90000,urlScheme : ,connTimeout : 15000,maxConnectionsPerHost : 20,maxConnections : 10000,corePoolSize : 0,maximumPoolSize : 2147483647,maxThreadIdleTime : 5,sizeOfQueue : -1,fairnessPolicy : false,useRetries : false,
    [junit4] 2> 2925909 INFO (jetty-launcher-10164-thread-1) [ ] o.a.s.u.UpdateShardHandler Creating UpdateShardHandler HTTP client with params: socketTimeout=340000&connTimeout=45000&retry=true
    [junit4] 2> 2925909 INFO (jetty-launcher-10164-thread-2) [ ] o.a.s.u.UpdateShardHandler Creating UpdateShardHandler HTTP client with params: socketTimeout=340000&connTimeout=45000&retry=true
    [junit4] 2> 2925910 INFO (jetty-launcher-10164-thread-1) [ ] o.a.s.l.LogWatcher SLF4J impl is org.slf4j.impl.Log4jLoggerFactory
    [junit4] 2> 2925910 INFO (jetty-launcher-10164-thread-2) [ ] o.a.s.l.LogWatcher SLF4J impl is org.slf4j.impl.Log4jLoggerFactory
    [junit4] 2> 2925910 INFO (jetty-launcher-10164-thread-2) [ ] o.a.s.l.LogWatcher Registering Log Listener [Log4j (org.slf4j.impl.Log4jLoggerFactory)]
    [junit4] 2> 2925910 INFO (jetty-launcher-10164-thread-1) [ ] o.a.s.l.LogWatcher Registering Log Listener [Log4j (org.slf4j.impl.Log4jLoggerFactory)]
    [junit4] 2> 2925910 INFO (jetty-launcher-10164-thread-2) [ ] o.a.s.c.ZkContainer Zookeeper client=127.0.0.1:65232/solr
    [junit4] 2> 2925910 INFO (jetty-launcher-10164-thread-2) [ ] o.a.s.c.ZkController zkHost includes chroot
    [junit4] 2> 2925910 INFO (jetty-launcher-10164-thread-1) [ ] o.a.s.c.ZkContainer Zookeeper client=127.0.0.1:65232/solr
    [junit4] 2> 2925911 INFO (jetty-launcher-10164-thread-2) [ ] o.a.s.c.c.SolrZkClient Using default ZkCredentialsProvider
    [junit4] 2> 2925911 INFO (jetty-launcher-10164-thread-1) [ ] o.a.s.c.ZkController zkHost includes chroot
    [junit4] 2> 2925911 INFO (jetty-launcher-10164-thread-1) [ ] o.a.s.c.c.SolrZkClient Using default ZkCredentialsProvider
    [junit4] 2> 2925912 INFO (jetty-launcher-10164-thread-1) [ ] o.a.s.c.c.ConnectionManager Waiting for client to connect to ZooKeeper
    [junit4] 2> 2925912 INFO (jetty-launcher-10164-thread-2) [ ] o.a.s.c.c.ConnectionManager Waiting for client to connect to ZooKeeper
    [junit4] 2> 2925914 INFO (zkCallback-10172-thread-1) [ ] o.a.s.c.c.ConnectionManager Watcher org.apache.solr.common.cloud.ConnectionManager@66eaed9 name:ZooKeeperConnection Watcher:127.0.0.1:65232 got event WatchedEvent state:SyncConnected type:None path:null path:null type:None
    [junit4] 2> 2925914 INFO (jetty-launcher-10164-thread-2) [ ] o.a.s.c.c.ConnectionManager Client is connected to ZooKeeper
    [junit4] 2> 2925914 INFO (zkCallback-10173-thread-1) [ ] o.a.s.c.c.ConnectionManager Watcher org.apache.solr.common.cloud.ConnectionManager@62b8f124 name:ZooKeeperConnection Watcher:127.0.0.1:65232 got event WatchedEvent state:SyncConnected type:None path:null path:null type:None
    [junit4] 2> 2925914 INFO (jetty-launcher-10164-thread-2) [ ] o.a.s.c.c.SolrZkClient Using default ZkACLProvider
    [junit4] 2> 2925914 INFO (jetty-launcher-10164-thread-1) [ ] o.a.s.c.c.ConnectionManager Client is connected to ZooKeeper
    [junit4] 2> 2925914 INFO (jetty-launcher-10164-thread-1) [ ] o.a.s.c.c.SolrZkClient Using default ZkACLProvider
    [junit4] 2> 2925915 WARN (NIOServerCxn.Factory:0.0.0.0/0.0.0.0:0) [ ] o.a.z.s.NIOServerCnxn caught end of stream exception
    [junit4] 2> EndOfStreamException: Unable to read additional data from client sessionid 0x155529bff0c0004, likely client has closed socket
    [junit4] 2> at org.apache.zookeeper.server.NIOServerCnxn.doIO(NIOServerCnxn.java:228)
    [junit4] 2> at org.apache.zookeeper.server.NIOServerCnxnFactory.run(NIOServerCnxnFactory.java:208)
    [junit4] 2> at java.lang.Thread.run(Thread.java:745)
    [junit4] 2> 2925915 INFO (jetty-launcher-10164-thread-2) [n:127.0.0.1:65236_solr ] o.a.s.c.ZkController Added new OnReconnect listener org.apache.solr.cloud.ZkController$$Lambda$47/1714065165@17eb4edf
    [junit4] 2> 2925918 INFO (jetty-launcher-10164-thread-1) [n:127.0.0.1:65239_solr ] o.a.s.c.ZkController Added new OnReconnect listener org.apache.solr.cloud.ZkController$$Lambda$47/1714065165@7b3ea058
    [junit4] 2> 2925921 INFO (jetty-launcher-10164-thread-2) [n:127.0.0.1:65236_solr ] o.a.s.c.c.ConnectionManager Waiting for client to connect to ZooKeeper
    [junit4] 2> 2925921 INFO (jetty-launcher-10164-thread-1) [n:127.0.0.1:65239_solr ] o.a.s.c.c.ConnectionManager Waiting for client to connect to ZooKeeper
    [junit4] 2> 2925923 INFO (zkCallback-10174-thread-1-processing-n:127.0.0.1:65236_solr) [n:127.0.0.1:65236_solr ] o.a.s.c.c.ConnectionManager Watcher org.apache.solr.common.cloud.ConnectionManager@43e10d8a name:ZooKeeperConnection Watcher:127.0.0.1:65232/solr got event WatchedEvent state:SyncConnected type:None path:null path:null type:None
    [junit4] 2> 2925923 INFO (jetty-launcher-10164-thread-2) [n:127.0.0.1:65236_solr ] o.a.s.c.c.ConnectionManager Client is connected to ZooKeeper
    [junit4] 2> 2925923 INFO (zkCallback-10175-thread-1-processing-n:127.0.0.1:65239_solr) [n:127.0.0.1:65239_solr ] o.a.s.c.c.ConnectionManager Watcher org.apache.solr.common.cloud.ConnectionManager@26bec92c name:ZooKeeperConnection Watcher:127.0.0.1:65232/solr got event WatchedEvent state:SyncConnected type:None path:null path:null type:None
    [junit4] 2> 2925923 INFO (jetty-launcher-10164-thread-1) [n:127.0.0.1:65239_solr ] o.a.s.c.c.ConnectionManager Client is connected to ZooKeeper
    [junit4] 2> 2925924 INFO (jetty-launcher-10164-thread-2) [n:127.0.0.1:65236_solr ] o.a.s.c.c.SolrZkClient makePath: /overseer/queue
    [junit4] 2> 2925924 INFO (jetty-launcher-10164-thread-1) [n:127.0.0.1:65239_solr ] o.a.s.c.c.SolrZkClient makePath: /overseer/queue
    [junit4] 2> 2925927 INFO (jetty-launcher-10164-thread-2) [n:127.0.0.1:65236_solr ] o.a.s.c.c.SolrZkClient makePath: /overseer/collection-queue-work
    [junit4] 2> 2925928 INFO (jetty-launcher-10164-thread-1) [n:127.0.0.1:65239_solr ] o.a.s.c.c.SolrZkClient makePath: /overseer/collection-queue-work
    [junit4] 2> 2925932 INFO (jetty-launcher-10164-thread-1) [n:127.0.0.1:65239_solr ] o.a.s.c.c.SolrZkClient makePath: /overseer/collection-map-running
    [junit4] 2> 2925933 INFO (jetty-launcher-10164-thread-2) [n:127.0.0.1:65236_solr ] o.a.s.c.c.SolrZkClient makePath: /overseer/collection-map-running
    [junit4] 2> 2925936 INFO (jetty-launcher-10164-thread-1) [n:127.0.0.1:65239_solr ] o.a.s.c.c.SolrZkClient makePath: /overseer/collection-map-completed
    [junit4] 2> 2925936 INFO (jetty-launcher-10164-thread-2) [n:127.0.0.1:65236_solr ] o.a.s.c.c.SolrZkClient makePath: /overseer/collection-map-completed
    [junit4] 2> 2925939 INFO (jetty-launcher-10164-thread-1) [n:127.0.0.1:65239_solr ] o.a.s.c.c.SolrZkClient makePath: /overseer/collection-map-failure
    [junit4] 2> 2925939 INFO (jetty-launcher-10164-thread-2) [n:127.0.0.1:65236_solr ] o.a.s.c.c.SolrZkClient makePath: /overseer/collection-map-failure
    [junit4] 2> 2925940 INFO (jetty-launcher-10164-thread-1) [n:127.0.0.1:65239_solr ] o.a.s.c.c.SolrZkClient makePath: /live_nodes
    [junit4] 2> 2925942 INFO (jetty-launcher-10164-thread-2) [n:127.0.0.1:65236_solr ] o.a.s.c.c.SolrZkClient makePath: /live_nodes
    [junit4] 2> 2925943 INFO (jetty-launcher-10164-thread-2) [n:127.0.0.1:65236_solr ] o.a.s.c.c.SolrZkClient makePath: /collections
    [junit4] 2> 2925943 INFO (jetty-launcher-10164-thread-1) [n:127.0.0.1:65239_solr ] o.a.s.c.c.SolrZkClient makePath: /collections
    [junit4] 2> 2925945 INFO (jetty-launcher-10164-thread-1) [n:127.0.0.1:65239_solr ] o.a.s.c.c.SolrZkClient makePath: /aliases.json
    [junit4] 2> 2925945 INFO (jetty-launcher-10164-thread-2) [n:127.0.0.1:65236_solr ] o.a.s.c.c.SolrZkClient makePath: /aliases.json
    [junit4] 2> 2925946 INFO (jetty-launcher-10164-thread-1) [n:127.0.0.1:65239_solr ] o.a.s.c.c.SolrZkClient makePath: /clusterstate.json
    [junit4] 2> 2925947 INFO (jetty-launcher-10164-thread-2) [n:127.0.0.1:65236_solr ] o.a.s.c.c.SolrZkClient makePath: /clusterstate.json
    [junit4] 2> 2925948 INFO (jetty-launcher-10164-thread-2) [n:127.0.0.1:65236_solr ] o.a.s.c.c.SolrZkClient makePath: /security.json
    [junit4] 2> 2925949 INFO (jetty-launcher-10164-thread-1) [n:127.0.0.1:65239_solr ] o.a.s.c.c.SolrZkClient makePath: /security.json
    [junit4] 2> 2925950 INFO (jetty-launcher-10164-thread-2) [n:127.0.0.1:65236_solr ] o.a.s.c.c.ZkStateReader Updating cluster state from ZooKeeper...
    [junit4] 2> 2925952 INFO (jetty-launcher-10164-thread-1) [n:127.0.0.1:65239_solr ] o.a.s.c.c.ZkStateReader Updating cluster state from ZooKeeper...
    [junit4] 2> 2925952 INFO (jetty-launcher-10164-thread-2) [n:127.0.0.1:65236_solr ] o.a.s.c.c.ZkStateReader Loaded empty cluster properties
    [junit4] 2> 2925952 INFO (jetty-launcher-10164-thread-1) [n:127.0.0.1:65239_solr ] o.a.s.c.c.ZkStateReader Loaded empty cluster properties
    [junit4] 2> 2925953 INFO (jetty-launcher-10164-thread-2) [n:127.0.0.1:65236_solr ] o.a.s.c.c.ZkStateReader Updated live nodes from ZooKeeper... (0) -> (0)
    [junit4] 2> 2925954 INFO (jetty-launcher-10164-thread-1) [n:127.0.0.1:65239_solr ] o.a.s.c.c.ZkStateReader Updated live nodes from ZooKeeper... (0) -> (0)
    [junit4] 2> 2925957 INFO (jetty-launcher-10164-thread-2) [n:127.0.0.1:65236_solr ] o.a.s.c.c.SolrZkClient makePath: /overseer_elect
    [junit4] 2> 2925957 INFO (jetty-launcher-10164-thread-1) [n:127.0.0.1:65239_solr ] o.a.s.c.c.SolrZkClient makePath: /overseer_elect
    [junit4] 2> 2925960 INFO (jetty-launcher-10164-thread-2) [n:127.0.0.1:65236_solr ] o.a.s.c.c.SolrZkClient makePath: /overseer_elect/election
    [junit4] 2> 2925960 INFO (jetty-launcher-10164-thread-1) [n:127.0.0.1:65239_solr ] o.a.s.c.c.SolrZkClient makePath: /overseer_elect/election
    [junit4] 2> 2925960 INFO (jetty-launcher-10164-thread-2) [n:127.0.0.1:65236_solr ] o.a.s.c.Overseer Overseer (id=null) closing
    [junit4] 2> 2925962 INFO (jetty-launcher-10164-thread-1) [n:127.0.0.1:65239_solr ] o.a.s.c.Overseer Overseer (id=null) closing
    [junit4] 2> 2925962 INFO (jetty-launcher-10164-thread-2) [n:127.0.0.1:65236_solr ] o.a.s.c.LeaderElector Joined leadership election with path: /overseer_elect/election/96073797010718725-127.0.0.1:65236_solr-n_0000000000
    [junit4] 2> 2925962 INFO (jetty-launcher-10164-thread-1) [n:127.0.0.1:65239_solr ] o.a.s.c.LeaderElector Joined leadership election with path: /overseer_elect/election/96073797010718726-127.0.0.1:65239_solr-n_0000000001
    [junit4] 2> 2925962 INFO (jetty-launcher-10164-thread-2) [n:127.0.0.1:65236_solr ] o.a.s.c.OverseerElectionContext I am going to be the leader 127.0.0.1:65236_solr
    [junit4] 2> 2925962 INFO (jetty-launcher-10164-thread-2) [n:127.0.0.1:65236_solr ] o.a.s.c.c.SolrZkClient makePath: /overseer_elect/leader
    [junit4] 2> 2925963 INFO (jetty-launcher-10164-thread-1) [n:127.0.0.1:65239_solr ] o.a.s.c.LeaderElector Watching path /overseer_elect/election/96073797010718725-127.0.0.1:65236_solr-n_0000000000 to know if I could be the leader
    [junit4] 2> 2925964 INFO (jetty-launcher-10164-thread-1) [n:127.0.0.1:65239_solr ] o.a.s.c.ZkController Register node as live in ZooKeeper:/live_nodes/127.0.0.1:65239_solr
    [junit4] 2> 2925964 INFO (jetty-launcher-10164-thread-1) [n:127.0.0.1:65239_solr ] o.a.s.c.c.SolrZkClient makePath: /live_nodes/127.0.0.1:65239_solr
    [junit4] 2> 2925964 INFO (jetty-launcher-10164-thread-2) [n:127.0.0.1:65236_solr ] o.a.s.c.Overseer Overseer (id=96073797010718725-127.0.0.1:65236_solr-n_0000000000) starting
    [junit4] 2> 2925966 INFO (zkCallback-10174-thread-1-processing-n:127.0.0.1:65236_solr) [n:127.0.0.1:65236_solr ] o.a.s.c.c.ZkStateReader A live node change: [WatchedEvent state:SyncConnected type:NodeChildrenChanged path:/live_nodes], has occurred - updating... (live nodes size: [0])
    [junit4] 2> 2925966 INFO (zkCallback-10175-thread-1-processing-n:127.0.0.1:65239_solr) [n:127.0.0.1:65239_solr ] o.a.s.c.c.ZkStateReader A live node change: [WatchedEvent state:SyncConnected type:NodeChildrenChanged path:/live_nodes], has occurred - updating... (live nodes size: [0])
    [junit4] 2> 2925969 INFO (zkCallback-10174-thread-1-processing-n:127.0.0.1:65236_solr) [n:127.0.0.1:65236_solr ] o.a.s.c.c.ZkStateReader Updated live nodes from ZooKeeper... (0) -> (1)
    [junit4] 2> 2925972 INFO (zkCallback-10175-thread-1-processing-n:127.0.0.1:65239_solr) [n:127.0.0.1:65239_solr ] o.a.s.c.c.ZkStateReader Updated live nodes from ZooKeeper... (0) -> (1)
    [junit4] 2> 2925973 INFO (jetty-launcher-10164-thread-2) [n:127.0.0.1:65236_solr ] o.a.s.c.c.SolrZkClient makePath: /overseer/queue-work
    [junit4] 2> 2925979 INFO (jetty-launcher-10164-thread-1) [n:127.0.0.1:65239_solr ] o.a.s.c.CoreContainer Security conf doesn't exist. Skipping setup for authorization module.
    [junit4] 2> 2925979 INFO (jetty-launcher-10164-thread-1) [n:127.0.0.1:65239_solr ] o.a.s.c.CoreContainer No authentication plugin used.
    [junit4] 2> 2925979 INFO (jetty-launcher-10164-thread-1) [n:127.0.0.1:65239_solr ] o.a.s.c.CorePropertiesLocator Looking for core definitions underneath C:\Users\jenkins\workspace\Lucene-Solr-6.x-Windows\solr\build\solr-core\test\J0\temp\solr.schema.TestManagedSchemaAPI_85DB1BA594E5B03A-001\tempDir-001\node1\.
    [junit4] 2> 2925981 INFO (jetty-launcher-10164-thread-1) [n:127.0.0.1:65239_solr ] o.a.s.c.CorePropertiesLocator Found 0 core definitions
    [junit4] 2> 2925981 INFO (jetty-launcher-10164-thread-1) [n:127.0.0.1:65239_solr ] o.a.s.s.SolrDispatchFilter user.dir=C:\Users\jenkins\workspace\Lucene-Solr-6.x-Windows\solr\build\solr-core\test\J0
    [junit4] 2> 2925982 INFO (jetty-launcher-10164-thread-1) [n:127.0.0.1:65239_solr ] o.a.s.s.SolrDispatchFilter SolrDispatchFilter.init() done
    [junit4] 2> 2925984 INFO (jetty-launcher-10164-thread-2) [n:127.0.0.1:65236_solr ] o.a.s.c.OverseerAutoReplicaFailoverThread Starting OverseerAutoReplicaFailoverThread autoReplicaFailoverWorkLoopDelay=10000 autoReplicaFailoverWaitAfterExpiration=30000 autoReplicaFailoverBadNodeExpiration=60000
    [junit4] 2> 2925984 INFO (OverseerCollectionConfigSetProcessor-96073797010718725-127.0.0.1:65236_solr-n_0000000000) [n:127.0.0.1:65236_solr ] o.a.s.c.OverseerTaskProcessor Process current queue of overseer operations
    [junit4] 2> 2925985 INFO (jetty-launcher-10164-thread-2) [n:127.0.0.1:65236_solr ] o.a.s.c.ZkController Publish node=127.0.0.1:65236_solr as DOWN
    [junit4] 2> 2925985 INFO (OverseerStateUpdate-96073797010718725-127.0.0.1:65236_solr-n_0000000000) [n:127.0.0.1:65236_solr ] o.a.s.c.Overseer Starting to work on the main queue
    [junit4] 2> 2925990 INFO (OverseerStateUpdate-96073797010718725-127.0.0.1:65236_solr-n_0000000000) [n:127.0.0.1:65236_solr ] o.a.s.c.c.ZkStateReader Updated live nodes from ZooKeeper... (1) -> (1)
    [junit4] 2> 2925992 INFO (OverseerStateUpdate-96073797010718725-127.0.0.1:65236_solr-n_0000000000) [n:127.0.0.1:65236_solr ] o.a.s.c.Overseer processMessage: queueSize: 1, message = {
    [junit4] 2> "operation":"downnode",
    [junit4] 2> "node_name":"127.0.0.1:65236_solr"} current state version: 0
    [junit4] 2> 2925992 INFO (OverseerStateUpdate-96073797010718725-127.0.0.1:65236_solr-n_0000000000) [n:127.0.0.1:65236_solr ] o.a.s.c.o.NodeMutator DownNode state invoked for node: 127.0.0.1:65236_solr
    [junit4] 2> 2926989 INFO (jetty-launcher-10164-thread-2) [n:127.0.0.1:65236_solr ] o.a.s.c.ZkController Register node as live in ZooKeeper:/live_nodes/127.0.0.1:65236_solr
    [junit4] 2> 2926990 INFO (jetty-launcher-10164-thread-2) [n:127.0.0.1:65236_solr ] o.a.s.c.c.SolrZkClient makePath: /live_nodes/127.0.0.1:65236_solr
    [junit4] 2> 2926992 INFO (zkCallback-10174-thread-1-processing-n:127.0.0.1:65236_solr) [n:127.0.0.1:65236_solr ] o.a.s.c.c.ZkStateReader A live node change: [WatchedEvent state:SyncConnected type:NodeChildrenChanged path:/live_nodes], has occurred - updating... (live nodes size: [1])
    [junit4] 2> 2926994 INFO (zkCallback-10175-thread-1-processing-n:127.0.0.1:65239_solr) [n:127.0.0.1:65239_solr ] o.a.s.c.c.ZkStateReader A live node change: [WatchedEvent state:SyncConnected type:NodeChildrenChanged path:/live_nodes], has occurred - updating... (live nodes size: [1])
    [junit4] 2> 2926994 INFO (zkCallback-10175-thread-1-processing-n:127.0.0.1:65239_solr) [n:127.0.0.1:65239_solr ] o.a.s.c.c.ZkStateReader Updated live nodes from ZooKeeper... (1) -> (2)
    [junit4] 2> 2926994 INFO (zkCallback-10174-thread-1-processing-n:127.0.0.1:65236_solr) [n:127.0.0.1:65236_solr ] o.a.s.c.c.ZkStateReader Updated live nodes from ZooKeeper... (1) -> (2)
    [junit4] 2> 2927001 INFO (jetty-launcher-10164-thread-2) [n:127.0.0.1:65236_solr ] o.a.s.c.CoreContainer Security conf doesn't exist. Skipping setup for authorization module.
    [junit4] 2> 2927001 INFO (jetty-launcher-10164-thread-2) [n:127.0.0.1:65236_solr ] o.a.s.c.CoreContainer No authentication plugin used.
    [junit4] 2> 2927002 INFO (jetty-launcher-10164-thread-2) [n:127.0.0.1:65236_solr ] o.a.s.c.CorePropertiesLocator Looking for core definitions underneath C:\Users\jenkins\workspace\Lucene-Solr-6.x-Windows\solr\build\solr-core\test\J0\temp\solr.schema.TestManagedSchemaAPI_85DB1BA594E5B03A-001\tempDir-001\node2\.
    [junit4] 2> 2927003 INFO (jetty-launcher-10164-thread-2) [n:127.0.0.1:65236_solr ] o.a.s.c.CorePropertiesLocator Found 0 core definitions
    [junit4] 2> 2927003 INFO (jetty-launcher-10164-thread-2) [n:127.0.0.1:65236_solr ] o.a.s.s.SolrDispatchFilter user.dir=C:\Users\jenkins\workspace\Lucene-Solr-6.x-Windows\solr\build\solr-core\test\J0
    [junit4] 2> 2927003 INFO (jetty-launcher-10164-thread-2) [n:127.0.0.1:65236_solr ] o.a.s.s.SolrDispatchFilter SolrDispatchFilter.init() done
    [junit4] 2> 2927004 INFO (SUITE-TestManagedSchemaAPI-seed#[85DB1BA594E5B03A]-worker) [ ] o.a.s.c.c.SolrZkClient Using default ZkCredentialsProvider
    [junit4] 2> 2927004 INFO (SUITE-TestManagedSchemaAPI-seed#[85DB1BA594E5B03A]-worker) [ ] o.a.s.c.c.ConnectionManager Waiting for client to connect to ZooKeeper
    [junit4] 2> 2927006 INFO (zkCallback-10178-thread-1) [ ] o.a.s.c.c.ConnectionManager Watcher org.apache.solr.common.cloud.ConnectionManager@472f907b name:ZooKeeperConnection Watcher:127.0.0.1:65232 got event WatchedEvent state:SyncConnected type:None path:null path:null type:None
    [junit4] 2> 2927006 INFO (SUITE-TestManagedSchemaAPI-seed#[85DB1BA594E5B03A]-worker) [ ] o.a.s.c.c.ConnectionManager Client is connected to ZooKeeper
    [junit4] 2> 2927006 INFO (SUITE-TestManagedSchemaAPI-seed#[85DB1BA594E5B03A]-worker) [ ] o.a.s.c.c.SolrZkClient Using default ZkACLProvider
    [junit4] 2> 2927013 INFO (SUITE-TestManagedSchemaAPI-seed#[85DB1BA594E5B03A]-worker) [ ] o.a.s.c.s.i.CloudSolrClient Final constructed zkHost string: 127.0.0.1:65232/solr
    [junit4] 2> 2927013 INFO (SUITE-TestManagedSchemaAPI-seed#[85DB1BA594E5B03A]-worker) [ ] o.a.s.c.c.SolrZkClient Using default ZkCredentialsProvider
    [junit4] 2> 2927016 INFO (SUITE-TestManagedSchemaAPI-seed#[85DB1BA594E5B03A]-worker) [ ] o.a.s.c.c.ConnectionManager Waiting for client to connect to ZooKeeper
    [junit4] 2> 2927017 INFO (zkCallback-10181-thread-1) [ ] o.a.s.c.c.ConnectionManager Watcher org.apache.solr.common.cloud.ConnectionManager@1d762b29 name:ZooKeeperConnection Watcher:127.0.0.1:65232/solr got event WatchedEvent state:SyncConnected type:None path:null path:null type:None
    [junit4] 2> 2927018 INFO (SUITE-TestManagedSchemaAPI-seed#[85DB1BA594E5B03A]-worker) [ ] o.a.s.c.c.ConnectionManager Client is connected to ZooKeeper
    [junit4] 2> 2927018 INFO (SUITE-TestManagedSchemaAPI-seed#[85DB1BA594E5B03A]-worker) [ ] o.a.s.c.c.SolrZkClient Using default ZkACLProvider
    [junit4] 2> 2927018 INFO (SUITE-TestManagedSchemaAPI-seed#[85DB1BA594E5B03A]-worker) [ ] o.a.s.c.c.ZkStateReader Updating cluster state from ZooKeeper...
    [junit4] 2> 2927019 INFO (SUITE-TestManagedSchemaAPI-seed#[85DB1BA594E5B03A]-worker) [ ] o.a.s.c.c.ZkStateReader Loaded empty cluster properties
    [junit4] 2> 2927020 INFO (SUITE-TestManagedSchemaAPI-seed#[85DB1BA594E5B03A]-worker) [ ] o.a.s.c.c.ZkStateReader Updated live nodes from ZooKeeper... (0) -> (2)
    [junit4] 2> 2927023 INFO (SUITE-TestManagedSchemaAPI-seed#[85DB1BA594E5B03A]-worker) [ ] o.a.s.c.c.SolrZkClient makePath: /configs/conf1/managed-schema
    [junit4] 2> 2927030 INFO (SUITE-TestManagedSchemaAPI-seed#[85DB1BA594E5B03A]-worker) [ ] o.a.s.c.c.SolrZkClient makePath: /configs/conf1/solrconfig.xml
    [junit4] 2> 2927065 INFO (TEST-TestManagedSchemaAPI.test-seed#[85DB1BA594E5B03A]) [ ] o.a.s.SolrTestCaseJ4 ###Starting test
    [junit4] 2> 2927071 INFO (qtp1325253055-46299) [n:127.0.0.1:65239_solr ] o.a.s.h.a.CollectionsHandler Invoked Collection Action :create with params replicationFactor=2&collection.configName=conf1&name=testschemaapi&action=CREATE&numShards=1&wt=javabin&version=2 and sendToOCPQueue=true
    [junit4] 2> 2927075 INFO (OverseerCollectionConfigSetProcessor-96073797010718725-127.0.0.1:65236_solr-n_0000000000) [n:127.0.0.1:65236_solr ] o.a.s.c.OverseerTaskProcessor Overseer Collection Message Handler: Get the message id:/overseer/collection-queue-work/qn-0000000000 message:{
    [junit4] 2> "name":"testschemaapi",
    [junit4] 2> "fromApi":"true",
    [junit4] 2> "replicationFactor":"2",
    [junit4] 2> "collection.configName":"conf1",
    [junit4] 2> "numShards":"1",
    [junit4] 2> "stateFormat":"2",
    [junit4] 2> "operation":"create"}
    [junit4] 2> 2927076 INFO (OverseerThreadFactory-12127-thread-1-processing-n:127.0.0.1:65236_solr) [n:127.0.0.1:65236_solr ] o.a.s.c.OverseerCollectionMessageHandler OverseerCollectionMessageHandler.processMessage : create , {
    [junit4] 2> "name":"testschemaapi",
    [junit4] 2> "fromApi":"true",
    [junit4] 2> "replicationFactor":"2",
    [junit4] 2> "collection.configName":"conf1",
    [junit4] 2> "numShards":"1",
    [junit4] 2> "stateFormat":"2",
    [junit4] 2> "operation":"create"}
    [junit4] 2> 2927076 INFO (OverseerThreadFactory-12127-thread-1-processing-n:127.0.0.1:65236_solr) [n:127.0.0.1:65236_solr ] o.a.s.c.OverseerCollectionMessageHandler Create collection testschemaapi
    [junit4] 2> 2927077 INFO (OverseerThreadFactory-12127-thread-1-processing-n:127.0.0.1:65236_solr) [n:127.0.0.1:65236_solr ] o.a.s.c.OverseerCollectionMessageHandler creating collections conf node /collections/testschemaapi
    [junit4] 2> 2927077 INFO (OverseerThreadFactory-12127-thread-1-processing-n:127.0.0.1:65236_solr) [n:127.0.0.1:65236_solr ] o.a.s.c.c.SolrZkClient makePath: /collections/testschemaapi
    [junit4] 2> 2927079 INFO (zkCallback-10174-thread-1-processing-n:127.0.0.1:65236_solr) [n:127.0.0.1:65236_solr ] o.a.s.c.c.ZkStateReader A collections change: [WatchedEvent state:SyncConnected type:NodeChildrenChanged path:/collections], has occurred - updating...
    [junit4] 2> 2927079 INFO (zkCallback-10181-thread-1) [ ] o.a.s.c.c.ZkStateReader A collections change: [WatchedEvent state:SyncConnected type:NodeChildrenChanged path:/collections], has occurred - updating...
    [junit4] 2> 2927079 INFO (zkCallback-10175-thread-1-processing-n:127.0.0.1:65239_solr) [n:127.0.0.1:65239_solr ] o.a.s.c.c.ZkStateReader A collections change: [WatchedEvent state:SyncConnected type:NodeChildrenChanged path:/collections], has occurred - updating...
    [junit4] 2> 2927084 INFO (OverseerStateUpdate-96073797010718725-127.0.0.1:65236_solr-n_0000000000) [n:127.0.0.1:65236_solr ] o.a.s.c.Overseer processMessage: queueSize: 1, message = {
    [junit4] 2> "name":"testschemaapi",
    [junit4] 2> "fromApi":"true",
    [junit4] 2> "replicationFactor":"2",
    [junit4] 2> "collection.configName":"conf1",
    [junit4] 2> "numShards":"1",
    [junit4] 2> "stateFormat":"2",
    [junit4] 2> "operation":"create"} current state version: 0
    [junit4] 2> 2927084 INFO (OverseerStateUpdate-96073797010718725-127.0.0.1:65236_solr-n_0000000000) [n:127.0.0.1:65236_solr ] o.a.s.c.o.ClusterStateMutator building a new cName: testschemaapi
    [junit4] 2> 2927085 INFO (OverseerStateUpdate-96073797010718725-127.0.0.1:65236_solr-n_0000000000) [n:127.0.0.1:65236_solr ] o.a.s.c.o.ZkStateWriter going to create_collection /collections/testschemaapi/state.json
    [junit4] 2> 2927185 INFO (OverseerThreadFactory-12127-thread-1-processing-n:127.0.0.1:65236_solr) [n:127.0.0.1:65236_solr ] o.a.s.c.OverseerCollectionMessageHandler Creating SolrCores for new collection testschemaapi, shardNames [shard1] , replicationFactor : 2
    [junit4] 2> 2927185 INFO (OverseerThreadFactory-12127-thread-1-processing-n:127.0.0.1:65236_solr) [n:127.0.0.1:65236_solr ] o.a.s.c.OverseerCollectionMessageHandler Creating core testschemaapi_shard1_replica1 as part of shard shard1 of collection testschemaapi on 127.0.0.1:65236_solr
    [junit4] 2> 2927185 INFO (OverseerThreadFactory-12127-thread-1-processing-n:127.0.0.1:65236_solr) [n:127.0.0.1:65236_solr ] o.a.s.c.OverseerCollectionMessageHandler Creating core testschemaapi_shard1_replica2 as part of shard shard1 of collection testschemaapi on 127.0.0.1:65239_solr
    [junit4] 2> 2927188 INFO (qtp1325253055-46300) [n:127.0.0.1:65239_solr ] o.a.s.h.a.CoreAdminOperation core create command qt=/admin/cores&collection.configName=conf1&name=testschemaapi_shard1_replica2&action=CREATE&numShards=1&collection=testschemaapi&shard=shard1&wt=javabin&version=2
    [junit4] 2> 2927188 INFO (qtp626245133-46286) [n:127.0.0.1:65236_solr ] o.a.s.h.a.CoreAdminOperation core create command qt=/admin/cores&collection.configName=conf1&name=testschemaapi_shard1_replica1&action=CREATE&numShards=1&collection=testschemaapi&shard=shard1&wt=javabin&version=2
    [junit4] 2> 2927192 INFO (qtp626245133-46286) [n:127.0.0.1:65236_solr ] o.a.s.c.CoreDescriptor Created CoreDescriptor: {name=testschemaapi_shard1_replica1, collection.configName=conf1, config=solrconfig.xml, transient=false, schema=schema.xml, loadOnStartup=true, configSetProperties=configsetprops.json, collection=testschemaapi, numShards=1, dataDir=data\, shard=shard1}
    [junit4] 2> 2927192 INFO (qtp1325253055-46300) [n:127.0.0.1:65239_solr ] o.a.s.c.CoreDescriptor Created CoreDescriptor: {name=testschemaapi_shard1_replica2, collection.configName=conf1, config=solrconfig.xml, transient=false, schema=schema.xml, loadOnStartup=true, configSetProperties=configsetprops.json, collection=testschemaapi, numShards=1, dataDir=data\, shard=shard1}
    [junit4] 2> 2927195 INFO (qtp626245133-46286) [n:127.0.0.1:65236_solr c:testschemaapi s:shard1 x:testschemaapi_shard1_replica1] o.a.s.c.ZkController publishing state=down
    [junit4] 2> 2927196 INFO (qtp1325253055-46300) [n:127.0.0.1:65239_solr c:testschemaapi s:shard1 x:testschemaapi_shard1_replica2] o.a.s.c.ZkController publishing state=down
    [junit4] 2> 2927197 INFO (qtp1325253055-46300) [n:127.0.0.1:65239_solr c:testschemaapi s:shard1 x:testschemaapi_shard1_replica2] o.a.s.c.ZkController Registering watch for collection testschemaapi
    [junit4] 2> 2927197 INFO (qtp1325253055-46300) [n:127.0.0.1:65239_solr c:testschemaapi s:shard1 x:testschemaapi_shard1_replica2] o.a.s.c.c.ZkStateReader Add data for [testschemaapi] ver [0]
    [junit4] 2> 2927197 INFO (qtp1325253055-46300) [n:127.0.0.1:65239_solr c:testschemaapi s:shard1 x:testschemaapi_shard1_replica2] o.a.s.c.ZkController look for our core node name
    [junit4] 2> 2927198 INFO (OverseerStateUpdate-96073797010718725-127.0.0.1:65236_solr-n_0000000000) [n:127.0.0.1:65236_solr ] o.a.s.c.Overseer processMessage: queueSize: 2, message = {
    [junit4] 2> "core":"testschemaapi_shard1_replica1",
    [junit4] 2> "roles":null,
    [junit4] 2> "base_url":"http://127.0.0.1:65236/solr",
    [junit4] 2> "node_name":"127.0.0.1:65236_solr",
    [junit4] 2> "numShards":"1",
    [junit4] 2> "state":"down",
    [junit4] 2> "shard":"shard1",
    [junit4] 2> "collection":"testschemaapi",
    [junit4] 2> "operation":"state"} current state version: 0
    [junit4] 2> 2927198 INFO (OverseerStateUpdate-96073797010718725-127.0.0.1:65236_solr-n_0000000000) [n:127.0.0.1:65236_solr ] o.a.s.c.o.ReplicaMutator Update state numShards=1 message={
    [junit4] 2> "core":"testschemaapi_shard1_replica1",
    [junit4] 2> "roles":null,
    [junit4] 2> "base_url":"http://127.0.0.1:65236/solr",
    [junit4] 2> "node_name":"127.0.0.1:65236_solr",
    [junit4] 2> "numShards":"1",
    [junit4] 2> "state":"down",
    [junit4] 2> "shard":"shard1",
    [junit4] 2> "collection":"testschemaapi",
    [junit4] 2> "operation":"state"}
    [junit4] 2> 2927199 INFO (qtp626245133-46286) [n:127.0.0.1:65236_solr c:testschemaapi s:shard1 x:testschemaapi_shard1_replica1] o.a.s.c.ZkController Registering watch for collection testschemaapi
    [junit4] 2> 2927200 INFO (qtp626245133-46286) [n:127.0.0.1:65236_solr c:testschemaapi s:shard1 x:testschemaapi_shard1_replica1] o.a.s.c.c.ZkStateReader Add data for [testschemaapi] ver [0]
    [junit4] 2> 2927200 INFO (qtp626245133-46286) [n:127.0.0.1:65236_solr c:testschemaapi s:shard1 x:testschemaapi_shard1_replica1] o.a.s.c.ZkController look for our core node name
    [junit4] 2> 2927202 INFO (OverseerStateUpdate-96073797010718725-127.0.0.1:65236_solr-n_0000000000) [n:127.0.0.1:65236_solr ] o.a.s.c.Overseer processMessage: queueSize: 2, message = {
    [junit4] 2> "core":"testschemaapi_shard1_replica2",
    [junit4] 2> "roles":null,
    [junit4] 2> "base_url":"http://127.0.0.1:65239/solr",
    [junit4] 2> "node_name":"127.0.0.1:65239_solr",
    [junit4] 2> "numShards":"1",
    [junit4] 2> "state":"down",
    [junit4] 2> "shard":"shard1",
    [junit4] 2> "collection":"testschemaapi",
    [junit4] 2> "operation":"state"} current state version: 0
    [junit4] 2> 2927202 INFO (OverseerStateUpdate-96073797010718725-127.0.0.1:65236_solr-n_0000000000) [n:127.0.0.1:65236_solr ] o.a.s.c.o.ReplicaMutator Update state numShards=1 message={
    [junit4] 2> "core":"testschemaapi_shard1_replica2",
    [junit4] 2> "roles":null,
    [junit4] 2> "base_url":"http://127.0.0.1:65239/solr",
    [junit4] 2> "node_name":"127.0.0.1:65239_solr",
    [junit4] 2> "numShards":"1",
    [junit4] 2> "state":"down",
    [junit4] 2> "shard":"shard1",
    [junit4] 2> "collection":"testschemaapi",
    [junit4] 2> "operation":"state"}
    [junit4] 2> 2927315 INFO (OverseerStateUpdate-96073797010718725-127.0.0.1:65236_solr-n_0000000000) [n:127.0.0.1:65236_solr ] o.a.s.c.o.ZkStateWriter going to update_collection /collections/testschemaapi/state.json version: 0
    [junit4] 2> 2927320 INFO (zkCallback-10174-thread-1-processing-n:127.0.0.1:65236_solr) [n:127.0.0.1:65236_solr ] o.a.s.c.c.ZkStateReader A cluster state change: [WatchedEvent state:SyncConnected type:NodeDataChanged path:/collections/testschemaapi/state.json] for collection [testschemaapi] has occurred - updating... (live nodes size: [2])
    [junit4] 2> 2927320 INFO (zkCallback-10175-thread-1-processing-n:127.0.0.1:65239_solr) [n:127.0.0.1:65239_solr ] o.a.s.c.c.ZkStateReader A cluster state change: [WatchedEvent state:SyncConnected type:NodeDataChanged path:/collections/testschemaapi/state.json] for collection [testschemaapi] has occurred - updating... (live nodes size: [2])
    [junit4] 2> 2927321 INFO (zkCallback-10174-thread-1-processing-n:127.0.0.1:65236_solr) [n:127.0.0.1:65236_solr ] o.a.s.c.c.ZkStateReader Updating data for [testschemaapi] from [0] to [1]
    [junit4] 2> 2927321 INFO (zkCallback-10175-thread-1-processing-n:127.0.0.1:65239_solr) [n:127.0.0.1:65239_solr ] o.a.s.c.c.ZkStateReader Updating data for [testschemaapi] from [0] to [1]
    [junit4] 2> 2928198 INFO (qtp1325253055-46300) [n:127.0.0.1:65239_solr c:testschemaapi s:shard1 x:testschemaapi_shard1_replica2] o.a.s.c.ZkController waiting to find shard id in clusterstate for testschemaapi_shard1_replica2
    [junit4] 2> 2928198 INFO (qtp1325253055-46300) [n:127.0.0.1:65239_solr c:testschemaapi s:shard1 x:testschemaapi_shard1_replica2] o.a.s.c.ZkController Check for collection zkNode:testschemaapi
    [junit4] 2> 2928199 INFO (qtp1325253055-46300) [n:127.0.0.1:65239_solr c:testschemaapi s:shard1 x:testschemaapi_shard1_replica2] o.a.s.c.ZkController Collection zkNode exists
    [junit4] 2> 2928199 INFO (qtp1325253055-46300) [n:127.0.0.1:65239_solr c:testschemaapi s:shard1 x:testschemaapi_shard1_replica2] o.a.s.c.c.ZkStateReader Load collection config from: [/collections/testschemaapi]
    [junit4] 2> 2928200 INFO (qtp626245133-46286) [n:127.0.0.1:65236_solr c:testschemaapi s:shard1 x:testschemaapi_shard1_replica1] o.a.s.c.ZkController waiting to find shard id in clusterstate for testschemaapi_shard1_replica1
    [junit4] 2> 2928200 INFO (qtp626245133-46286) [n:127.0.0.1:65236_solr c:testschemaapi s:shard1 x:testschemaapi_shard1_replica1] o.a.s.c.ZkController Check for collection zkNode:testschemaapi
    [junit4] 2> 2928201 INFO (qtp626245133-46286) [n:127.0.0.1:65236_solr c:testschemaapi s:shard1 x:testschemaapi_shard1_replica1] o.a.s.c.ZkController Collection zkNode exists
    [junit4] 2> 2928201 INFO (qtp626245133-46286) [n:127.0.0.1:65236_solr c:testschemaapi s:shard1 x:testschemaapi_shard1_replica1] o.a.s.c.c.ZkStateReader Load collection config from: [/collections/testschemaapi]
    [junit4] 2> 2928202 INFO (qtp1325253055-46300) [n:127.0.0.1:65239_solr c:testschemaapi s:shard1 x:testschemaapi_shard1_replica2] o.a.s.c.c.ZkStateReader path=[/collections/testschemaapi] [configName]=[conf1] specified config exists in ZooKeeper
    [junit4] 2> 2928202 INFO (qtp1325253055-46300) [n:127.0.0.1:65239_solr c:testschemaapi s:shard1 x:testschemaapi_shard1_replica2] o.a.s.c.SolrResourceLoader new SolrResourceLoader for directory: 'C:\Users\jenkins\workspace\Lucene-Solr-6.x-Windows\solr\build\solr-core\test\J0\temp\solr.schema.TestManagedSchemaAPI_85DB1BA594E5B03A-001\tempDir-001\node1\testschemaapi_shard1_replica2'
    [junit4] 2> 2928203 INFO (qtp1325253055-46300) [n:127.0.0.1:65239_solr c:testschemaapi s:shard1 x:testschemaapi_shard1_replica2] o.a.s.c.SolrResourceLoader JNDI not configured for solr (NoInitialContextEx)
    [junit4] 2> 2928203 INFO (qtp1325253055-46300) [n:127.0.0.1:65239_solr c:testschemaapi s:shard1 x:testschemaapi_shard1_replica2] o.a.s.c.SolrResourceLoader solr home defaulted to 'solr/' (could not find system property or JNDI)
    [junit4] 2> 2928205 INFO (qtp626245133-46286) [n:127.0.0.1:65236_solr c:testschemaapi s:shard1 x:testschemaapi_shard1_replica1] o.a.s.c.c.ZkStateReader path=[/collections/testschemaapi] [configName]=[conf1] specified config exists in ZooKeeper
    [junit4] 2> 2928205 INFO (qtp626245133-46286) [n:127.0.0.1:65236_solr c:testschemaapi s:shard1 x:testschemaapi_shard1_replica1] o.a.s.c.SolrResourceLoader new SolrResourceLoader for directory: 'C:\Users\jenkins\workspace\Lucene-Solr-6.x-Windows\solr\build\solr-core\test\J0\temp\solr.schema.TestManagedSchemaAPI_85DB1BA594E5B03A-001\tempDir-001\node2\testschemaapi_shard1_replica1'
    [junit4] 2> 2928205 INFO (qtp626245133-46286) [n:127.0.0.1:65236_solr c:testschemaapi s:shard1 x:testschemaapi_shard1_replica1] o.a.s.c.SolrResourceLoader JNDI not configured for solr (NoInitialContextEx)
    [junit4] 2> 2928205 INFO (qtp626245133-46286) [n:127.0.0.1:65236_solr c:testschemaapi s:shard1 x:testschemaapi_shard1_replica1] o.a.s.c.SolrResourceLoader solr home defaulted to 'solr/' (could not find system property or JNDI)
    [junit4] 2> 2928210 INFO (qtp1325253055-46300) [n:127.0.0.1:65239_solr c:testschemaapi s:shard1 x:testschemaapi_shard1_replica2] o.a.s.c.Config loaded config solrconfig.xml with version 0
    [junit4] 2> 2928212 INFO (qtp626245133-46286) [n:127.0.0.1:65236_solr c:testschemaapi s:shard1 x:testschemaapi_shard1_replica1] o.a.s.c.Config loaded config solrconfig.xml with version 0
    [junit4] 2> 2928217 INFO (qtp1325253055-46300) [n:127.0.0.1:65239_solr c:testschemaapi s:shard1 x:testschemaapi_shard1_replica2] o.a.s.c.SolrConfig current version of requestparams : -1
    [junit4] 2> 2928217 INFO (qtp626245133-46286) [n:127.0.0.1:65236_solr c:testschemaapi s:shard1 x:testschemaapi_shard1_replica1] o.a.s.c.SolrConfig current version of requestparams : -1
    [junit4] 2> 2928219 INFO (qtp1325253055-46300) [n:127.0.0.1:65239_solr c:testschemaapi s:shard1 x:testschemaapi_shard1_replica2] o.a.s.c.SolrConfig Using Lucene MatchVersion: 6.2.0
    [junit4] 2> 2928219 INFO (qtp626245133-46286) [n:127.0.0.1:65236_solr c:testschemaapi s:shard1 x:testschemaapi_shard1_replica1] o.a.s.c.SolrConfig Using Lucene MatchVersion: 6.2.0
    [junit4] 2> 2928222 INFO (qtp1325253055-46300) [n:127.0.0.1:65239_solr c:testschemaapi s:shard1 x:testschemaapi_shard1_replica2] o.a.s.c.SolrConfig Loaded SolrConfig: solrconfig.xml
    [junit4] 2> 2928222 INFO (qtp626245133-46286) [n:127.0.0.1:65236_solr c:testschemaapi s:shard1 x:testschemaapi_shard1_replica1] o.a.s.c.SolrConfig Loaded SolrConfig: solrconfig.xml
    [junit4] 2> 2928226 INFO (qtp626245133-46286) [n:127.0.0.1:65236_solr c:testschemaapi s:shard1 x:testschemaapi_shard1_replica1] o.a.s.s.IndexSchema [testschemaapi_shard1_replica1] Schema name=minimal
    [junit4] 2> 2928227 INFO (qtp1325253055-46300) [n:127.0.0.1:65239_solr c:testschemaapi s:shard1 x:testschemaapi_shard1_replica2] o.a.s.s.IndexSchema [testschemaapi_shard1_replica2] Schema name=minimal
    [junit4] 2> 2928232 INFO (qtp1325253055-46300) [n:127.0.0.1:65239_solr c:testschemaapi s:shard1 x:testschemaapi_shard1_replica2] o.a.s.s.IndexSchema unique key field: id
    [junit4] 2> 2928232 INFO (qtp626245133-46286) [n:127.0.0.1:65236_solr c:testschemaapi s:shard1 x:testschemaapi_shard1_replica1] o.a.s.s.IndexSchema unique key field: id
    [junit4] 2> 2928237 INFO (qtp626245133-46286) [n:127.0.0.1:65236_solr c:testschemaapi s:shard1 x:testschemaapi_shard1_replica1] o.a.s.c.ConfigSetProperties Did not find ConfigSet properties, assuming default properties: Can't find resource 'configsetprops.json' in classpath or '/configs/conf1', cwd=C:\Users\jenkins\workspace\Lucene-Solr-6.x-Windows\solr\build\solr-core\test\J0
    [junit4] 2> 2928238 INFO (qtp626245133-46286) [n:127.0.0.1:65236_solr c:testschemaapi s:shard1 x:testschemaapi_shard1_replica1] o.a.s.c.CoreContainer Creating SolrCore 'testschemaapi_shard1_replica1' using configuration from collection testschemaapi
    [junit4] 2> 2928238 INFO (qtp1325253055-46300) [n:127.0.0.1:65239_solr c:testschemaapi s:shard1 x:testschemaapi_shard1_replica2] o.a.s.c.ConfigSetProperties Did not find ConfigSet properties, assuming default properties: Can't find resource 'configsetprops.json' in classpath or '/configs/conf1', cwd=C:\Users\jenkins\workspace\Lucene-Solr-6.x-Windows\solr\build\solr-core\test\J0
    [junit4] 2> 2928238 INFO (qtp1325253055-46300) [n:127.0.0.1:65239_solr c:testschemaapi s:shard1 x:testschemaapi_shard1_replica2] o.a.s.c.CoreContainer Creating SolrCore 'testschemaapi_shard1_replica2' using configuration from collection testschemaapi
    [junit4] 2> 2928238 INFO (qtp626245133-46286) [n:127.0.0.1:65236_solr c:testschemaapi s:shard1 r:core_node1 x:testschemaapi_shard1_replica1] o.a.s.c.SolrCore org.apache.solr.core.MockDirectoryFactory
    [junit4] 2> 2928238 INFO (qtp1325253055-46300) [n:127.0.0.1:65239_solr c:testschemaapi s:shard1 r:core_node2 x:testschemaapi_shard1_replica2] o.a.s.c.SolrCore org.apache.solr.core.MockDirectoryFactory
    [junit4] 2> 2928238 INFO (qtp626245133-46286) [n:127.0.0.1:65236_solr c:testschemaapi s:shard1 r:core_node1 x:testschemaapi_shard1_replica1] o.a.s.c.SolrCore [[testschemaapi_shard1_replica1] ] Opening new SolrCore at [C:\Users\jenkins\workspace\Lucene-Solr-6.x-Windows\solr\build\solr-core\test\J0\temp\solr.schema.TestManagedSchemaAPI_85DB1BA594E5B03A-001\tempDir-001\node2\testschemaapi_shard1_replica1], dataDir=[C:\Users\jenkins\workspace\Lucene-Solr-6.x-Windows\solr\build\solr-core\test\J0\temp\solr.schema.TestManagedSchemaAPI_85DB1BA594E5B03A-001\tempDir-001\node2\.\testschemaapi_shard1_replica1\data\]
    [junit4] 2> 2928238 INFO (qtp1325253055-46300) [n:127.0.0.1:65239_solr c:testschemaapi s:shard1 r:core_node2 x:testschemaapi_shard1_replica2] o.a.s.c.SolrCore [[testschemaapi_shard1_replica2] ] Opening new SolrCore at [C:\Users\jenkins\workspace\Lucene-Solr-6.x-Windows\solr\build\solr-core\test\J0\temp\solr.schema.TestManagedSchemaAPI_85DB1BA594E5B03A-001\tempDir-001\node1\testschemaapi_shard1_replica2], dataDir=[C:\Users\jenkins\workspace\Lucene-Solr-6.x-Windows\solr\build\solr-core\test\J0\temp\solr.schema.TestManagedSchemaAPI_85DB1BA594E5B03A-001\tempDir-001\node1\.\testschemaapi_shard1_replica2\data\]
    [junit4] 2> 2928238 INFO (qtp626245133-46286) [n:127.0.0.1:65236_solr c:testschemaapi s:shard1 r:core_node1 x:testschemaapi_shard1_replica1] o.a.s.c.SolrCore JMX monitoring not detected for core: testschemaapi_shard1_replica1
    [junit4] 2> 2928238 INFO (qtp1325253055-46300) [n:127.0.0.1:65239_solr c:testschemaapi s:shard1 r:core_node2 x:testschemaapi_shard1_replica2] o.a.s.c.SolrCore JMX monitoring not detected for core: testschemaapi_shard1_replica2
    [junit4] 2> 2928239 INFO (qtp626245133-46286) [n:127.0.0.1:65236_solr c:testschemaapi s:shard1 r:core_node1 x:testschemaapi_shard1_replica1] o.a.s.c.CachingDirectoryFactory return new directory for C:\Users\jenkins\workspace\Lucene-Solr-6.x-Windows\solr\build\solr-core\test\J0\temp\solr.schema.TestManagedSchemaAPI_85DB1BA594E5B03A-001\tempDir-001\node2\.\testschemaapi_shard1_replica1\data\
    [junit4] 2> 2928239 INFO (qtp1325253055-46300) [n:127.0.0.1:65239_solr c:testschemaapi s:shard1 r:core_node2 x:testschemaapi_shard1_replica2] o.a.s.c.CachingDirectoryFactory return new directory for C:\Users\jenkins\workspace\Lucene-Solr-6.x-Windows\solr\build\solr-core\test\J0\temp\solr.schema.TestManagedSchemaAPI_85DB1BA594E5B03A-001\tempDir-001\node1\.\testschemaapi_shard1_replica2\data\
    [junit4] 2> 2928239 INFO (qtp626245133-46286) [n:127.0.0.1:65236_solr c:testschemaapi s:shard1 r:core_node1 x:testschemaapi_shard1_replica1] o.a.s.c.SolrCore New index directory detected: old=null new=C:\Users\jenkins\workspace\Lucene-Solr-6.x-Windows\solr\build\solr-core\test\J0\temp\solr.schema.TestManagedSchemaAPI_85DB1BA594E5B03A-001\tempDir-001\node2\.\testschemaapi_shard1_replica1\data\index/
    [junit4] 2> 2928239 INFO (qtp1325253055-46300) [n:127.0.0.1:65239_solr c:testschemaapi s:shard1 r:core_node2 x:testschemaapi_shard1_replica2] o.a.s.c.SolrCore New index directory detected: old=null new=C:\Users\jenkins\workspace\Lucene-Solr-6.x-Windows\solr\build\solr-core\test\J0\temp\solr.schema.TestManagedSchemaAPI_85DB1BA594E5B03A-001\tempDir-001\node1\.\testschemaapi_shard1_replica2\data\index/
    [junit4] 2> 2928240 WARN (qtp1325253055-46300) [n:127.0.0.1:65239_solr c:testschemaapi s:shard1 r:core_node2 x:testschemaapi_shard1_replica2] o.a.s.c.SolrCore [testschemaapi_shard1_replica2] Solr index directory 'C:\Users\jenkins\workspace\Lucene-Solr-6.x-Windows\solr\build\solr-core\test\J0\temp\solr.schema.TestManagedSchemaAPI_85DB1BA594E5B03A-001\tempDir-001\node1\.\testschemaapi_shard1_replica2\data\index' doesn't exist. Creating new index...
    [junit4] 2> 2928239 WARN (qtp626245133-46286) [n:127.0.0.1:65236_solr c:testschemaapi s:shard1 r:core_node1 x:testschemaapi_shard1_replica1] o.a.s.c.SolrCore [testschemaapi_shard1_replica1] Solr index directory 'C:\Users\jenkins\workspace\Lucene-Solr-6.x-Windows\solr\build\solr-core\test\J0\temp\solr.schema.TestManagedSchemaAPI_85DB1BA594E5B03A-001\tempDir-001\node2\.\testschemaapi_shard1_replica1\data\index' doesn't exist. Creating new index...
    [junit4] 2> 2928240 INFO (qtp1325253055-46300) [n:127.0.0.1:65239_solr c:testschemaapi s:shard1 r:core_node2 x:testschemaapi_shard1_replica2] o.a.s.c.CachingDirectoryFactory return new directory for C:\Users\jenkins\workspace\Lucene-Solr-6.x-Windows\solr\build\solr-core\test\J0\temp\solr.schema.TestManagedSchemaAPI_85DB1BA594E5B03A-001\tempDir-001\node1\.\testschemaapi_shard1_replica2\data\index
    [junit4] 2> 2928240 INFO (qtp626245133-46286) [n:127.0.0.1:65236_solr c:testschemaapi s:shard1 r:core_node1 x:testschemaapi_shard1_replica1] o.a.s.c.CachingDirectoryFactory return new directory for C:\Users\jenkins\workspace\Lucene-Solr-6.x-Windows\solr\build\solr-core\test\J0\temp\solr.schema.TestManagedSchemaAPI_85DB1BA594E5B03A-001\tempDir-001\node2\.\testschemaapi_shard1_replica1\data\index
    [junit4] 2> 2928241 INFO (qtp626245133-46286) [n:127.0.0.1:65236_solr c:testschemaapi s:shard1 r:core_node1 x:testschemaapi_shard1_replica1] o.a.s.c.SolrDeletionPolicy SolrDeletionPolicy.onCommit: commits: num=1
    [junit4] 2> commit{dir=MockDirectoryWrapper(RAMDirectory@2d9cb808 lockFactory=org.apache.lucene.store.SingleInstanceLockFactory@6f20eb4f),segFN=segments_1,generation=1}
    [junit4] 2> 2928241 INFO (qtp626245133-46286) [n:127.0.0.1:65236_solr c:testschemaapi s:shard1 r:core_node1 x:testschemaapi_shard1_replica1] o.a.s.c.SolrDeletionPolicy newest commit generation = 1
    [junit4] 2> 2928241 INFO (qtp1325253055-46300) [n:127.0.0.1:65239_solr c:testschemaapi s:shard1 r:core_node2 x:testschemaapi_shard1_replica2] o.a.s.c.SolrDeletionPolicy SolrDeletionPolicy.onCommit: commits: num=1
    [junit4] 2> commit{dir=MockDirectoryWrapper(RAMDirectory@55546ea6 lockFactory=org.apache.lucene.store.SingleInstanceLockFactory@54101109),segFN=segments_1,generation=1}
    [junit4] 2> 2928241 INFO (qtp1325253055-46300) [n:127.0.0.1:65239_solr c:testschemaapi s:shard1 r:core_node2 x:testschemaapi_shard1_replica2] o.a.s.c.SolrDeletionPolicy newest commit generation = 1
    [junit4] 2> 2928243 INFO (qtp626245133-46286) [n:127.0.0.1:65236_solr c:testschemaapi s:shard1 r:core_node1 x:testschemaapi_shard1_replica1] o.a.s.c.SolrCore no updateRequestProcessorChain defined as default, creating implicit default
    [junit4] 2> 2928243 INFO (qtp1325253055-46300) [n:127.0.0.1:65239_solr c:testschemaapi s:shard1 r:core_node2 x:testschemaapi_shard1_replica2] o.a.s.c.SolrCore no updateRequestProcessorChain defined as default, creating implicit default
    [junit4] 2> 2928249 INFO (OldIndexDirectoryCleanupThreadForCore-testschemaapi_shard1_replica1) [n:127.0.0.1:65236_solr c:testschemaapi s:shard1 r:core_node1 x:testschemaapi_shard1_replica1] o.a.s.c.SolrCore Looking for old index directories to cleanup for core testschemaapi_shard1_replica1 in C:\Users\jenkins\workspace\Lucene-Solr-6.x-Windows\solr\build\solr-core\test\J0\temp\solr.schema.TestManagedSchemaAPI_85DB1BA594E5B03A-001\tempDir-001\node2\.\testschemaapi_shard1_replica1\data\
    [junit4] 2> 2928250 WARN (OldIndexDirectoryCleanupThreadForCore-testschemaapi_shard1_replica1) [n:127.0.0.1:65236_solr c:testschemaapi s:shard1 r:core_node1 x:testschemaapi_shard1_replica1] o.a.s.c.DirectoryFactory C:\Users\jenkins\workspace\Lucene-Solr-6.x-Windows\solr\build\solr-core\test\J0\temp\solr.schema.TestManagedSchemaAPI_85DB1BA594E5B03A-001\tempDir-001\node2\.\testschemaapi_shard1_replica1\data\ does not point to a valid data directory; skipping clean-up of old index directories.
    [junit4] 2> 2928250 INFO (qtp1325253055-46300) [n:127.0.0.1:65239_solr c:testschemaapi s:shard1 r:core_node2 x:testschemaapi_shard1_replica2] o.a.s.h.l.XMLLoader xsltCacheLifetimeSeconds=60
    [junit4] 2> 2928250 INFO (qtp626245133-46286) [n:127.0.0.1:65236_solr c:testschemaapi s:shard1 r:core_node1 x:testschemaapi_shard1_replica1] o.a.s.h.l.XMLLoader xsltCacheLifetimeSeconds=60
    [junit4] 2> 2928250 INFO (OldIndexDirectoryCleanupThreadForCore-testschemaapi_shard1_replica2) [n:127.0.0.1:65239_solr c:testschemaapi s:shard1 r:core_node2 x:testschemaapi_shard1_replica2] o.a.s.c.SolrCore Looking for old index directories to cleanup for core testschemaapi_shard1_replica2 in C:\Users\jenkins\workspace\Lucene-Solr-6.x-Windows\solr\build\solr-core\test\J0\temp\solr.schema.TestManagedSchemaAPI_85DB1BA594E5B03A-001\tempDir-001\node1\.\testschemaapi_shard1_replica2\data\
    [junit4] 2> 2928252 INFO (qtp1325253055-46300) [n:127.0.0.1:65239_solr c:testschemaapi s:shard1 r:core_node2 x:testschemaapi_shard1_replica2] o.a.s.h.l.XMLLoader xsltCacheLifetimeSeconds=60
    [junit4] 2> 2928252 WARN (OldIndexDirectoryCleanupThreadForCore-testschemaapi_shard1_replica2) [n:127.0.0.1:65239_solr c:testschemaapi s:shard1 r:core_node2 x:testschemaapi_shard1_replica2] o.a.s.c.DirectoryFactory C:\Users\jenkins\workspace\Lucene-Solr-6.x-Windows\solr\build\solr-core\test\J0\temp\solr.schema.TestManagedSchemaAPI_85DB1BA594E5B03A-001\tempDir-001\node1\.\testschemaapi_shard1_replica2\data\ does not point to a valid data directory; skipping clean-up of old index directories.
    [junit4] 2> 2928253 INFO (qtp1325253055-46300) [n:127.0.0.1:65239_solr c:testschemaapi s:shard1 r:core_node2 x:testschemaapi_shard1_replica2] o.a.s.h.l.XMLLoader xsltCacheLifetimeSeconds=60
    [junit4] 2> 2928253 INFO (qtp626245133-46286) [n:127.0.0.1:65236_solr c:testschemaapi s:shard1 r:core_node1 x:testschemaapi_shard1_replica1] o.a.s.h.l.XMLLoader xsltCacheLifetimeSeconds=60
    [junit4] 2> 2928254 INFO (qtp1325253055-46300) [n:127.0.0.1:65239_solr c:testschemaapi s:shard1 r:core_node2 x:testschemaapi_shard1_replica2] o.a.s.h.l.XMLLoader xsltCacheLifetimeSeconds=60
    [junit4] 2> 2928254 INFO (qtp626245133-46286) [n:127.0.0.1:65236_solr c:testschemaapi s:shard1 r:core_node1 x:testschemaapi_shard1_replica1] o.a.s.h.l.XMLLoader xsltCacheLifetimeSeconds=60
    [junit4] 2> 2928255 INFO (qtp626245133-46286) [n:127.0.0.1:65236_solr c:testschemaapi s:shard1 r:core_node1 x:testschemaapi_shard1_replica1] o.a.s.h.l.XMLLoader xsltCacheLifetimeSeconds=60
    [junit4] 2> 2928256 INFO (qtp1325253055-46300) [n:127.0.0.1:65239_solr c:testschemaapi s:shard1 r:core_node2 x:testschemaapi_shard1_replica2] o.a.s.c.RequestHandlers Registered paths: /admin/mbeans,/update/csv,/sql,/update/json/docs,/admin/luke,/graph,/export,/select,/admin/segments,/get,/admin/system,/replication,/admin/properties,/config,/stream,/schema,/admin/plugins,/admin/logging,/update/json,/admin/ping,/admin/threads,/update,/admin/file
    [junit4] 2> 2928256 INFO (qtp1325253055-46300) [n:127.0.0.1:65239_solr c:testschemaapi s:shard1 r:core_node2 x:testschemaapi_shard1_replica2] o.a.s.c.SolrCore Using default statsCache cache: org.apache.solr.search.stats.LocalStatsCache
    [junit4] 2> 2928257 INFO (qtp626245133-46286) [n:127.0.0.1:65236_solr c:testschemaapi s:shard1 r:core_node1 x:testschemaapi_shard1_replica1] o.a.s.c.RequestHandlers Registered paths: /admin/mbeans,/update/csv,/sql,/update/json/docs,/admin/luke,/graph,/export,/select,/admin/segments,/get,/admin/system,/replication,/admin/properties,/config,/stream,/schema,/admin/plugins,/admin/logging,/update/json,/admin/ping,/admin/threads,/update,/admin/file
    [junit4] 2> 2928257 INFO (qtp626245133-46286) [n:127.0.0.1:65236_solr c:testschemaapi s:shard1 r:core_node1 x:testschemaapi_shard1_replica1] o.a.s.c.SolrCore Using default statsCache cache: org.apache.solr.search.stats.LocalStatsCache
    [junit4] 2> 2928258 INFO (qtp1325253055-46300) [n:127.0.0.1:65239_solr c:testschemaapi s:shard1 r:core_node2 x:testschemaapi_shard1_replica2] o.a.s.u.UpdateHandler Using UpdateLog implementation: org.apache.solr.update.UpdateLog
    [junit4] 2> 2928258 INFO (qtp1325253055-46300) [n:127.0.0.1:65239_solr c:testschemaapi s:shard1 r:core_node2 x:testschemaapi_shard1_replica2] o.a.s.u.UpdateLog Initializing UpdateLog: dataDir=null defaultSyncLevel=FLUSH numRecordsToKeep=100 maxNumLogsToKeep=10 numVersionBuckets=65536
    [junit4] 2> 2928258 INFO (qtp626245133-46286) [n:127.0.0.1:65236_solr c:testschemaapi s:shard1 r:core_node1 x:testschemaapi_shard1_replica1] o.a.s.u.UpdateHandler Using UpdateLog implementation: org.apache.solr.update.UpdateLog
    [junit4] 2> 2928258 INFO (qtp626245133-46286) [n:127.0.0.1:65236_solr c:testschemaapi s:shard1 r:core_node1 x:testschemaapi_shard1_replica1] o.a.s.u.UpdateLog Initializing UpdateLog: dataDir=null defaultSyncLevel=FLUSH numRecordsToKeep=100 maxNumLogsToKeep=10 numVersionBuckets=65536
    [junit4] 2> 2928260 INFO (qtp1325253055-46300) [n:127.0.0.1:65239_solr c:testschemaapi s:shard1 r:core_node2 x:testschemaapi_shard1_replica2] o.a.s.u.CommitTracker Hard AutoCommit: disabled
    [junit4] 2> 2928260 INFO (qtp1325253055-46300) [n:127.0.0.1:65239_solr c:testschemaapi s:shard1 r:core_node2 x:testschemaapi_shard1_replica2] o.a.s.u.CommitTracker Soft AutoCommit: disabled
    [junit4] 2> 2928260 INFO (qtp626245133-46286) [n:127.0.0.1:65236_solr c:testschemaapi s:shard1 r:core_node1 x:testschemaapi_shard1_replica1] o.a.s.u.CommitTracker Hard AutoCommit: disabled
    [junit4] 2> 2928260 INFO (qtp626245133-46286) [n:127.0.0.1:65236_solr c:testschemaapi s:shard1 r:core_node1 x:testschemaapi_shard1_replica1] o.a.s.u.CommitTracker Soft AutoCommit: disabled
    [junit4] 2> 2928262 INFO (qtp1325253055-46300) [n:127.0.0.1:65239_solr c:testschemaapi s:shard1 r:core_node2 x:testschemaapi_shard1_replica2] o.a.s.c.SolrDeletionPolicy SolrDeletionPolicy.onInit: commits: num=1
    [junit4] 2> commit{dir=MockDirectoryWrapper(RAMDirectory@55546ea6 lockFactory=org.apache.lucene.store.SingleInstanceLockFactory@54101109),segFN=segments_1,generation=1}
    [junit4] 2> 2928262 INFO (qtp1325253055-46300) [n:127.0.0.1:65239_solr c:testschemaapi s:shard1 r:core_node2 x:testschemaapi_shard1_replica2] o.a.s.c.SolrDeletionPolicy newest commit generation = 1
    [junit4] 2> 2928262 INFO (qtp1325253055-46300) [n:127.0.0.1:65239_solr c:testschemaapi s:shard1 r:core_node2 x:testschemaapi_shard1_replica2] o.a.s.s.SolrIndexSearcher Opening [Searcher@74748b7f[testschemaapi_shard1_replica2] main]
    [junit4] 2> 2928262 INFO (qtp1325253055-46300) [n:127.0.0.1:65239_solr c:testschemaapi s:shard1 r:core_node2 x:testschemaapi_shard1_replica2] o.a.s.c.c.ZkStateReader Load collection config from: [/collections/testschemaapi]
    [junit4] 2> 2928263 INFO (qtp626245133-46286) [n:127.0.0.1:65236_solr c:testschemaapi s:shard1 r:core_node1 x:testschemaapi_shard1_replica1] o.a.s.c.SolrDeletionPolicy SolrDeletionPolicy.onInit: commits: num=1
    [junit4] 2> commit{dir=MockDirectoryWrapper(RAMDirectory@2d9cb808 lockFactory=org.apache.lucene.store.SingleInstanceLockFactory@6f20eb4f),segFN=segments_1,generation=1}
    [junit4] 2> 2928263 INFO (qtp626245133-46286) [n:127.0.0.1:65236_solr c:testschemaapi s:shard1 r:core_node1 x:testschemaapi_shard1_replica1] o.a.s.c.SolrDeletionPolicy newest commit generation = 1
    [junit4] 2> 2928263 INFO (qtp626245133-46286) [n:127.0.0.1:65236_solr c:testschemaapi s:shard1 r:core_node1 x:testschemaapi_shard1_replica1] o.a.s.s.SolrIndexSearcher Opening [Searcher@3b1c1ad7[testschemaapi_shard1_replica1] main]
    [junit4] 2> 2928263 INFO (qtp626245133-46286) [n:127.0.0.1:65236_solr c:testschemaapi s:shard1 r:core_node1 x:testschemaapi_shard1_replica1] o.a.s.c.c.ZkStateReader Load collection config from: [/collections/testschemaapi]
    [junit4] 2> 2928263 INFO (qtp1325253055-46300) [n:127.0.0.1:65239_solr c:testschemaapi s:shard1 r:core_node2 x:testschemaapi_shard1_replica2] o.a.s.c.c.ZkStateReader path=[/collections/testschemaapi] [configName]=[conf1] specified config exists in ZooKeeper
    [junit4] 2> 2928264 INFO (qtp1325253055-46300) [n:127.0.0.1:65239_solr c:testschemaapi s:shard1 r:core_node2 x:testschemaapi_shard1_replica2] o.a.s.r.ManagedResourceStorage Setting up ZooKeeper-based storage for the RestManager with znodeBase: /configs/conf1
    [junit4] 2> 2928264 INFO (qtp626245133-46286) [n:127.0.0.1:65236_solr c:testschemaapi s:shard1 r:core_node1 x:testschemaapi_shard1_replica1] o.a.s.c.c.ZkStateReader path=[/collections/testschemaapi] [configName]=[conf1] specified config exists in ZooKeeper
    [junit4] 2> 2928264 INFO (qtp626245133-46286) [n:127.0.0.1:65236_solr c:testschemaapi s:shard1 r:core_node1 x:testschemaapi_shard1_replica1] o.a.s.r.ManagedResourceStorage Setting up ZooKeeper-based storage for the RestManager with znodeBase: /configs/conf1
    [junit4] 2> 2928265 INFO (qtp626245133-46286) [n:127.0.0.1:65236_solr c:testschemaapi s:shard1 r:core_node1 x:testschemaapi_shard1_replica1] o.a.s.r.ManagedResourceStorage Configured ZooKeeperStorageIO with znodeBase: /configs/conf1
    [junit4] 2> 2928265 INFO (qtp626245133-46286) [n:127.0.0.1:65236_solr c:testschemaapi s:shard1 r:core_node1 x:testschemaapi_shard1_replica1] o.a.s.r.RestManager Initializing RestManager with initArgs: {}
    [junit4] 2> 2928265 INFO (qtp1325253055-46300) [n:127.0.0.1:65239_solr c:testschemaapi s:shard1 r:core_node2 x:testschemaapi_shard1_replica2] o.a.s.r.ManagedResourceStorage Configured ZooKeeperStorageIO with znodeBase: /configs/conf1
    [junit4] 2> 2928265 INFO (qtp1325253055-46300) [n:127.0.0.1:65239_solr c:testschemaapi s:shard1 r:core_node2 x:testschemaapi_shard1_replica2] o.a.s.r.RestManager Initializing RestManager with initArgs: {}
    [junit4] 2> 2928265 INFO (qtp1325253055-46300) [n:127.0.0.1:65239_solr c:testschemaapi s:shard1 r:core_node2 x:testschemaapi_shard1_replica2] o.a.s.r.ManagedResourceStorage Reading _rest_managed.json using ZooKeeperStorageIO:path=/configs/conf1
    [junit4] 2> 2928265 INFO (qtp626245133-46286) [n:127.0.0.1:65236_solr c:testschemaapi s:shard1 r:core_node1 x:testschemaapi_shard1_replica1] o.a.s.r.ManagedResourceStorage Reading _rest_managed.json using ZooKeeperStorageIO:path=/configs/conf1
    [junit4] 2> 2928266 INFO (qtp1325253055-46300) [n:127.0.0.1:65239_solr c:testschemaapi s:shard1 r:core_node2 x:testschemaapi_shard1_replica2] o.a.s.r.ManagedResourceStorage No data found for znode /configs/conf1/_rest_managed.json
    [junit4] 2> 2928266 INFO (qtp1325253055-46300) [n:127.0.0.1:65239_solr c:testschemaapi s:shard1 r:core_node2 x:testschemaapi_shard1_replica2] o.a.s.r.ManagedResourceStorage Loaded null at path _rest_managed.json using ZooKeeperStorageIO:path=/configs/conf1
    [junit4] 2> 2928266 INFO (qtp626245133-46286) [n:127.0.0.1:65236_solr c:testschemaapi s:shard1 r:core_node1 x:testschemaapi_shard1_replica1] o.a.s.r.ManagedResourceStorage No data found for znode /configs/conf1/_rest_managed.json
    [junit4] 2> 2928266 INFO (qtp626245133-46286) [n:127.0.0.1:65236_solr c:testschemaapi s:shard1 r:core_node1 x:testschemaapi_shard1_replica1] o.a.s.r.ManagedResourceStorage Loaded null at path _rest_managed.json using ZooKeeperStorageIO:path=/configs/conf1
    [junit4] 2> 2928266 INFO (qtp626245133-46286) [n:127.0.0.1:65236_solr c:testschemaapi s:shard1 r:core_node1 x:testschemaapi_shard1_replica1] o.a.s.r.RestManager Initializing 0 registered ManagedResources
    [junit4] 2> 2928266 INFO (qtp626245133-46286) [n:127.0.0.1:65236_solr c:testschemaapi s:shard1 r:core_node1 x:testschemaapi_shard1_replica1] o.a.s.s.ZkIndexSchemaReader Creating ZooKeeper watch for the managed schema at /configs/conf1/managed-schema
    [junit4] 2> 2928266 INFO (qtp626245133-46286) [n:127.0.0.1:65236_solr c:testschemaapi s:shard1 r:core_node1 x:testschemaapi_shard1_replica1] o.a.s.c.ZkController Added new OnReconnect listener ZkIndexSchemaReader: /configs/conf1/managed-schema, uniqueCoreId: testschemaapi_shard1_replica1:201515441953625
    [junit4] 2> 2928266 INFO (qtp1325253055-46300) [n:127.0.0.1:65239_solr c:testschemaapi s:shard1 r:core_node2 x:testschemaapi_shard1_replica2] o.a.s.r.RestManager Initializing 0 registered ManagedResources
    [junit4] 2> 2928267 INFO (qtp626245133-46286) [n:127.0.0.1:65236_solr c:testschemaapi s:shard1 r:core_node1 x:testschemaapi_shard1_replica1] o.a.s.h.ReplicationHandler Commits will be reserved for 10000
    [junit4] 2> 2928267 INFO (qtp626245133-46286) [n:127.0.0.1:65236_solr c:testschemaapi s:shard1 r:core_node1 x:testschemaapi_shard1_replica1] o.a.s.u.UpdateLog Looking up max value of version field to seed version buckets
    [junit4] 2> 2928267 INFO (qtp626245133-46286) [n:127.0.0.1:65236_solr c:testschemaapi s:shard1 r:core_node1 x:testschemaapi_shard1_replica1] o.a.s.u.VersionInfo Refreshing highest value of _version_ for 65536 version buckets from index
    [junit4] 2> 2928267 INFO (qtp626245133-46286) [n:127.0.0.1:65236_solr c:testschemaapi s:shard1 r:core_node1 x:testschemaapi_shard1_replica1] o.a.s.u.VersionInfo No terms found for _version_, cannot seed version bucket highest value from index
    [junit4] 2> 2928267 INFO (qtp626245133-46286) [n:127.0.0.1:65236_solr c:testschemaapi s:shard1 r:core_node1 x:testschemaapi_shard1_replica1] o.a.s.u.UpdateLog Could not find max version in index or recent updates, using new clock 1537180754807619584
    [junit4] 2> 2928267 INFO (qtp1325253055-46300) [n:127.0.0.1:65239_solr c:testschemaapi s:shard1 r:core_node2 x:testschemaapi_shard1_replica2] o.a.s.s.ZkIndexSchemaReader Creating ZooKeeper watch for the managed schema at /configs/conf1/managed-schema
    [junit4] 2> 2928268 INFO (searcherExecutor-12130-thread-1-processing-n:127.0.0.1:65236_solr x:testschemaapi_shard1_replica1 s:shard1 c:testschemaapi r:core_node1) [n:127.0.0.1:65236_solr c:testschemaapi s:shard1 r:core_node1 x:testschemaapi_shard1_replica1] o.a.s.c.SolrCore [testschemaapi_shard1_replica1] Registered new searcher Searcher@3b1c1ad7[testschemaapi_shard1_replica1] main{ExitableDirectoryReader(UninvertingDirectoryReader())}
    [junit4] 2> 2928269 INFO (qtp1325253055-46300) [n:127.0.0.1:65239_solr c:testschemaapi s:shard1 r:core_node2 x:testschemaapi_shard1_replica2] o.a.s.c.ZkController Added new OnReconnect listener ZkIndexSchemaReader: /configs/conf1/managed-schema, uniqueCoreId: testschemaapi_shard1_replica2:201515442100996
    [junit4] 2> 2928269 INFO (qtp626245133-46286) [n:127.0.0.1:65236_solr c:testschemaapi s:shard1 r:core_node1 x:testschemaapi_shard1_replica1] o.a.s.u.UpdateLog Took 1.0ms to seed version buckets with highest version 1537180754807619584
    [junit4] 2> 2928269 INFO (qtp626245133-46286) [n:127.0.0.1:65236_solr c:testschemaapi s:shard1 r:core_node1 x:testschemaapi_shard1_replica1] o.a.s.c.ZkController watch zkdir /configs/conf1
    [junit4] 2> 2928269 INFO (qtp1325253055-46300) [n:127.0.0.1:65239_solr c:testschemaapi s:shard1 r:core_node2 x:testschemaapi_shard1_replica2] o.a.s.h.ReplicationHandler Commits will be reserved for 10000
    [junit4] 2> 2928270 INFO (qtp1325253055-46300) [n:127.0.0.1:65239_solr c:testschemaapi s:shard1 r:core_node2 x:testschemaapi_shard1_replica2] o.a.s.u.UpdateLog Looking up max value of version field to seed version buckets
    [junit4] 2> 2928270 INFO (qtp1325253055-46300) [n:127.0.0.1:65239_solr c:testschemaapi s:shard1 r:core_node2 x:testschemaapi_shard1_replica2] o.a.s.u.VersionInfo Refreshing highest value of _version_ for 65536 version buckets from index
    [junit4] 2> 2928270 INFO (searcherExecutor-12131-thread-1-processing-n:127.0.0.1:65239_solr x:testschemaapi_shard1_replica2 s:shard1 c:testschemaapi r:core_node2) [n:127.0.0.1:65239_solr c:testschemaapi s:shard1 r:core_node2 x:testschemaapi_shard1_replica2] o.a.s.c.SolrCore [testschemaapi_shard1_replica2] Registered new searcher Searcher@74748b7f[testschemaapi_shard1_replica2] main{ExitableDirectoryReader(UninvertingDirectoryReader())}
    [junit4] 2> 2928270 INFO (qtp1325253055-46300) [n:127.0.0.1:65239_solr c:testschemaapi s:shard1 r:core_node2 x:testschemaapi_shard1_replica2] o.a.s.u.VersionInfo No terms found for _version_, cannot seed version bucket highest value from index
    [junit4] 2> 2928270 INFO (qtp1325253055-46300) [n:127.0.0.1:65239_solr c:testschemaapi s:shard1 r:core_node2 x:testschemaapi_shard1_replica2] o.a.s.u.UpdateLog Could not find max version in index or recent updates, using new clock 1537180754810765312
    [junit4] 2> 2928270 INFO (qtp626245133-46286) [n:127.0.0.1:65236_solr c:testschemaapi s:shard1 r:core_node1 x:testschemaapi_shard1_replica1] o.a.s.c.CoreContainer registering core: testschemaapi_shard1_replica1
    [junit4] 2> 2928270 INFO (qtp626245133-46286) [n:127.0.0.1:65236_solr c:testschemaapi s:shard1 r:core_node1 x:testschemaapi_shard1_replica1] o.a.s.c.ZkController Register replica - core:testschemaapi_shard1_replica1 address:http://127.0.0.1:65236/solr collection:testschemaapi shard:shard1
    [junit4] 2> 2928271 INFO (qtp626245133-46286) [n:127.0.0.1:65236_solr c:testschemaapi s:shard1 r:core_node1 x:testschemaapi_shard1_replica1] o.a.s.c.c.SolrZkClient makePath: /collections/testschemaapi/leader_elect/shard1/election
    [junit4] 2> 2928271 INFO (qtp1325253055-46300) [n:127.0.0.1:65239_solr c:testschemaapi s:shard1 r:core_node2 x:testschemaapi_shard1_replica2] o.a.s.u.UpdateLog Took 1.0ms to seed version buckets with highest version 1537180754810765312
    [junit4] 2> 2928271 INFO (qtp1325253055-46300) [n:127.0.0.1:65239_solr c:testschemaapi s:shard1 r:core_node2 x:testschemaapi_shard1_replica2] o.a.s.c.ZkController watch zkdir /configs/conf1
    [junit4] 2> 2928273 INFO (qtp1325253055-46300) [n:127.0.0.1:65239_solr c:testschemaapi s:shard1 r:core_node2 x:testschemaapi_shard1_replica2] o.a.s.c.CoreContainer registering core: testschemaapi_shard1_replica2
    [junit4] 2> 2928273 INFO (qtp1325253055-46300) [n:127.0.0.1:65239_solr c:testschemaapi s:shard1 r:core_node2 x:testschemaapi_shard1_replica2] o.a.s.c.ZkController Register replica - core:testschemaapi_shard1_replica2 address:http://127.0.0.1:65239/solr collection:testschemaapi shard:shard1
    [junit4] 2> 2928275 INFO (qtp1325253055-46300) [n:127.0.0.1:65239_solr c:testschemaapi s:shard1 r:core_node2 x:testschemaapi_shard1_replica2] o.a.s.c.c.SolrZkClient makePath: /collections/testschemaapi/leader_elect/shard1/election
    [junit4] 2> 2928276 INFO (qtp626245133-46286) [n:127.0.0.1:65236_solr c:testschemaapi s:shard1 r:core_node1 x:testschemaapi_shard1_replica1] o.a.s.c.LeaderElector Joined leadership election with path: /collections/testschemaapi/leader_elect/shard1/election/96073797010718725-core_node1-n_0000000000
    [junit4] 2> 2928277 INFO (qtp626245133-46286) [n:127.0.0.1:65236_solr c:testschemaapi s:shard1 r:core_node1 x:testschemaapi_shard1_replica1] o.a.s.c.ShardLeaderElectionContext Running the leader process for shard=shard1 and weAreReplacement=false and leaderVoteWait=10000
    [junit4] 2> 2928279 INFO (qtp1325253055-46300) [n:127.0.0.1:65239_solr c:testschemaapi s:shard1 r:core_node2 x:testschemaapi_shard1_replica2] o.a.s.c.LeaderElector Joined leadership election with path: /collections/testschemaapi/leader_elect/shard1/election/96073797010718726-core_node2-n_0000000001
    [junit4] 2> 2928280 INFO (qtp626245133-46286) [n:127.0.0.1:65236_solr c:testschemaapi s:shard1 r:core_node1 x:testschemaapi_shard1_replica1] o.a.s.c.ShardLeaderElectionContext Waiting until we see more replicas up for shard shard1: total=2 found=1 timeoutin=9998ms
    [junit4] 2> 2928280 INFO (OverseerStateUpdate-96073797010718725-127.0.0.1:65236_solr-n_0000000000) [n:127.0.0.1:65236_solr ] o.a.s.c.Overseer processMessage: queueSize: 1, message = {
    [junit4] 2> "operation":"leader",
    [junit4] 2> "shard":"shard1",
    [junit4] 2> "collection":"testschemaapi"} current state version: 0
    [junit4] 2> 2928280 INFO (qtp1325253055-46300) [n:127.0.0.1:65239_solr c:testschemaapi s:shard1 r:core_node2 x:testschemaapi_shard1_replica2] o.a.s.c.LeaderElector Watching path /collections/testschemaapi/leader_elect/shard1/election/96073797010718725-core_node1-n_0000000000 to know if I could be the leader
    [junit4] 2> 2928385 INFO (OverseerStateUpdate-96073797010718725-127.0.0.1:65236_solr-n_0000000000) [n:127.0.0.1:65236_solr ] o.a.s.c.o.ZkStateWriter going to update_collection /collections/testschemaapi/state.json version: 1
    [junit4] 2> 2928386 INFO (zkCallback-10174-thread-3-processing-n:127.0.0.1:65236_solr) [n:127.0.0.1:65236_solr ] o.a.s.c.c.ZkStateReader A cluster state change: [WatchedEvent state:SyncConnected type:NodeDataChanged path:/collections/testschemaapi/state.json] for collection [testschemaapi] has occurred - updating... (live nodes size: [2])
    [junit4] 2> 2928386 INFO (zkCallback-10175-thread-1-processing-n:127.0.0.1:65239_solr) [n:127.0.0.1:65239_solr ] o.a.s.c.c.ZkStateReader A cluster state change: [WatchedEvent state:SyncConnected type:NodeDataChanged path:/collections/testschemaapi/state.json] for collection [testschemaapi] has occurred - updating... (live nodes size: [2])
    [junit4] 2> 2928387 INFO (zkCallback-10174-thread-3-processing-n:127.0.0.1:65236_solr) [n:127.0.0.1:65236_solr ] o.a.s.c.c.ZkStateReader Updating data for [testschemaapi] from [1] to [2]
    [junit4] 2> 2928387 INFO (zkCallback-10175-thread-1-processing-n:127.0.0.1:65239_solr) [n:127.0.0.1:65239_solr ] o.a.s.c.c.ZkStateReader Updating data for [testschemaapi] from [1] to [2]
    [junit4] 2> 2928781 INFO (qtp626245133-46286) [n:127.0.0.1:65236_solr c:testschemaapi s:shard1 r:core_node1 x:testschemaapi_shard1_replica1] o.a.s.c.ShardLeaderElectionContext Enough replicas found to continue.
    [junit4] 2> 2928782 INFO (qtp626245133-46286) [n:127.0.0.1:65236_solr c:testschemaapi s:shard1 r:core_node1 x:testschemaapi_shard1_replica1] o.a.s.c.ShardLeaderElectionContext I may be the new leader - try and sync
    [junit4] 2> 2928782 INFO (qtp626245133-46286) [n:127.0.0.1:65236_solr c:testschemaapi s:shard1 r:core_node1 x:testschemaapi_shard1_replica1] o.a.s.c.SyncStrategy Sync replicas to http://127.0.0.1:65236/solr/testschemaapi_shard1_replica1/
    [junit4] 2> 2928782 INFO (qtp626245133-46286) [n:127.0.0.1:65236_solr c:testschemaapi s:shard1 r:core_node1 x:testschemaapi_shard1_replica1] o.a.s.u.PeerSync PeerSync: core=testschemaapi_shard1_replica1 url=http://127.0.0.1:65236/solr START replicas=[http://127.0.0.1:65239/solr/testschemaapi_shard1_replica2/] nUpdates=100
    [junit4] 2> 2928782 INFO (qtp626245133-46286) [n:127.0.0.1:65236_solr c:testschemaapi s:shard1 r:core_node1 x:testschemaapi_shard1_replica1] o.a.s.u.PeerSync PeerSync: core=testschemaapi_shard1_replica1 url=http://127.0.0.1:65236/solr DONE. We have no versions. sync failed.
    [junit4] 2> 2928782 INFO (qtp626245133-46286) [n:127.0.0.1:65236_solr c:testschemaapi s:shard1 r:core_node1 x:testschemaapi_shard1_replica1] o.a.s.c.SyncStrategy Leader's attempt to sync with shard failed, moving to the next candidate
    [junit4] 2> 2928782 INFO (qtp626245133-46286) [n:127.0.0.1:65236_solr c:testschemaapi s:shard1 r:core_node1 x:testschemaapi_shard1_replica1] o.a.s.c.ShardLeaderElectionContext We failed sync, but we have no versions - we can't sync in that case - we were active before, so become leader anyway
    [junit4] 2> 2928786 INFO (qtp626245133-46286) [n:127.0.0.1:65236_solr c:testschemaapi s:shard1 r:core_node1 x:testschemaapi_shard1_replica1] o.a.s.c.c.SolrZkClient makePath: /collections/testschemaapi/leaders/shard1
    [junit4] 2> 2928788 INFO (qtp1325253055-46302) [n:127.0.0.1:65239_solr c:testschemaapi s:shard1 r:core_node2 x:testschemaapi_shard1_replica2] o.a.s.c.S.Request [testschemaapi_shard1_replica2] webapp=/solr path=/get params={distrib=false&qt=/get&fingerprint=false&getVersions=100&wt=javabin&version=2} status=0 QTime=1
    [junit4] 2> 2928792 INFO (qtp626245133-46286) [n:127.0.0.1:65236_solr c:testschemaapi s:shard1 r:core_node1 x:testschemaapi_shard1_replica1] o.a.s.c.ShardLeaderElectionContextBase Creating leader registration node /collections/testschemaapi/leaders/shard1/leader after winning as /collections/testschemaapi/leader_elect/shard1/election/96073797010718725-core_node1-n_0000000000
    [junit4] 2> 2928794 INFO (qtp626245133-46286) [n:127.0.0.1:65236_solr c:testschemaapi s:shard1 r:core_node1 x:testschemaapi_shard1_replica1] o.a.s.c.ShardLeaderElectionContext I am the new leader: http://127.0.0.1:65236/solr/testschemaapi_shard1_replica1/ shard1
    [junit4] 2> 2928795 INFO (OverseerStateUpdate-96073797010718725-127.0.0.1:65236_solr-n_0000000000) [n:127.0.0.1:65236_solr ] o.a.s.c.Overseer processMessage: queueSize: 1, message = {
    [junit4] 2> "operation":"leader",
    [junit4] 2> "shard":"shard1",
    [junit4] 2> "collection":"testschemaapi",
    [junit4] 2> "base_url":"http://127.0.0.1:65236/solr",
    [junit4] 2> "core":"testschemaapi_shard1_replica1",
    [junit4] 2> "state":"active"} current state version: 0
    [junit4] 2> 2928900 INFO (OverseerStateUpdate-96073797010718725-127.0.0.1:65236_solr-n_0000000000) [n:127.0.0.1:65236_solr ] o.a.s.c.o.ZkStateWriter going to update_collection /collections/testschemaapi/state.json version: 2
    [junit4] 2> 2928902 INFO (zkCallback-10174-thread-4-processing-n:127.0.0.1:65236_solr) [n:127.0.0.1:65236_solr ] o.a.s.c.c.ZkStateReader A cluster state change: [WatchedEvent state:SyncConnected type:NodeDataChanged path:/collections/testschemaapi/state.json] for collection [testschemaapi] has occurred - updating... (live nodes size: [2])
    [junit4] 2> 2928902 INFO (zkCallback-10175-thread-1-processing-n:127.0.0.1:65239_solr) [n:127.0.0.1:65239_solr ] o.a.s.c.c.ZkStateReader A cluster state change: [WatchedEvent state:SyncConnected type:NodeDataChanged path:/collections/testschemaapi/state.json] for collection [testschemaapi] has occurred - updating... (live nodes size: [2])
    [junit4] 2> 2928904 INFO (zkCallback-10174-thread-4-processing-n:127.0.0.1:65236_solr) [n:127.0.0.1:65236_solr ] o.a.s.c.c.ZkStateReader Updating data for [testschemaapi] from [2] to [3]
    [junit4] 2> 2928904 INFO (zkCallback-10175-thread-1-processing-n:127.0.0.1:65239_solr) [n:127.0.0.1:65239_solr ] o.a.s.c.c.ZkStateReader Updating data for [testschemaapi] from [2] to [3]
    [junit4] 2> 2928946 INFO (qtp626245133-46286) [n:127.0.0.1:65236_solr c:testschemaapi s:shard1 r:core_node1 x:testschemaapi_shard1_replica1] o.a.s.c.ZkController We are http://127.0.0.1:65236/solr/testschemaapi_shard1_replica1/ and leader is http://127.0.0.1:65236/solr/testschemaapi_shard1_replica1/
    [junit4] 2> 2928946 INFO (qtp626245133-46286) [n:127.0.0.1:65236_solr c:testschemaapi s:shard1 r:core_node1 x:testschemaapi_shard1_replica1] o.a.s.c.ZkController No LogReplay needed for core=testschemaapi_shard1_replica1 baseURL=http://127.0.0.1:65236/solr
    [junit4] 2> 2928946 INFO (qtp626245133-46286) [n:127.0.0.1:65236_solr c:testschemaapi s:shard1 r:core_node1 x:testschemaapi_shard1_replica1] o.a.s.c.ZkController I am the leader, no recovery necessary
    [junit4] 2> 2928946 INFO (qtp626245133-46286) [n:127.0.0.1:65236_solr c:testschemaapi s:shard1 r:core_node1 x:testschemaapi_shard1_replica1] o.a.s.c.ZkController publishing state=active
    [junit4] 2> 2928949 INFO (OverseerStateUpdate-96073797010718725-127.0.0.1:65236_solr-n_0000000000) [n:127.0.0.1:65236_solr ] o.a.s.c.Overseer processMessage: queueSize: 1, message = {
    [junit4] 2> "core":"testschemaapi_shard1_replica1",
    [junit4] 2> "core_node_name":"core_node1",
    [junit4] 2> "roles":

[...truncated too long message...]

    2> at org.apache.solr.core.SolrCore.initRestManager(SolrCore.java:2304)
    [junit4] 2> at org.apache.solr.core.SolrCore.<init>(SolrCore.java:748)
    [junit4] 2> ... 4 more
    [junit4] 2> Jun 15, 2016 5:50:15 AM com.carrotsearch.randomizedtesting.ThreadLeakControl checkThreadLeaks
    [junit4] 2> WARNING: Will linger awaiting termination of 4 leaked thread(s).
    [junit4] 2> NOTE: test params are: codec=Asserting(Lucene62): {_version_=PostingsFormat(name=Memory doPackFST= false), id=TestBloomFilteredLucenePostings(BloomFilteringPostingsFormat(Lucene50(blocksize=128))), myNewField1=TestBloomFilteredLucenePostings(BloomFilteringPostingsFormat(Lucene50(blocksize=128))), myNewField=PostingsFormat(name=Memory doPackFST= false)}, docValues:{}, maxPointsInLeafNode=1481, maxMBSortInHeap=6.050326901220467, sim=ClassicSimilarity, locale=en-PH, timezone=Africa/Bissau
    [junit4] 2> NOTE: Windows 10 10.0 amd64/Oracle Corporation 1.8.0_92 (64-bit)/cpus=3,threads=1,free=212192264,total=536870912
    [junit4] 2> NOTE: All tests run in this JVM: [UUIDUpdateProcessorFallbackTest, RankQueryTest, HdfsUnloadDistributedZkTest, TestRemoteStreaming, TestPostingsSolrHighlighter, TestDocBasedVersionConstraints, QueryEqualityTest, HdfsDirectoryFactoryTest, HdfsBasicDistributedZk2Test, RequestLoggingTest, CustomCollectionTest, TestQuerySenderNoQuery, TestSchemaVersionResource, TestSQLHandler, TestFilteredDocIdSet, TestConfigOverlay, SimpleFacetsTest, TestStressVersions, TestArbitraryIndexDir, CursorMarkTest, TestNamedUpdateProcessors, TestShortCircuitedRequests, TestLMDirichletSimilarityFactory, SliceStateTest, DOMUtilTest, TestRestManager, CloudExitableDirectoryReaderTest, MBeansHandlerTest, TestNumericTerms64, TestFieldCacheReopen, HdfsRestartWhileUpdatingTest, CircularListTest, TestMiniSolrCloudClusterBase, TestSearcherReuse, BlockJoinFacetDistribTest, TestCSVLoader, ClassificationUpdateProcessorFactoryTest, BitVectorTest, TestCryptoKeys, WrapperMergePolicyFactoryTest, TestDocSet, FullHLLTest, InfoHandlerTest, TestReqParamsAPI, TestManagedSynonymFilterFactory, PolyFieldTest, RegexBoostProcessorTest, TestMergePolicyConfig, RecoveryAfterSoftCommitTest, HdfsDirectoryTest, SuggesterFSTTest, TestLRUCache, DocumentAnalysisRequestHandlerTest, TestLFUCache, TestDistribIDF, TestJsonRequest, SyncSliceTest, CdcrReplicationDistributedZkTest, TimeZoneUtilsTest, TestWordDelimiterFilterFactory, AsyncMigrateRouteKeyTest, ActionThrottleTest, TestGeoJSONResponseWriter, TestStressReorder, TestHighlightDedupGrouping, TestInfoStreamLogging, TestCollapseQParserPlugin, TestFieldTypeResource, TestDistributedSearch, TestIBSimilarityFactory, TestTolerantUpdateProcessorRandomCloud, DistribCursorPagingTest, TestSort, UpdateParamsTest, ClusterStateUpdateTest, OverseerCollectionConfigSetProcessorTest, TestExactStatsCache, TestNoOpRegenerator, ResponseHeaderTest, HighlighterTest, HdfsChaosMonkeyNothingIsSafeTest, TestCoreContainer, CollectionsAPIAsyncDistributedZkTest, PingRequestHandlerTest, TriLevelCompositeIdRoutingTest, TestSolrConfigHandlerConcurrent, DocValuesTest, BadComponentTest, LeaderElectionTest, DistributedFacetPivotSmallTest, TestSolrQueryResponse, OverseerStatusTest, DistributedQueryElevationComponentTest, JsonLoaderTest, DocExpirationUpdateProcessorFactoryTest, SegmentsInfoRequestHandlerTest, RulesTest, UnloadDistributedZkTest, DirectUpdateHandlerTest, JSONWriterTest, TestDFRSimilarityFactory, TermsComponentTest, TestLuceneMatchVersion, SimpleMLTQParserTest, TestCloudInspectUtil, SoftAutoCommitTest, TestCollationFieldDocValues, AnalysisAfterCoreReloadTest, TestPseudoReturnFields, TestHashPartitioner, TestHighFrequencyDictionaryFactory, ConcurrentDeleteAndCreateCollectionTest, URLClassifyProcessorTest, DistributedQueryComponentCustomSortTest, PrimUtilsTest, TestAnalyzeInfixSuggestions, TestBulkSchemaConcurrent, XsltUpdateRequestHandlerTest, DocumentBuilderTest, TestDFISimilarityFactory, TestSolrQueryParserDefaultOperatorResource, TestSearchPerf, OutOfBoxZkACLAndCredentialsProvidersTest, RequiredFieldsTest, LeaderInitiatedRecoveryOnCommitTest, TestExtendedDismaxParser, ShardRoutingTest, BlockDirectoryTest, SchemaVersionSpecificBehaviorTest, DisMaxRequestHandlerTest, TestRawResponseWriter, SpatialFilterTest, PrimitiveFieldTypeTest, TestAddFieldRealTimeGet, SolrTestCaseJ4Test, EnumFieldTest, StatelessScriptUpdateProcessorFactoryTest, DistributedExpandComponentTest, TestSolrDeletionPolicy1, ZkStateReaderTest, TestXIncludeConfig, ScriptEngineTest, TestRecoveryHdfs, DistributedFacetPivotLongTailTest, TestRuleBasedAuthorizationPlugin, TestCustomSort, TestReplicationHandler, SharedFSAutoReplicaFailoverTest, ZkCLITest, OpenCloseCoreStressTest, RecoveryZkTest, ZkSolrClientTest, ShardRoutingCustomTest, TermVectorComponentDistributedTest, TestReload, DistributedTermsComponentTest, SolrCoreTest, QueryElevationComponentTest, BadIndexSchemaTest, ConvertedLegacyTest, BasicFunctionalityTest, ShowFileRequestHandlerTest, CurrencyFieldXmlFileTest, SolrIndexSplitterTest, SimplePostToolTest, SpellCheckCollatorTest, SolrRequestParserTest, TestFoldingMultitermQuery, SuggesterTest, NoCacheHeaderTest, FieldMutatingUpdateProcessorTest, DefaultValueUpdateProcessorTest, SortByFunctionTest, DebugComponentTest, TestSurroundQueryParser, StandardRequestHandlerTest, DirectSolrSpellCheckerTest, XmlUpdateRequestHandlerTest, TestValueSourceCache, TestIndexingPerformance, FastVectorHighlighterTest, LoggingHandlerTest, ReturnFieldsTest, BinaryUpdateRequestHandlerTest, TestPartialUpdateDeduplication, TestComponentsName, TestBinaryResponseWriter, TestQuerySenderListener, TestSolrIndexConfig, SolrIndexConfigTest, NumericFieldsTest, TestElisionMultitermQuery, OutputWriterTest, DirectSolrConnectionTest, SpellPossibilityIteratorTest, TestCharFilters, SynonymTokenizerTest, EchoParamsTest, TestSweetSpotSimilarityFactory, TestJmxMonitoredMap, DateMathParserTest, PreAnalyzedFieldTest, TestSystemIdResolver, DateFieldTest, RAMDirectoryFactoryTest, ClusterStateTest, TestDocumentBuilder, SystemInfoHandlerTest, UUIDFieldTest, TestRTGBase, CursorPagingTest, DistributedIntervalFacetingTest, TestCursorMarkWithoutUniqueKey, TestSimpleTrackingShardHandler, TestTolerantSearch, TestEmbeddedSolrServerConstructors, TestJettySolrRunner, AliasIntegrationTest, CollectionReloadTest, CollectionsAPISolrJTest, DeleteLastCustomShardedReplicaTest, DeleteShardTest, DeleteStatusTest, DistributedQueueTest, DistributedVersionInfoTest, HttpPartitionTest, LeaderInitiatedRecoveryOnShardRestartTest, MigrateRouteKeyTest, OverseerTaskQueueTest, RemoteQueryErrorTest, SSLMigrationTest, SaslZkACLProviderTest, TestAuthenticationFramework, TestLeaderElectionZkExpiry, TestLockTree, TestMiniSolrCloudCluster, TestReplicaProperties, TestSSLRandomization, TestSizeLimitedDistributedMap, TestStressLiveNodes, TlogReplayBufferedWhileIndexingTest, VMParamsZkACLAndCredentialsProvidersTest, HdfsBasicDistributedZkTest, HdfsChaosMonkeySafeLeaderTest, HdfsCollectionsAPIDistributedZkTest, HdfsRecoverLeaseTest, HdfsThreadLeakTest, StressHdfsTest, CachingDirectoryFactoryTest, TestNRTOpen, TestReloadAndDeleteDocs, TestShardHandlerFactory, TestSolrConfigHandler, TestSolrDynamicMBean, TestSolrXml, TestConfigReload, TestReplicationHandlerBackup, CoreAdminCreateDiscoverTest, CoreAdminRequestStatusTest, DistributedDebugComponentTest, DistributedFacetPivotLargeTest, DistributedFacetPivotWhiteBoxTest, DistributedQueryComponentOptimizationTest, DistributedSuggestComponentTest, SpatialHeatmapFacetsTest, TestExpandComponent, TestTrackingShardHandlerFactory, HighlighterMaxOffsetTest, TestIntervalFaceting, TestMacros, TestCustomDocTransformer, TestGraphMLResponseWriter, TestRawTransformer, TestChildDocTransformer, TestSubQueryTransformerCrossCore, TestManagedResource, TestBulkSchemaAPI, TestSchemaResource, TestUniqueKeyFieldResource, SpatialRPTFieldTypeTest, TestManagedSchema, TestManagedSchemaAPI]
    [junit4] 2> NOTE: reproduce with: ant test -Dtestcase=TestManagedSchemaAPI -Dtests.seed=85DB1BA594E5B03A -Dtests.slow=true -Dtests.locale=en-PH -Dtests.timezone=Africa/Bissau -Dtests.asserts=true -Dtests.file.encoding=US-ASCII
    [junit4] ERROR 0.00s J0 | TestManagedSchemaAPI (suite) <<<
    [junit4] > Throwable #1: java.lang.AssertionError: ObjectTracker found 2 object(s) that were not released!!! [MockDirectoryWrapper, MockDirectoryWrapper]
    [junit4] > at __randomizedtesting.SeedInfo.seed([85DB1BA594E5B03A]:0)
    [junit4] > at org.apache.solr.SolrTestCaseJ4.teardownTestCases(SolrTestCaseJ4.java:257)
    [junit4] > at java.lang.Thread.run(Thread.java:745)
    [junit4] Completed [552/615 (1!)] on J0 in 13.21s, 1 test, 1 failure <<< FAILURES!

[...truncated 237 lines...]
BUILD FAILED
C:\Users\jenkins\workspace\Lucene-Solr-6.x-Windows\build.xml:740: The following error occurred while executing this line:
C:\Users\jenkins\workspace\Lucene-Solr-6.x-Windows\build.xml:684: The following error occurred while executing this line:
C:\Users\jenkins\workspace\Lucene-Solr-6.x-Windows\build.xml:59: The following error occurred while executing this line:
C:\Users\jenkins\workspace\Lucene-Solr-6.x-Windows\solr\build.xml:233: The following error occurred while executing this line:
C:\Users\jenkins\workspace\Lucene-Solr-6.x-Windows\solr\common-build.xml:531: The following error occurred while executing this line:
C:\Users\jenkins\workspace\Lucene-Solr-6.x-Windows\lucene\common-build.xml:1427: The following error occurred while executing this line:
C:\Users\jenkins\workspace\Lucene-Solr-6.x-Windows\lucene\common-build.xml:984: There were test failures: 615 suites (10 ignored), 2591 tests, 1 suite-level error, 127 ignored (83 assumptions) [seed: 85DB1BA594E5B03A]

Total time: 73 minutes 36 seconds
Build step 'Invoke Ant' marked build as failure
Archiving artifacts
[WARNINGS] Skipping publisher since build result is FAILURE
Recording test results
Email was triggered for: Failure - Any
Sending email for trigger: Failure - Any

Search Discussions

Discussion Posts

Follow ups

Related Discussions

Discussion Navigation
viewthread | post
posts ‹ prev | 1 of 7 | next ›
Discussion Overview
groupdev @
categorieslucene
postedJun 15, '16 at 5:53a
activeJun 17, '16 at 1:34a
posts7
users3
websitelucene.apache.org

People

Translate

site design / logo © 2017 Grokbase