Grokbase Groups Lucene dev June 2016
FAQ
Build: http://jenkins.thetaphi.de/job/Lucene-Solr-6.x-Windows/250/
Java: 32bit/jdk1.8.0_92 -server -XX:+UseParallelGC

2 tests failed.
FAILED: org.apache.solr.handler.TestReqParamsAPI.test

Error Message:
Could not get expected value 'CY val' for path 'params/c' full output: { "responseHeader":{ "status":0, "QTime":0}, "params":{ "a":"A val", "b":"B val", "wt":"json", "useParams":""}, "context":{ "webapp":"", "path":"/dump1", "httpMethod":"GET"}}, from server: https://127.0.0.1:56150/collection1

Stack Trace:
java.lang.AssertionError: Could not get expected value 'CY val' for path 'params/c' full output: {
   "responseHeader":{
     "status":0,
     "QTime":0},
   "params":{
     "a":"A val",
     "b":"B val",
     "wt":"json",
     "useParams":""},
   "context":{
     "webapp":"",
     "path":"/dump1",
     "httpMethod":"GET"}}, from server: https://127.0.0.1:56150/collection1
  at __randomizedtesting.SeedInfo.seed([55EAF178FFA0D4C:8D0A90CD210660B4]:0)
  at org.junit.Assert.fail(Assert.java:93)
  at org.junit.Assert.assertTrue(Assert.java:43)
  at org.apache.solr.core.TestSolrConfigHandler.testForResponseElement(TestSolrConfigHandler.java:481)
  at org.apache.solr.handler.TestReqParamsAPI.testReqParams(TestReqParamsAPI.java:171)
  at org.apache.solr.handler.TestReqParamsAPI.test(TestReqParamsAPI.java:61)
  at sun.reflect.NativeMethodAccessorImpl.invoke0(Native Method)
  at sun.reflect.NativeMethodAccessorImpl.invoke(NativeMethodAccessorImpl.java:62)
  at sun.reflect.DelegatingMethodAccessorImpl.invoke(DelegatingMethodAccessorImpl.java:43)
  at java.lang.reflect.Method.invoke(Method.java:498)
  at com.carrotsearch.randomizedtesting.RandomizedRunner.invoke(RandomizedRunner.java:1764)
  at com.carrotsearch.randomizedtesting.RandomizedRunner$8.evaluate(RandomizedRunner.java:871)
  at com.carrotsearch.randomizedtesting.RandomizedRunner$9.evaluate(RandomizedRunner.java:907)
  at com.carrotsearch.randomizedtesting.RandomizedRunner$10.evaluate(RandomizedRunner.java:921)
  at org.apache.solr.BaseDistributedSearchTestCase$ShardsRepeatRule$ShardsFixedStatement.callStatement(BaseDistributedSearchTestCase.java:992)
  at org.apache.solr.BaseDistributedSearchTestCase$ShardsRepeatRule$ShardsStatement.evaluate(BaseDistributedSearchTestCase.java:967)
  at com.carrotsearch.randomizedtesting.rules.SystemPropertiesRestoreRule$1.evaluate(SystemPropertiesRestoreRule.java:57)
  at org.apache.lucene.util.TestRuleSetupTeardownChained$1.evaluate(TestRuleSetupTeardownChained.java:49)
  at org.apache.lucene.util.AbstractBeforeAfterRule$1.evaluate(AbstractBeforeAfterRule.java:45)
  at org.apache.lucene.util.TestRuleThreadAndTestName$1.evaluate(TestRuleThreadAndTestName.java:48)
  at org.apache.lucene.util.TestRuleIgnoreAfterMaxFailures$1.evaluate(TestRuleIgnoreAfterMaxFailures.java:64)
  at org.apache.lucene.util.TestRuleMarkFailure$1.evaluate(TestRuleMarkFailure.java:47)
  at com.carrotsearch.randomizedtesting.rules.StatementAdapter.evaluate(StatementAdapter.java:36)
  at com.carrotsearch.randomizedtesting.ThreadLeakControl$StatementRunner.run(ThreadLeakControl.java:367)
  at com.carrotsearch.randomizedtesting.ThreadLeakControl.forkTimeoutingTask(ThreadLeakControl.java:809)
  at com.carrotsearch.randomizedtesting.ThreadLeakControl$3.evaluate(ThreadLeakControl.java:460)
  at com.carrotsearch.randomizedtesting.RandomizedRunner.runSingleTest(RandomizedRunner.java:880)
  at com.carrotsearch.randomizedtesting.RandomizedRunner$5.evaluate(RandomizedRunner.java:781)
  at com.carrotsearch.randomizedtesting.RandomizedRunner$6.evaluate(RandomizedRunner.java:816)
  at com.carrotsearch.randomizedtesting.RandomizedRunner$7.evaluate(RandomizedRunner.java:827)
  at com.carrotsearch.randomizedtesting.rules.StatementAdapter.evaluate(StatementAdapter.java:36)
  at com.carrotsearch.randomizedtesting.rules.SystemPropertiesRestoreRule$1.evaluate(SystemPropertiesRestoreRule.java:57)
  at org.apache.lucene.util.AbstractBeforeAfterRule$1.evaluate(AbstractBeforeAfterRule.java:45)
  at com.carrotsearch.randomizedtesting.rules.StatementAdapter.evaluate(StatementAdapter.java:36)
  at org.apache.lucene.util.TestRuleStoreClassName$1.evaluate(TestRuleStoreClassName.java:41)
  at com.carrotsearch.randomizedtesting.rules.NoShadowingOrOverridesOnMethodsRule$1.evaluate(NoShadowingOrOverridesOnMethodsRule.java:40)
  at com.carrotsearch.randomizedtesting.rules.NoShadowingOrOverridesOnMethodsRule$1.evaluate(NoShadowingOrOverridesOnMethodsRule.java:40)
  at com.carrotsearch.randomizedtesting.rules.StatementAdapter.evaluate(StatementAdapter.java:36)
  at com.carrotsearch.randomizedtesting.rules.StatementAdapter.evaluate(StatementAdapter.java:36)
  at com.carrotsearch.randomizedtesting.rules.StatementAdapter.evaluate(StatementAdapter.java:36)
  at org.apache.lucene.util.TestRuleAssertionsRequired$1.evaluate(TestRuleAssertionsRequired.java:53)
  at org.apache.lucene.util.TestRuleMarkFailure$1.evaluate(TestRuleMarkFailure.java:47)
  at org.apache.lucene.util.TestRuleIgnoreAfterMaxFailures$1.evaluate(TestRuleIgnoreAfterMaxFailures.java:64)
  at org.apache.lucene.util.TestRuleIgnoreTestSuites$1.evaluate(TestRuleIgnoreTestSuites.java:54)
  at com.carrotsearch.randomizedtesting.rules.StatementAdapter.evaluate(StatementAdapter.java:36)
  at com.carrotsearch.randomizedtesting.ThreadLeakControl$StatementRunner.run(ThreadLeakControl.java:367)
  at java.lang.Thread.run(Thread.java:745)


FAILED: junit.framework.TestSuite.org.apache.solr.handler.TestSolrConfigHandlerCloud

Error Message:
3 threads leaked from SUITE scope at org.apache.solr.handler.TestSolrConfigHandlerCloud: 1) Thread[id=42013, name=Thread-7270, state=TIMED_WAITING, group=TGRP-TestSolrConfigHandlerCloud] at java.lang.Thread.sleep(Native Method) at org.apache.solr.cloud.ZkSolrResourceLoader.openResource(ZkSolrResourceLoader.java:101) at org.apache.solr.core.SolrResourceLoader.openSchema(SolrResourceLoader.java:333) at org.apache.solr.schema.IndexSchemaFactory.create(IndexSchemaFactory.java:48) at org.apache.solr.schema.IndexSchemaFactory.buildIndexSchema(IndexSchemaFactory.java:75) at org.apache.solr.core.ConfigSetService.createIndexSchema(ConfigSetService.java:107) at org.apache.solr.core.ConfigSetService.getConfig(ConfigSetService.java:78) at org.apache.solr.core.CoreContainer.reload(CoreContainer.java:911) at org.apache.solr.core.SolrCore.lambda$getConfListener$6(SolrCore.java:2509) at org.apache.solr.core.SolrCore$$Lambda$53/18224461.run(Unknown Source) at org.apache.solr.cloud.ZkController$4.run(ZkController.java:2405) 2) Thread[id=41980, name=Thread-7259, state=TIMED_WAITING, group=TGRP-TestSolrConfigHandlerCloud] at java.lang.Thread.sleep(Native Method) at org.apache.solr.cloud.ZkSolrResourceLoader.openResource(ZkSolrResourceLoader.java:101) at org.apache.solr.core.SolrResourceLoader.openSchema(SolrResourceLoader.java:333) at org.apache.solr.schema.IndexSchemaFactory.create(IndexSchemaFactory.java:48) at org.apache.solr.schema.IndexSchemaFactory.buildIndexSchema(IndexSchemaFactory.java:75) at org.apache.solr.core.ConfigSetService.createIndexSchema(ConfigSetService.java:107) at org.apache.solr.core.ConfigSetService.getConfig(ConfigSetService.java:78) at org.apache.solr.core.CoreContainer.reload(CoreContainer.java:911) at org.apache.solr.core.SolrCore.lambda$getConfListener$6(SolrCore.java:2509) at org.apache.solr.core.SolrCore$$Lambda$53/18224461.run(Unknown Source) at org.apache.solr.cloud.ZkController$4.run(ZkController.java:2405) 3) Thread[id=41947, name=Thread-7250, state=TIMED_WAITING, group=TGRP-TestSolrConfigHandlerCloud] at java.lang.Thread.sleep(Native Method) at org.apache.solr.cloud.ZkSolrResourceLoader.openResource(ZkSolrResourceLoader.java:101) at org.apache.solr.core.SolrResourceLoader.openSchema(SolrResourceLoader.java:333) at org.apache.solr.schema.IndexSchemaFactory.create(IndexSchemaFactory.java:48) at org.apache.solr.schema.IndexSchemaFactory.buildIndexSchema(IndexSchemaFactory.java:75) at org.apache.solr.core.ConfigSetService.createIndexSchema(ConfigSetService.java:107) at org.apache.solr.core.ConfigSetService.getConfig(ConfigSetService.java:78) at org.apache.solr.core.CoreContainer.reload(CoreContainer.java:911) at org.apache.solr.core.SolrCore.lambda$getConfListener$6(SolrCore.java:2509) at org.apache.solr.core.SolrCore$$Lambda$53/18224461.run(Unknown Source) at org.apache.solr.cloud.ZkController$4.run(ZkController.java:2405)

Stack Trace:
com.carrotsearch.randomizedtesting.ThreadLeakError: 3 threads leaked from SUITE scope at org.apache.solr.handler.TestSolrConfigHandlerCloud:
    1) Thread[id=42013, name=Thread-7270, state=TIMED_WAITING, group=TGRP-TestSolrConfigHandlerCloud]
         at java.lang.Thread.sleep(Native Method)
         at org.apache.solr.cloud.ZkSolrResourceLoader.openResource(ZkSolrResourceLoader.java:101)
         at org.apache.solr.core.SolrResourceLoader.openSchema(SolrResourceLoader.java:333)
         at org.apache.solr.schema.IndexSchemaFactory.create(IndexSchemaFactory.java:48)
         at org.apache.solr.schema.IndexSchemaFactory.buildIndexSchema(IndexSchemaFactory.java:75)
         at org.apache.solr.core.ConfigSetService.createIndexSchema(ConfigSetService.java:107)
         at org.apache.solr.core.ConfigSetService.getConfig(ConfigSetService.java:78)
         at org.apache.solr.core.CoreContainer.reload(CoreContainer.java:911)
         at org.apache.solr.core.SolrCore.lambda$getConfListener$6(SolrCore.java:2509)
         at org.apache.solr.core.SolrCore$$Lambda$53/18224461.run(Unknown Source)
         at org.apache.solr.cloud.ZkController$4.run(ZkController.java:2405)
    2) Thread[id=41980, name=Thread-7259, state=TIMED_WAITING, group=TGRP-TestSolrConfigHandlerCloud]
         at java.lang.Thread.sleep(Native Method)
         at org.apache.solr.cloud.ZkSolrResourceLoader.openResource(ZkSolrResourceLoader.java:101)
         at org.apache.solr.core.SolrResourceLoader.openSchema(SolrResourceLoader.java:333)
         at org.apache.solr.schema.IndexSchemaFactory.create(IndexSchemaFactory.java:48)
         at org.apache.solr.schema.IndexSchemaFactory.buildIndexSchema(IndexSchemaFactory.java:75)
         at org.apache.solr.core.ConfigSetService.createIndexSchema(ConfigSetService.java:107)
         at org.apache.solr.core.ConfigSetService.getConfig(ConfigSetService.java:78)
         at org.apache.solr.core.CoreContainer.reload(CoreContainer.java:911)
         at org.apache.solr.core.SolrCore.lambda$getConfListener$6(SolrCore.java:2509)
         at org.apache.solr.core.SolrCore$$Lambda$53/18224461.run(Unknown Source)
         at org.apache.solr.cloud.ZkController$4.run(ZkController.java:2405)
    3) Thread[id=41947, name=Thread-7250, state=TIMED_WAITING, group=TGRP-TestSolrConfigHandlerCloud]
         at java.lang.Thread.sleep(Native Method)
         at org.apache.solr.cloud.ZkSolrResourceLoader.openResource(ZkSolrResourceLoader.java:101)
         at org.apache.solr.core.SolrResourceLoader.openSchema(SolrResourceLoader.java:333)
         at org.apache.solr.schema.IndexSchemaFactory.create(IndexSchemaFactory.java:48)
         at org.apache.solr.schema.IndexSchemaFactory.buildIndexSchema(IndexSchemaFactory.java:75)
         at org.apache.solr.core.ConfigSetService.createIndexSchema(ConfigSetService.java:107)
         at org.apache.solr.core.ConfigSetService.getConfig(ConfigSetService.java:78)
         at org.apache.solr.core.CoreContainer.reload(CoreContainer.java:911)
         at org.apache.solr.core.SolrCore.lambda$getConfListener$6(SolrCore.java:2509)
         at org.apache.solr.core.SolrCore$$Lambda$53/18224461.run(Unknown Source)
         at org.apache.solr.cloud.ZkController$4.run(ZkController.java:2405)
  at __randomizedtesting.SeedInfo.seed([55EAF178FFA0D4C]:0)




Build Log:
[...truncated 10796 lines...]
    [junit4] Suite: org.apache.solr.handler.TestReqParamsAPI
    [junit4] 2> Creating dataDir: C:\Users\jenkins\workspace\Lucene-Solr-6.x-Windows\solr\build\solr-core\test\J0\temp\solr.handler.TestReqParamsAPI_55EAF178FFA0D4C-001\init-core-data-001
    [junit4] 2> 187863 INFO (SUITE-TestReqParamsAPI-seed#[55EAF178FFA0D4C]-worker) [ ] o.a.s.SolrTestCaseJ4 Randomized ssl (true) and clientAuth (false) via: @org.apache.solr.util.RandomizeSSL(reason=, value=NaN, ssl=NaN, clientAuth=NaN)
    [junit4] 2> 187865 INFO (SUITE-TestReqParamsAPI-seed#[55EAF178FFA0D4C]-worker) [ ] o.a.s.BaseDistributedSearchTestCase Setting hostContext system property: /
    [junit4] 2> 187872 INFO (TEST-TestReqParamsAPI.test-seed#[55EAF178FFA0D4C]) [ ] o.a.s.c.ZkTestServer STARTING ZK TEST SERVER
    [junit4] 2> 187873 INFO (Thread-239) [ ] o.a.s.c.ZkTestServer client port:0.0.0.0/0.0.0.0:0
    [junit4] 2> 187873 INFO (Thread-239) [ ] o.a.s.c.ZkTestServer Starting server
    [junit4] 2> 187973 INFO (TEST-TestReqParamsAPI.test-seed#[55EAF178FFA0D4C]) [ ] o.a.s.c.ZkTestServer start zk server on port:55990
    [junit4] 2> 187973 INFO (TEST-TestReqParamsAPI.test-seed#[55EAF178FFA0D4C]) [ ] o.a.s.c.c.SolrZkClient Using default ZkCredentialsProvider
    [junit4] 2> 187975 INFO (TEST-TestReqParamsAPI.test-seed#[55EAF178FFA0D4C]) [ ] o.a.s.c.c.ConnectionManager Waiting for client to connect to ZooKeeper
    [junit4] 2> 187983 INFO (zkCallback-199-thread-1) [ ] o.a.s.c.c.ConnectionManager Watcher org.apache.solr.common.cloud.ConnectionManager@aff77c name:ZooKeeperConnection Watcher:127.0.0.1:55990 got event WatchedEvent state:SyncConnected type:None path:null path:null type:None
    [junit4] 2> 187983 INFO (TEST-TestReqParamsAPI.test-seed#[55EAF178FFA0D4C]) [ ] o.a.s.c.c.ConnectionManager Client is connected to ZooKeeper
    [junit4] 2> 187984 INFO (TEST-TestReqParamsAPI.test-seed#[55EAF178FFA0D4C]) [ ] o.a.s.c.c.SolrZkClient Using default ZkACLProvider
    [junit4] 2> 187984 INFO (TEST-TestReqParamsAPI.test-seed#[55EAF178FFA0D4C]) [ ] o.a.s.c.c.SolrZkClient makePath: /solr
    [junit4] 2> 187989 WARN (NIOServerCxn.Factory:0.0.0.0/0.0.0.0:0) [ ] o.a.z.s.NIOServerCnxn caught end of stream exception
    [junit4] 2> EndOfStreamException: Unable to read additional data from client sessionid 0x15554d6705e0000, likely client has closed socket
    [junit4] 2> at org.apache.zookeeper.server.NIOServerCnxn.doIO(NIOServerCnxn.java:228)
    [junit4] 2> at org.apache.zookeeper.server.NIOServerCnxnFactory.run(NIOServerCnxnFactory.java:208)
    [junit4] 2> at java.lang.Thread.run(Thread.java:745)
    [junit4] 2> 187991 INFO (TEST-TestReqParamsAPI.test-seed#[55EAF178FFA0D4C]) [ ] o.a.s.c.c.SolrZkClient Using default ZkCredentialsProvider
    [junit4] 2> 187992 INFO (TEST-TestReqParamsAPI.test-seed#[55EAF178FFA0D4C]) [ ] o.a.s.c.c.ConnectionManager Waiting for client to connect to ZooKeeper
    [junit4] 2> 187994 INFO (zkCallback-200-thread-1) [ ] o.a.s.c.c.ConnectionManager Watcher org.apache.solr.common.cloud.ConnectionManager@18eeed6 name:ZooKeeperConnection Watcher:127.0.0.1:55990/solr got event WatchedEvent state:SyncConnected type:None path:null path:null type:None
    [junit4] 2> 187995 INFO (TEST-TestReqParamsAPI.test-seed#[55EAF178FFA0D4C]) [ ] o.a.s.c.c.ConnectionManager Client is connected to ZooKeeper
    [junit4] 2> 187995 INFO (TEST-TestReqParamsAPI.test-seed#[55EAF178FFA0D4C]) [ ] o.a.s.c.c.SolrZkClient Using default ZkACLProvider
    [junit4] 2> 187995 INFO (TEST-TestReqParamsAPI.test-seed#[55EAF178FFA0D4C]) [ ] o.a.s.c.c.SolrZkClient makePath: /collections/collection1
    [junit4] 2> 188000 INFO (TEST-TestReqParamsAPI.test-seed#[55EAF178FFA0D4C]) [ ] o.a.s.c.c.SolrZkClient makePath: /collections/collection1/shards
    [junit4] 2> 188003 INFO (TEST-TestReqParamsAPI.test-seed#[55EAF178FFA0D4C]) [ ] o.a.s.c.c.SolrZkClient makePath: /collections/control_collection
    [junit4] 2> 188006 INFO (TEST-TestReqParamsAPI.test-seed#[55EAF178FFA0D4C]) [ ] o.a.s.c.c.SolrZkClient makePath: /collections/control_collection/shards
    [junit4] 2> 188012 INFO (TEST-TestReqParamsAPI.test-seed#[55EAF178FFA0D4C]) [ ] o.a.s.c.AbstractZkTestCase put C:\Users\jenkins\workspace\Lucene-Solr-6.x-Windows\solr\core\src\test-files\solr\collection1\conf\solrconfig-tlog.xml to /configs/conf1/solrconfig.xml
    [junit4] 2> 188013 INFO (TEST-TestReqParamsAPI.test-seed#[55EAF178FFA0D4C]) [ ] o.a.s.c.c.SolrZkClient makePath: /configs/conf1/solrconfig.xml
    [junit4] 2> 188019 INFO (TEST-TestReqParamsAPI.test-seed#[55EAF178FFA0D4C]) [ ] o.a.s.c.AbstractZkTestCase put C:\Users\jenkins\workspace\Lucene-Solr-6.x-Windows\solr\core\src\test-files\solr\collection1\conf\schema.xml to /configs/conf1/schema.xml
    [junit4] 2> 188019 INFO (TEST-TestReqParamsAPI.test-seed#[55EAF178FFA0D4C]) [ ] o.a.s.c.c.SolrZkClient makePath: /configs/conf1/schema.xml
    [junit4] 2> 188024 INFO (TEST-TestReqParamsAPI.test-seed#[55EAF178FFA0D4C]) [ ] o.a.s.c.AbstractZkTestCase put C:\Users\jenkins\workspace\Lucene-Solr-6.x-Windows\solr\core\src\test-files\solr\collection1\conf\solrconfig.snippet.randomindexconfig.xml to /configs/conf1/solrconfig.snippet.randomindexconfig.xml
    [junit4] 2> 188025 INFO (TEST-TestReqParamsAPI.test-seed#[55EAF178FFA0D4C]) [ ] o.a.s.c.c.SolrZkClient makePath: /configs/conf1/solrconfig.snippet.randomindexconfig.xml
    [junit4] 2> 188028 INFO (TEST-TestReqParamsAPI.test-seed#[55EAF178FFA0D4C]) [ ] o.a.s.c.AbstractZkTestCase put C:\Users\jenkins\workspace\Lucene-Solr-6.x-Windows\solr\core\src\test-files\solr\collection1\conf\stopwords.txt to /configs/conf1/stopwords.txt
    [junit4] 2> 188028 INFO (TEST-TestReqParamsAPI.test-seed#[55EAF178FFA0D4C]) [ ] o.a.s.c.c.SolrZkClient makePath: /configs/conf1/stopwords.txt
    [junit4] 2> 188030 INFO (TEST-TestReqParamsAPI.test-seed#[55EAF178FFA0D4C]) [ ] o.a.s.c.AbstractZkTestCase put C:\Users\jenkins\workspace\Lucene-Solr-6.x-Windows\solr\core\src\test-files\solr\collection1\conf\protwords.txt to /configs/conf1/protwords.txt
    [junit4] 2> 188031 INFO (TEST-TestReqParamsAPI.test-seed#[55EAF178FFA0D4C]) [ ] o.a.s.c.c.SolrZkClient makePath: /configs/conf1/protwords.txt
    [junit4] 2> 188035 INFO (TEST-TestReqParamsAPI.test-seed#[55EAF178FFA0D4C]) [ ] o.a.s.c.AbstractZkTestCase put C:\Users\jenkins\workspace\Lucene-Solr-6.x-Windows\solr\core\src\test-files\solr\collection1\conf\currency.xml to /configs/conf1/currency.xml
    [junit4] 2> 188035 INFO (TEST-TestReqParamsAPI.test-seed#[55EAF178FFA0D4C]) [ ] o.a.s.c.c.SolrZkClient makePath: /configs/conf1/currency.xml
    [junit4] 2> 188039 INFO (TEST-TestReqParamsAPI.test-seed#[55EAF178FFA0D4C]) [ ] o.a.s.c.AbstractZkTestCase put C:\Users\jenkins\workspace\Lucene-Solr-6.x-Windows\solr\core\src\test-files\solr\collection1\conf\enumsConfig.xml to /configs/conf1/enumsConfig.xml
    [junit4] 2> 188039 INFO (TEST-TestReqParamsAPI.test-seed#[55EAF178FFA0D4C]) [ ] o.a.s.c.c.SolrZkClient makePath: /configs/conf1/enumsConfig.xml
    [junit4] 2> 188043 INFO (TEST-TestReqParamsAPI.test-seed#[55EAF178FFA0D4C]) [ ] o.a.s.c.AbstractZkTestCase put C:\Users\jenkins\workspace\Lucene-Solr-6.x-Windows\solr\core\src\test-files\solr\collection1\conf\open-exchange-rates.json to /configs/conf1/open-exchange-rates.json
    [junit4] 2> 188043 INFO (TEST-TestReqParamsAPI.test-seed#[55EAF178FFA0D4C]) [ ] o.a.s.c.c.SolrZkClient makePath: /configs/conf1/open-exchange-rates.json
    [junit4] 2> 188047 INFO (TEST-TestReqParamsAPI.test-seed#[55EAF178FFA0D4C]) [ ] o.a.s.c.AbstractZkTestCase put C:\Users\jenkins\workspace\Lucene-Solr-6.x-Windows\solr\core\src\test-files\solr\collection1\conf\mapping-ISOLatin1Accent.txt to /configs/conf1/mapping-ISOLatin1Accent.txt
    [junit4] 2> 188047 INFO (TEST-TestReqParamsAPI.test-seed#[55EAF178FFA0D4C]) [ ] o.a.s.c.c.SolrZkClient makePath: /configs/conf1/mapping-ISOLatin1Accent.txt
    [junit4] 2> 188051 INFO (TEST-TestReqParamsAPI.test-seed#[55EAF178FFA0D4C]) [ ] o.a.s.c.AbstractZkTestCase put C:\Users\jenkins\workspace\Lucene-Solr-6.x-Windows\solr\core\src\test-files\solr\collection1\conf\old_synonyms.txt to /configs/conf1/old_synonyms.txt
    [junit4] 2> 188051 INFO (TEST-TestReqParamsAPI.test-seed#[55EAF178FFA0D4C]) [ ] o.a.s.c.c.SolrZkClient makePath: /configs/conf1/old_synonyms.txt
    [junit4] 2> 188055 INFO (TEST-TestReqParamsAPI.test-seed#[55EAF178FFA0D4C]) [ ] o.a.s.c.AbstractZkTestCase put C:\Users\jenkins\workspace\Lucene-Solr-6.x-Windows\solr\core\src\test-files\solr\collection1\conf\synonyms.txt to /configs/conf1/synonyms.txt
    [junit4] 2> 188055 INFO (TEST-TestReqParamsAPI.test-seed#[55EAF178FFA0D4C]) [ ] o.a.s.c.c.SolrZkClient makePath: /configs/conf1/synonyms.txt
    [junit4] 2> 188060 INFO (TEST-TestReqParamsAPI.test-seed#[55EAF178FFA0D4C]) [ ] o.a.s.c.c.SolrZkClient Using default ZkCredentialsProvider
    [junit4] 2> 188064 INFO (TEST-TestReqParamsAPI.test-seed#[55EAF178FFA0D4C]) [ ] o.a.s.c.c.ConnectionManager Waiting for client to connect to ZooKeeper
    [junit4] 2> 188067 INFO (zkCallback-202-thread-1) [ ] o.a.s.c.c.ConnectionManager Watcher org.apache.solr.common.cloud.ConnectionManager@149f38e name:ZooKeeperConnection Watcher:127.0.0.1:55990/solr got event WatchedEvent state:SyncConnected type:None path:null path:null type:None
    [junit4] 2> 188067 INFO (TEST-TestReqParamsAPI.test-seed#[55EAF178FFA0D4C]) [ ] o.a.s.c.c.ConnectionManager Client is connected to ZooKeeper
    [junit4] 2> 188067 INFO (TEST-TestReqParamsAPI.test-seed#[55EAF178FFA0D4C]) [ ] o.a.s.c.c.SolrZkClient Using default ZkACLProvider
    [junit4] 2> 188071 WARN (NIOServerCxn.Factory:0.0.0.0/0.0.0.0:0) [ ] o.a.z.s.NIOServerCnxn caught end of stream exception
    [junit4] 2> EndOfStreamException: Unable to read additional data from client sessionid 0x15554d6705e0002, likely client has closed socket
    [junit4] 2> at org.apache.zookeeper.server.NIOServerCnxn.doIO(NIOServerCnxn.java:228)
    [junit4] 2> at org.apache.zookeeper.server.NIOServerCnxnFactory.run(NIOServerCnxnFactory.java:208)
    [junit4] 2> at java.lang.Thread.run(Thread.java:745)
    [junit4] 2> 188952 INFO (TEST-TestReqParamsAPI.test-seed#[55EAF178FFA0D4C]) [ ] o.a.s.SolrTestCaseJ4 Writing core.properties file to C:\Users\jenkins\workspace\Lucene-Solr-6.x-Windows\solr\build\solr-core\test\J0\temp\solr.handler.TestReqParamsAPI_55EAF178FFA0D4C-001\control-001\cores\collection1
    [junit4] 2> 188994 INFO (TEST-TestReqParamsAPI.test-seed#[55EAF178FFA0D4C]) [ ] o.e.j.s.Server jetty-9.3.8.v20160314
    [junit4] 2> 188996 INFO (TEST-TestReqParamsAPI.test-seed#[55EAF178FFA0D4C]) [ ] o.e.j.s.h.ContextHandler Started o.e.j.s.ServletContextHandler@d7467{/,null,AVAILABLE}
    [junit4] 2> 189270 INFO (TEST-TestReqParamsAPI.test-seed#[55EAF178FFA0D4C]) [ ] o.e.j.s.ServerConnector Started ServerConnector@147035f{SSL,[ssl, http/1.1]}{127.0.0.1:56000}
    [junit4] 2> 189270 INFO (TEST-TestReqParamsAPI.test-seed#[55EAF178FFA0D4C]) [ ] o.e.j.s.Server Started @195437ms
    [junit4] 2> 189270 INFO (TEST-TestReqParamsAPI.test-seed#[55EAF178FFA0D4C]) [ ] o.a.s.c.s.e.JettySolrRunner Jetty properties: {solr.data.dir=C:\Users\jenkins\workspace\Lucene-Solr-6.x-Windows\solr\build\solr-core\test\J0\temp\solr.handler.TestReqParamsAPI_55EAF178FFA0D4C-001\tempDir-001/control/data, hostContext=/, hostPort=56000, coreRootDirectory=C:\Users\jenkins\workspace\Lucene-Solr-6.x-Windows\solr\build\solr-core\test\J0\temp\solr.handler.TestReqParamsAPI_55EAF178FFA0D4C-001\control-001\cores}
    [junit4] 2> 189271 INFO (TEST-TestReqParamsAPI.test-seed#[55EAF178FFA0D4C]) [ ] o.a.s.s.SolrDispatchFilter SolrDispatchFilter.init(): sun.misc.Launcher$AppClassLoader@1d16e93
    [junit4] 2> 189271 INFO (TEST-TestReqParamsAPI.test-seed#[55EAF178FFA0D4C]) [ ] o.a.s.c.SolrResourceLoader new SolrResourceLoader for directory: 'C:\Users\jenkins\workspace\Lucene-Solr-6.x-Windows\solr\build\solr-core\test\J0\temp\solr.handler.TestReqParamsAPI_55EAF178FFA0D4C-001\control-001'
    [junit4] 2> 189271 INFO (TEST-TestReqParamsAPI.test-seed#[55EAF178FFA0D4C]) [ ] o.a.s.c.SolrResourceLoader JNDI not configured for solr (NoInitialContextEx)
    [junit4] 2> 189271 INFO (TEST-TestReqParamsAPI.test-seed#[55EAF178FFA0D4C]) [ ] o.a.s.c.SolrResourceLoader solr home defaulted to 'solr/' (could not find system property or JNDI)
    [junit4] 2> 189272 INFO (TEST-TestReqParamsAPI.test-seed#[55EAF178FFA0D4C]) [ ] o.a.s.c.c.SolrZkClient Using default ZkCredentialsProvider
    [junit4] 2> 189273 INFO (TEST-TestReqParamsAPI.test-seed#[55EAF178FFA0D4C]) [ ] o.a.s.c.c.ConnectionManager Waiting for client to connect to ZooKeeper
    [junit4] 2> 189349 INFO (zkCallback-203-thread-1) [ ] o.a.s.c.c.ConnectionManager Watcher org.apache.solr.common.cloud.ConnectionManager@e2f0e0 name:ZooKeeperConnection Watcher:127.0.0.1:55990/solr got event WatchedEvent state:SyncConnected type:None path:null path:null type:None
    [junit4] 2> 189349 INFO (TEST-TestReqParamsAPI.test-seed#[55EAF178FFA0D4C]) [ ] o.a.s.c.c.ConnectionManager Client is connected to ZooKeeper
    [junit4] 2> 189350 INFO (TEST-TestReqParamsAPI.test-seed#[55EAF178FFA0D4C]) [ ] o.a.s.c.c.SolrZkClient Using default ZkACLProvider
    [junit4] 2> 189354 INFO (TEST-TestReqParamsAPI.test-seed#[55EAF178FFA0D4C]) [ ] o.a.s.s.SolrDispatchFilter Loading solr.xml from SolrHome (not found in ZooKeeper)
    [junit4] 2> 189354 INFO (TEST-TestReqParamsAPI.test-seed#[55EAF178FFA0D4C]) [ ] o.a.s.c.SolrXmlConfig Loading container configuration from C:\Users\jenkins\workspace\Lucene-Solr-6.x-Windows\solr\build\solr-core\test\J0\temp\solr.handler.TestReqParamsAPI_55EAF178FFA0D4C-001\control-001\solr.xml
    [junit4] 2> 189372 INFO (TEST-TestReqParamsAPI.test-seed#[55EAF178FFA0D4C]) [ ] o.a.s.c.CorePropertiesLocator Config-defined core root directory: C:\Users\jenkins\workspace\Lucene-Solr-6.x-Windows\solr\build\solr-core\test\J0\temp\solr.handler.TestReqParamsAPI_55EAF178FFA0D4C-001\control-001\cores
    [junit4] 2> 189372 INFO (TEST-TestReqParamsAPI.test-seed#[55EAF178FFA0D4C]) [ ] o.a.s.c.CoreContainer New CoreContainer 22725754
    [junit4] 2> 189372 INFO (TEST-TestReqParamsAPI.test-seed#[55EAF178FFA0D4C]) [ ] o.a.s.c.CoreContainer Loading cores into CoreContainer [instanceDir=C:\Users\jenkins\workspace\Lucene-Solr-6.x-Windows\solr\build\solr-core\test\J0\temp\solr.handler.TestReqParamsAPI_55EAF178FFA0D4C-001\control-001]
    [junit4] 2> 189372 WARN (TEST-TestReqParamsAPI.test-seed#[55EAF178FFA0D4C]) [ ] o.a.s.c.CoreContainer Couldn't add files from C:\Users\jenkins\workspace\Lucene-Solr-6.x-Windows\solr\build\solr-core\test\J0\temp\solr.handler.TestReqParamsAPI_55EAF178FFA0D4C-001\control-001\lib to classpath: C:\Users\jenkins\workspace\Lucene-Solr-6.x-Windows\solr\build\solr-core\test\J0\temp\solr.handler.TestReqParamsAPI_55EAF178FFA0D4C-001\control-001\lib
    [junit4] 2> 189372 INFO (TEST-TestReqParamsAPI.test-seed#[55EAF178FFA0D4C]) [ ] o.a.s.h.c.HttpShardHandlerFactory created with socketTimeout : 90000,urlScheme : ,connTimeout : 15000,maxConnectionsPerHost : 20,maxConnections : 10000,corePoolSize : 0,maximumPoolSize : 2147483647,maxThreadIdleTime : 5,sizeOfQueue : -1,fairnessPolicy : false,useRetries : false,
    [junit4] 2> 189376 INFO (TEST-TestReqParamsAPI.test-seed#[55EAF178FFA0D4C]) [ ] o.a.s.u.UpdateShardHandler Creating UpdateShardHandler HTTP client with params: socketTimeout=340000&connTimeout=45000&retry=true
    [junit4] 2> 189376 INFO (TEST-TestReqParamsAPI.test-seed#[55EAF178FFA0D4C]) [ ] o.a.s.l.LogWatcher SLF4J impl is org.slf4j.impl.Log4jLoggerFactory
    [junit4] 2> 189376 INFO (TEST-TestReqParamsAPI.test-seed#[55EAF178FFA0D4C]) [ ] o.a.s.l.LogWatcher Registering Log Listener [Log4j (org.slf4j.impl.Log4jLoggerFactory)]
    [junit4] 2> 189376 INFO (TEST-TestReqParamsAPI.test-seed#[55EAF178FFA0D4C]) [ ] o.a.s.c.ZkContainer Zookeeper client=127.0.0.1:55990/solr
    [junit4] 2> 189376 INFO (TEST-TestReqParamsAPI.test-seed#[55EAF178FFA0D4C]) [ ] o.a.s.c.ZkController zkHost includes chroot
    [junit4] 2> 189376 INFO (TEST-TestReqParamsAPI.test-seed#[55EAF178FFA0D4C]) [ ] o.a.s.c.c.SolrZkClient Using default ZkCredentialsProvider
    [junit4] 2> 189378 INFO (TEST-TestReqParamsAPI.test-seed#[55EAF178FFA0D4C]) [ ] o.a.s.c.c.ConnectionManager Waiting for client to connect to ZooKeeper
    [junit4] 2> 189409 INFO (zkCallback-206-thread-1) [ ] o.a.s.c.c.ConnectionManager Watcher org.apache.solr.common.cloud.ConnectionManager@5bcd82 name:ZooKeeperConnection Watcher:127.0.0.1:55990 got event WatchedEvent state:SyncConnected type:None path:null path:null type:None
    [junit4] 2> 189409 INFO (TEST-TestReqParamsAPI.test-seed#[55EAF178FFA0D4C]) [ ] o.a.s.c.c.ConnectionManager Client is connected to ZooKeeper
    [junit4] 2> 189411 INFO (TEST-TestReqParamsAPI.test-seed#[55EAF178FFA0D4C]) [ ] o.a.s.c.c.SolrZkClient Using default ZkACLProvider
    [junit4] 2> 189414 INFO (TEST-TestReqParamsAPI.test-seed#[55EAF178FFA0D4C]) [n:127.0.0.1:56000_ ] o.a.s.c.ZkController Added new OnReconnect listener org.apache.solr.cloud.ZkController$$Lambda$11/16530972@979ffd
    [junit4] 2> 189415 INFO (TEST-TestReqParamsAPI.test-seed#[55EAF178FFA0D4C]) [n:127.0.0.1:56000_ ] o.a.s.c.c.ConnectionManager Waiting for client to connect to ZooKeeper
    [junit4] 2> 189426 INFO (zkCallback-207-thread-1-processing-n:127.0.0.1:56000_) [n:127.0.0.1:56000_ ] o.a.s.c.c.ConnectionManager Watcher org.apache.solr.common.cloud.ConnectionManager@566da3 name:ZooKeeperConnection Watcher:127.0.0.1:55990/solr got event WatchedEvent state:SyncConnected type:None path:null path:null type:None
    [junit4] 2> 189426 INFO (TEST-TestReqParamsAPI.test-seed#[55EAF178FFA0D4C]) [n:127.0.0.1:56000_ ] o.a.s.c.c.ConnectionManager Client is connected to ZooKeeper
    [junit4] 2> 189427 INFO (TEST-TestReqParamsAPI.test-seed#[55EAF178FFA0D4C]) [n:127.0.0.1:56000_ ] o.a.s.c.c.SolrZkClient makePath: /overseer/queue
    [junit4] 2> 189430 INFO (TEST-TestReqParamsAPI.test-seed#[55EAF178FFA0D4C]) [n:127.0.0.1:56000_ ] o.a.s.c.c.SolrZkClient makePath: /overseer/collection-queue-work
    [junit4] 2> 189436 INFO (TEST-TestReqParamsAPI.test-seed#[55EAF178FFA0D4C]) [n:127.0.0.1:56000_ ] o.a.s.c.c.SolrZkClient makePath: /overseer/collection-map-running
    [junit4] 2> 189439 INFO (TEST-TestReqParamsAPI.test-seed#[55EAF178FFA0D4C]) [n:127.0.0.1:56000_ ] o.a.s.c.c.SolrZkClient makePath: /overseer/collection-map-completed
    [junit4] 2> 189443 INFO (TEST-TestReqParamsAPI.test-seed#[55EAF178FFA0D4C]) [n:127.0.0.1:56000_ ] o.a.s.c.c.SolrZkClient makePath: /overseer/collection-map-failure
    [junit4] 2> 189446 INFO (TEST-TestReqParamsAPI.test-seed#[55EAF178FFA0D4C]) [n:127.0.0.1:56000_ ] o.a.s.c.c.SolrZkClient makePath: /live_nodes
    [junit4] 2> 189449 INFO (TEST-TestReqParamsAPI.test-seed#[55EAF178FFA0D4C]) [n:127.0.0.1:56000_ ] o.a.s.c.c.SolrZkClient makePath: /aliases.json
    [junit4] 2> 189452 INFO (TEST-TestReqParamsAPI.test-seed#[55EAF178FFA0D4C]) [n:127.0.0.1:56000_ ] o.a.s.c.c.SolrZkClient makePath: /clusterstate.json
    [junit4] 2> 189454 INFO (TEST-TestReqParamsAPI.test-seed#[55EAF178FFA0D4C]) [n:127.0.0.1:56000_ ] o.a.s.c.c.SolrZkClient makePath: /security.json
    [junit4] 2> 189456 INFO (TEST-TestReqParamsAPI.test-seed#[55EAF178FFA0D4C]) [n:127.0.0.1:56000_ ] o.a.s.c.c.ZkStateReader Updating cluster state from ZooKeeper...
    [junit4] 2> 189457 INFO (TEST-TestReqParamsAPI.test-seed#[55EAF178FFA0D4C]) [n:127.0.0.1:56000_ ] o.a.s.c.c.ZkStateReader Loaded cluster properties: {urlScheme=https}
    [junit4] 2> 189458 INFO (TEST-TestReqParamsAPI.test-seed#[55EAF178FFA0D4C]) [n:127.0.0.1:56000_ ] o.a.s.c.c.ZkStateReader Updated live nodes from ZooKeeper... (0) -> (0)
    [junit4] 2> 189461 INFO (TEST-TestReqParamsAPI.test-seed#[55EAF178FFA0D4C]) [n:127.0.0.1:56000_ ] o.a.s.c.c.SolrZkClient makePath: /overseer_elect
    [junit4] 2> 189463 INFO (TEST-TestReqParamsAPI.test-seed#[55EAF178FFA0D4C]) [n:127.0.0.1:56000_ ] o.a.s.c.c.SolrZkClient makePath: /overseer_elect/election
    [junit4] 2> 189465 INFO (TEST-TestReqParamsAPI.test-seed#[55EAF178FFA0D4C]) [n:127.0.0.1:56000_ ] o.a.s.c.Overseer Overseer (id=null) closing
    [junit4] 2> 189466 INFO (TEST-TestReqParamsAPI.test-seed#[55EAF178FFA0D4C]) [n:127.0.0.1:56000_ ] o.a.s.c.LeaderElector Joined leadership election with path: /overseer_elect/election/96076247043276805-127.0.0.1:56000_-n_0000000000
    [junit4] 2> 189467 INFO (TEST-TestReqParamsAPI.test-seed#[55EAF178FFA0D4C]) [n:127.0.0.1:56000_ ] o.a.s.c.OverseerElectionContext I am going to be the leader 127.0.0.1:56000_
    [junit4] 2> 189468 INFO (TEST-TestReqParamsAPI.test-seed#[55EAF178FFA0D4C]) [n:127.0.0.1:56000_ ] o.a.s.c.c.SolrZkClient makePath: /overseer_elect/leader
    [junit4] 2> 189470 INFO (TEST-TestReqParamsAPI.test-seed#[55EAF178FFA0D4C]) [n:127.0.0.1:56000_ ] o.a.s.c.Overseer Overseer (id=96076247043276805-127.0.0.1:56000_-n_0000000000) starting
    [junit4] 2> 189473 INFO (TEST-TestReqParamsAPI.test-seed#[55EAF178FFA0D4C]) [n:127.0.0.1:56000_ ] o.a.s.c.c.SolrZkClient makePath: /overseer/queue-work
    [junit4] 2> 189511 INFO (TEST-TestReqParamsAPI.test-seed#[55EAF178FFA0D4C]) [n:127.0.0.1:56000_ ] o.a.s.c.OverseerAutoReplicaFailoverThread Starting OverseerAutoReplicaFailoverThread autoReplicaFailoverWorkLoopDelay=10000 autoReplicaFailoverWaitAfterExpiration=30000 autoReplicaFailoverBadNodeExpiration=60000
    [junit4] 2> 189518 INFO (TEST-TestReqParamsAPI.test-seed#[55EAF178FFA0D4C]) [n:127.0.0.1:56000_ ] o.a.s.c.ZkController Register node as live in ZooKeeper:/live_nodes/127.0.0.1:56000_
    [junit4] 2> 189519 INFO (TEST-TestReqParamsAPI.test-seed#[55EAF178FFA0D4C]) [n:127.0.0.1:56000_ ] o.a.s.c.c.SolrZkClient makePath: /live_nodes/127.0.0.1:56000_
    [junit4] 2> 189520 INFO (zkCallback-207-thread-1-processing-n:127.0.0.1:56000_) [n:127.0.0.1:56000_ ] o.a.s.c.c.ZkStateReader A live node change: [WatchedEvent state:SyncConnected type:NodeChildrenChanged path:/live_nodes], has occurred - updating... (live nodes size: [0])
    [junit4] 2> 189550 INFO (TEST-TestReqParamsAPI.test-seed#[55EAF178FFA0D4C]) [n:127.0.0.1:56000_ ] o.a.s.c.CoreContainer Security conf doesn't exist. Skipping setup for authorization module.
    [junit4] 2> 189550 INFO (TEST-TestReqParamsAPI.test-seed#[55EAF178FFA0D4C]) [n:127.0.0.1:56000_ ] o.a.s.c.CoreContainer No authentication plugin used.
    [junit4] 2> 189552 INFO (TEST-TestReqParamsAPI.test-seed#[55EAF178FFA0D4C]) [n:127.0.0.1:56000_ ] o.a.s.c.CorePropertiesLocator Looking for core definitions underneath C:\Users\jenkins\workspace\Lucene-Solr-6.x-Windows\solr\build\solr-core\test\J0\temp\solr.handler.TestReqParamsAPI_55EAF178FFA0D4C-001\control-001\cores
    [junit4] 2> 189554 INFO (TEST-TestReqParamsAPI.test-seed#[55EAF178FFA0D4C]) [n:127.0.0.1:56000_ ] o.a.s.c.CoreDescriptor Created CoreDescriptor: {name=collection1, config=solrconfig.xml, transient=false, schema=schema.xml, loadOnStartup=true, configSetProperties=configsetprops.json, collection=control_collection, coreNodeName=, dataDir=data\, shard=}
    [junit4] 2> 189554 INFO (TEST-TestReqParamsAPI.test-seed#[55EAF178FFA0D4C]) [n:127.0.0.1:56000_ ] o.a.s.c.CorePropertiesLocator Found core collection1 in C:\Users\jenkins\workspace\Lucene-Solr-6.x-Windows\solr\build\solr-core\test\J0\temp\solr.handler.TestReqParamsAPI_55EAF178FFA0D4C-001\control-001\cores\collection1
    [junit4] 2> 189554 INFO (TEST-TestReqParamsAPI.test-seed#[55EAF178FFA0D4C]) [n:127.0.0.1:56000_ ] o.a.s.c.CorePropertiesLocator Found 1 core definitions
    [junit4] 2> 189558 INFO (zkCallback-207-thread-1-processing-n:127.0.0.1:56000_) [n:127.0.0.1:56000_ ] o.a.s.c.c.ZkStateReader Updated live nodes from ZooKeeper... (0) -> (1)
    [junit4] 2> 189559 INFO (OverseerCollectionConfigSetProcessor-96076247043276805-127.0.0.1:56000_-n_0000000000) [n:127.0.0.1:56000_ ] o.a.s.c.OverseerTaskProcessor Process current queue of overseer operations
    [junit4] 2> 189562 INFO (TEST-TestReqParamsAPI.test-seed#[55EAF178FFA0D4C]) [n:127.0.0.1:56000_ ] o.a.s.s.SolrDispatchFilter user.dir=C:\Users\jenkins\workspace\Lucene-Solr-6.x-Windows\solr\build\solr-core\test\J0
    [junit4] 2> 189562 INFO (TEST-TestReqParamsAPI.test-seed#[55EAF178FFA0D4C]) [n:127.0.0.1:56000_ ] o.a.s.s.SolrDispatchFilter SolrDispatchFilter.init() done
    [junit4] 2> 189562 INFO (coreLoadExecutor-367-thread-1-processing-n:127.0.0.1:56000_) [n:127.0.0.1:56000_ c:control_collection x:collection1] o.a.s.c.ZkController publishing state=down
    [junit4] 2> 189562 INFO (coreLoadExecutor-367-thread-1-processing-n:127.0.0.1:56000_) [n:127.0.0.1:56000_ c:control_collection x:collection1] o.a.s.c.ZkController numShards not found on descriptor - reading it from system property
    [junit4] 2> 189563 INFO (OverseerStateUpdate-96076247043276805-127.0.0.1:56000_-n_0000000000) [n:127.0.0.1:56000_ ] o.a.s.c.Overseer Starting to work on the main queue
    [junit4] 2> 189565 INFO (coreLoadExecutor-367-thread-1-processing-n:127.0.0.1:56000_) [n:127.0.0.1:56000_ c:control_collection x:collection1] o.a.s.c.ZkController Collection control_collection not visible yet, but flagging it so a watch is registered when it becomes visible
    [junit4] 2> 189567 INFO (coreLoadExecutor-367-thread-1-processing-n:127.0.0.1:56000_) [n:127.0.0.1:56000_ c:control_collection x:collection1] o.a.s.c.c.ZkStateReader Deleting data for [control_collection]
    [junit4] 2> 189567 INFO (OverseerStateUpdate-96076247043276805-127.0.0.1:56000_-n_0000000000) [n:127.0.0.1:56000_ ] o.a.s.c.c.ZkStateReader Updated live nodes from ZooKeeper... (1) -> (1)
    [junit4] 2> 189570 INFO (coreLoadExecutor-367-thread-1-processing-n:127.0.0.1:56000_) [n:127.0.0.1:56000_ c:control_collection x:collection1] o.a.s.c.ZkController look for our core node name
    [junit4] 2> 189570 INFO (OverseerStateUpdate-96076247043276805-127.0.0.1:56000_-n_0000000000) [n:127.0.0.1:56000_ ] o.a.s.c.Overseer processMessage: queueSize: 1, message = {
    [junit4] 2> "core":"collection1",
    [junit4] 2> "roles":null,
    [junit4] 2> "base_url":"https://127.0.0.1:56000",
    [junit4] 2> "node_name":"127.0.0.1:56000_",
    [junit4] 2> "numShards":"1",
    [junit4] 2> "state":"down",
    [junit4] 2> "shard":null,
    [junit4] 2> "collection":"control_collection",
    [junit4] 2> "operation":"state"} current state version: 0
    [junit4] 2> 189570 INFO (OverseerStateUpdate-96076247043276805-127.0.0.1:56000_-n_0000000000) [n:127.0.0.1:56000_ ] o.a.s.c.o.ReplicaMutator Update state numShards=1 message={
    [junit4] 2> "core":"collection1",
    [junit4] 2> "roles":null,
    [junit4] 2> "base_url":"https://127.0.0.1:56000",
    [junit4] 2> "node_name":"127.0.0.1:56000_",
    [junit4] 2> "numShards":"1",
    [junit4] 2> "state":"down",
    [junit4] 2> "shard":null,
    [junit4] 2> "collection":"control_collection",
    [junit4] 2> "operation":"state"}
    [junit4] 2> 189570 INFO (OverseerStateUpdate-96076247043276805-127.0.0.1:56000_-n_0000000000) [n:127.0.0.1:56000_ ] o.a.s.c.o.ClusterStateMutator building a new cName: control_collection
    [junit4] 2> 189570 INFO (OverseerStateUpdate-96076247043276805-127.0.0.1:56000_-n_0000000000) [n:127.0.0.1:56000_ ] o.a.s.c.o.ReplicaMutator Assigning new node to shard shard=shard1
    [junit4] 2> 189572 INFO (zkCallback-207-thread-1-processing-n:127.0.0.1:56000_) [n:127.0.0.1:56000_ ] o.a.s.c.c.ZkStateReader A cluster state change: [WatchedEvent state:SyncConnected type:NodeDataChanged path:/clusterstate.json], has occurred - updating... (live nodes size: [1])
    [junit4] 2> 190726 INFO (coreLoadExecutor-367-thread-1-processing-n:127.0.0.1:56000_) [n:127.0.0.1:56000_ c:control_collection x:collection1] o.a.s.c.ZkController waiting to find shard id in clusterstate for collection1
    [junit4] 2> 190726 INFO (coreLoadExecutor-367-thread-1-processing-n:127.0.0.1:56000_) [n:127.0.0.1:56000_ c:control_collection x:collection1] o.a.s.c.ZkController Check for collection zkNode:control_collection
    [junit4] 2> 190727 INFO (coreLoadExecutor-367-thread-1-processing-n:127.0.0.1:56000_) [n:127.0.0.1:56000_ c:control_collection x:collection1] o.a.s.c.ZkController Collection zkNode exists
    [junit4] 2> 190727 INFO (coreLoadExecutor-367-thread-1-processing-n:127.0.0.1:56000_) [n:127.0.0.1:56000_ c:control_collection x:collection1] o.a.s.c.c.ZkStateReader Load collection config from: [/collections/control_collection]
    [junit4] 2> 190731 INFO (coreLoadExecutor-367-thread-1-processing-n:127.0.0.1:56000_) [n:127.0.0.1:56000_ c:control_collection x:collection1] o.a.s.c.c.ZkStateReader path=[/collections/control_collection] [configName]=[conf1] specified config exists in ZooKeeper
    [junit4] 2> 190731 INFO (coreLoadExecutor-367-thread-1-processing-n:127.0.0.1:56000_) [n:127.0.0.1:56000_ c:control_collection x:collection1] o.a.s.c.SolrResourceLoader new SolrResourceLoader for directory: 'C:\Users\jenkins\workspace\Lucene-Solr-6.x-Windows\solr\build\solr-core\test\J0\temp\solr.handler.TestReqParamsAPI_55EAF178FFA0D4C-001\control-001\cores\collection1'
    [junit4] 2> 190731 INFO (coreLoadExecutor-367-thread-1-processing-n:127.0.0.1:56000_) [n:127.0.0.1:56000_ c:control_collection x:collection1] o.a.s.c.SolrResourceLoader JNDI not configured for solr (NoInitialContextEx)
    [junit4] 2> 190731 INFO (coreLoadExecutor-367-thread-1-processing-n:127.0.0.1:56000_) [n:127.0.0.1:56000_ c:control_collection x:collection1] o.a.s.c.SolrResourceLoader solr home defaulted to 'solr/' (could not find system property or JNDI)
    [junit4] 2> 190736 INFO (coreLoadExecutor-367-thread-1-processing-n:127.0.0.1:56000_) [n:127.0.0.1:56000_ c:control_collection x:collection1] o.a.s.c.Config loaded config solrconfig.xml with version 0
    [junit4] 2> 190759 INFO (coreLoadExecutor-367-thread-1-processing-n:127.0.0.1:56000_) [n:127.0.0.1:56000_ c:control_collection x:collection1] o.a.s.c.SolrConfig current version of requestparams : -1
    [junit4] 2> 190771 INFO (coreLoadExecutor-367-thread-1-processing-n:127.0.0.1:56000_) [n:127.0.0.1:56000_ c:control_collection x:collection1] o.a.s.c.SolrConfig Using Lucene MatchVersion: 6.2.0
    [junit4] 2> 190800 INFO (coreLoadExecutor-367-thread-1-processing-n:127.0.0.1:56000_) [n:127.0.0.1:56000_ c:control_collection x:collection1] o.a.s.c.SolrConfig Loaded SolrConfig: solrconfig.xml
    [junit4] 2> 190814 INFO (coreLoadExecutor-367-thread-1-processing-n:127.0.0.1:56000_) [n:127.0.0.1:56000_ c:control_collection x:collection1] o.a.s.s.IndexSchema [collection1] Schema name=test
    [junit4] 2> 190943 INFO (coreLoadExecutor-367-thread-1-processing-n:127.0.0.1:56000_) [n:127.0.0.1:56000_ c:control_collection x:collection1] o.a.s.s.OpenExchangeRatesOrgProvider Initialized with rates=open-exchange-rates.json, refreshInterval=1440.
    [junit4] 2> 190963 INFO (coreLoadExecutor-367-thread-1-processing-n:127.0.0.1:56000_) [n:127.0.0.1:56000_ c:control_collection x:collection1] o.a.s.s.IndexSchema default search field in schema is text
    [junit4] 2> 190964 INFO (coreLoadExecutor-367-thread-1-processing-n:127.0.0.1:56000_) [n:127.0.0.1:56000_ c:control_collection x:collection1] o.a.s.s.IndexSchema unique key field: id
    [junit4] 2> 190990 INFO (coreLoadExecutor-367-thread-1-processing-n:127.0.0.1:56000_) [n:127.0.0.1:56000_ c:control_collection x:collection1] o.a.s.s.FileExchangeRateProvider Reloading exchange rates from file currency.xml
    [junit4] 2> 190994 INFO (coreLoadExecutor-367-thread-1-processing-n:127.0.0.1:56000_) [n:127.0.0.1:56000_ c:control_collection x:collection1] o.a.s.s.FileExchangeRateProvider Reloading exchange rates from file currency.xml
    [junit4] 2> 190999 INFO (coreLoadExecutor-367-thread-1-processing-n:127.0.0.1:56000_) [n:127.0.0.1:56000_ c:control_collection x:collection1] o.a.s.s.OpenExchangeRatesOrgProvider Reloading exchange rates from open-exchange-rates.json
    [junit4] 2> 191001 INFO (coreLoadExecutor-367-thread-1-processing-n:127.0.0.1:56000_) [n:127.0.0.1:56000_ c:control_collection x:collection1] o.a.s.s.OpenExchangeRatesOrgProvider Reloading exchange rates from open-exchange-rates.json
    [junit4] 2> 191009 INFO (coreLoadExecutor-367-thread-1-processing-n:127.0.0.1:56000_) [n:127.0.0.1:56000_ c:control_collection x:collection1] o.a.s.c.ConfigSetProperties Did not find ConfigSet properties, assuming default properties: Can't find resource 'configsetprops.json' in classpath or '/configs/conf1', cwd=C:\Users\jenkins\workspace\Lucene-Solr-6.x-Windows\solr\build\solr-core\test\J0
    [junit4] 2> 191009 INFO (coreLoadExecutor-367-thread-1-processing-n:127.0.0.1:56000_) [n:127.0.0.1:56000_ c:control_collection x:collection1] o.a.s.c.CoreContainer Creating SolrCore 'collection1' using configuration from collection control_collection
    [junit4] 2> 191009 INFO (coreLoadExecutor-367-thread-1-processing-n:127.0.0.1:56000_) [n:127.0.0.1:56000_ c:control_collection s:shard1 r:core_node1 x:collection1] o.a.s.c.SolrCore org.apache.solr.core.MockDirectoryFactory
    [junit4] 2> 191010 INFO (coreLoadExecutor-367-thread-1-processing-n:127.0.0.1:56000_) [n:127.0.0.1:56000_ c:control_collection s:shard1 r:core_node1 x:collection1] o.a.s.c.SolrCore [[collection1] ] Opening new SolrCore at [C:\Users\jenkins\workspace\Lucene-Solr-6.x-Windows\solr\build\solr-core\test\J0\temp\solr.handler.TestReqParamsAPI_55EAF178FFA0D4C-001\control-001\cores\collection1], dataDir=[C:\Users\jenkins\workspace\Lucene-Solr-6.x-Windows\solr\build\solr-core\test\J0\temp\solr.handler.TestReqParamsAPI_55EAF178FFA0D4C-001\control-001\cores\collection1\data\]
    [junit4] 2> 191010 INFO (coreLoadExecutor-367-thread-1-processing-n:127.0.0.1:56000_) [n:127.0.0.1:56000_ c:control_collection s:shard1 r:core_node1 x:collection1] o.a.s.c.JmxMonitoredMap JMX monitoring is enabled. Adding Solr mbeans to JMX Server: com.sun.jmx.mbeanserver.JmxMBeanServer@17e6126
    [junit4] 2> 191011 INFO (coreLoadExecutor-367-thread-1-processing-n:127.0.0.1:56000_) [n:127.0.0.1:56000_ c:control_collection s:shard1 r:core_node1 x:collection1] o.a.s.c.CachingDirectoryFactory return new directory for C:\Users\jenkins\workspace\Lucene-Solr-6.x-Windows\solr\build\solr-core\test\J0\temp\solr.handler.TestReqParamsAPI_55EAF178FFA0D4C-001\control-001\cores\collection1\data\
    [junit4] 2> 191011 INFO (coreLoadExecutor-367-thread-1-processing-n:127.0.0.1:56000_) [n:127.0.0.1:56000_ c:control_collection s:shard1 r:core_node1 x:collection1] o.a.s.c.SolrCore New index directory detected: old=null new=C:\Users\jenkins\workspace\Lucene-Solr-6.x-Windows\solr\build\solr-core\test\J0\temp\solr.handler.TestReqParamsAPI_55EAF178FFA0D4C-001\control-001\cores\collection1\data\index/
    [junit4] 2> 191011 WARN (coreLoadExecutor-367-thread-1-processing-n:127.0.0.1:56000_) [n:127.0.0.1:56000_ c:control_collection s:shard1 r:core_node1 x:collection1] o.a.s.c.SolrCore [collection1] Solr index directory 'C:\Users\jenkins\workspace\Lucene-Solr-6.x-Windows\solr\build\solr-core\test\J0\temp\solr.handler.TestReqParamsAPI_55EAF178FFA0D4C-001\control-001\cores\collection1\data\index' doesn't exist. Creating new index...
    [junit4] 2> 191011 INFO (coreLoadExecutor-367-thread-1-processing-n:127.0.0.1:56000_) [n:127.0.0.1:56000_ c:control_collection s:shard1 r:core_node1 x:collection1] o.a.s.c.CachingDirectoryFactory return new directory for C:\Users\jenkins\workspace\Lucene-Solr-6.x-Windows\solr\build\solr-core\test\J0\temp\solr.handler.TestReqParamsAPI_55EAF178FFA0D4C-001\control-001\cores\collection1\data\index
    [junit4] 2> 191012 INFO (coreLoadExecutor-367-thread-1-processing-n:127.0.0.1:56000_) [n:127.0.0.1:56000_ c:control_collection s:shard1 r:core_node1 x:collection1] o.a.s.u.RandomMergePolicy RandomMergePolicy wrapping class org.apache.lucene.index.LogDocMergePolicy: [LogDocMergePolicy: minMergeSize=1000, mergeFactor=32, maxMergeSize=9223372036854775807, maxMergeSizeForForcedMerge=9223372036854775807, calibrateSizeByDeletes=false, maxMergeDocs=2147483647, maxCFSSegmentSizeMB=8.796093022207999E12, noCFSRatio=0.5667919319789685]
    [junit4] 2> 191137 INFO (coreLoadExecutor-367-thread-1-processing-n:127.0.0.1:56000_) [n:127.0.0.1:56000_ c:control_collection s:shard1 r:core_node1 x:collection1] o.a.s.c.SolrDeletionPolicy SolrDeletionPolicy.onCommit: commits: num=1
    [junit4] 2> commit{dir=MockDirectoryWrapper(RAMDirectory@1409372 lockFactory=org.apache.lucene.store.SingleInstanceLockFactory@616511),segFN=segments_1,generation=1}
    [junit4] 2> 191138 INFO (coreLoadExecutor-367-thread-1-processing-n:127.0.0.1:56000_) [n:127.0.0.1:56000_ c:control_collection s:shard1 r:core_node1 x:collection1] o.a.s.c.SolrDeletionPolicy newest commit generation = 1
    [junit4] 2> 191140 INFO (coreLoadExecutor-367-thread-1-processing-n:127.0.0.1:56000_) [n:127.0.0.1:56000_ c:control_collection s:shard1 r:core_node1 x:collection1] o.a.s.u.p.UpdateRequestProcessorChain creating updateRequestProcessorChain "nodistrib"
    [junit4] 2> 191141 INFO (coreLoadExecutor-367-thread-1-processing-n:127.0.0.1:56000_) [n:127.0.0.1:56000_ c:control_collection s:shard1 r:core_node1 x:collection1] o.a.s.u.p.UpdateRequestProcessorChain creating updateRequestProcessorChain "dedupe"
    [junit4] 2> 191141 INFO (coreLoadExecutor-367-thread-1-processing-n:127.0.0.1:56000_) [n:127.0.0.1:56000_ c:control_collection s:shard1 r:core_node1 x:collection1] o.a.s.u.p.UpdateRequestProcessorChain inserting DistributedUpdateProcessorFactory into updateRequestProcessorChain "dedupe"
    [junit4] 2> 191141 INFO (coreLoadExecutor-367-thread-1-processing-n:127.0.0.1:56000_) [n:127.0.0.1:56000_ c:control_collection s:shard1 r:core_node1 x:collection1] o.a.s.u.p.UpdateRequestProcessorChain creating updateRequestProcessorChain "stored_sig"
    [junit4] 2> 191141 INFO (coreLoadExecutor-367-thread-1-processing-n:127.0.0.1:56000_) [n:127.0.0.1:56000_ c:control_collection s:shard1 r:core_node1 x:collection1] o.a.s.u.p.UpdateRequestProcessorChain inserting DistributedUpdateProcessorFactory into updateRequestProcessorChain "stored_sig"
    [junit4] 2> 191141 INFO (coreLoadExecutor-367-thread-1-processing-n:127.0.0.1:56000_) [n:127.0.0.1:56000_ c:control_collection s:shard1 r:core_node1 x:collection1] o.a.s.u.p.UpdateRequestProcessorChain creating updateRequestProcessorChain "distrib-dup-test-chain-explicit"
    [junit4] 2> 191141 INFO (coreLoadExecutor-367-thread-1-processing-n:127.0.0.1:56000_) [n:127.0.0.1:56000_ c:control_collection s:shard1 r:core_node1 x:collection1] o.a.s.u.p.UpdateRequestProcessorChain creating updateRequestProcessorChain "distrib-dup-test-chain-implicit"
    [junit4] 2> 191141 INFO (coreLoadExecutor-367-thread-1-processing-n:127.0.0.1:56000_) [n:127.0.0.1:56000_ c:control_collection s:shard1 r:core_node1 x:collection1] o.a.s.u.p.UpdateRequestProcessorChain inserting DistributedUpdateProcessorFactory into updateRequestProcessorChain "distrib-dup-test-chain-implicit"
    [junit4] 2> 191141 INFO (coreLoadExecutor-367-thread-1-processing-n:127.0.0.1:56000_) [n:127.0.0.1:56000_ c:control_collection s:shard1 r:core_node1 x:collection1] o.a.s.c.SolrCore no updateRequestProcessorChain defined as default, creating implicit default
    [junit4] 2> 191141 WARN (coreLoadExecutor-367-thread-1-processing-n:127.0.0.1:56000_) [n:127.0.0.1:56000_ c:control_collection s:shard1 r:core_node1 x:collection1] o.a.s.c.RequestHandlers INVALID paramSet a in requestHandler {type = requestHandler,name = /dump,class = DumpRequestHandler,args = {defaults={a=A,b=B}}}
    [junit4] 2> 191146 INFO (coreLoadExecutor-367-thread-1-processing-n:127.0.0.1:56000_) [n:127.0.0.1:56000_ c:control_collection s:shard1 r:core_node1 x:collection1] o.a.s.h.l.XMLLoader xsltCacheLifetimeSeconds=60
    [junit4] 2> 191149 INFO (coreLoadExecutor-367-thread-1-processing-n:127.0.0.1:56000_) [n:127.0.0.1:56000_ c:control_collection s:shard1 r:core_node1 x:collection1] o.a.s.h.l.XMLLoader xsltCacheLifetimeSeconds=60
    [junit4] 2> 191152 INFO (coreLoadExecutor-367-thread-1-processing-n:127.0.0.1:56000_) [n:127.0.0.1:56000_ c:control_collection s:shard1 r:core_node1 x:collection1] o.a.s.h.l.XMLLoader xsltCacheLifetimeSeconds=60
    [junit4] 2> 191154 INFO (coreLoadExecutor-367-thread-1-processing-n:127.0.0.1:56000_) [n:127.0.0.1:56000_ c:control_collection s:shard1 r:core_node1 x:collection1] o.a.s.h.l.XMLLoader xsltCacheLifetimeSeconds=60
    [junit4] 2> 191158 INFO (coreLoadExecutor-367-thread-1-processing-n:127.0.0.1:56000_) [n:127.0.0.1:56000_ c:control_collection s:shard1 r:core_node1 x:collection1] o.a.s.c.RequestHandlers Registered paths: /admin/mbeans,standard,/update/json/docs,/admin/luke,/export,/get,/admin/properties,/update/json,/admin/threads,/dump,/update/csv,/sql,/graph,/admin/segments,/admin/system,/replication,/config,/stream,/schema,/admin/plugins,/admin/logging,/admin/ping,/update,/admin/file
    [junit4] 2> 191158 INFO (coreLoadExecutor-367-thread-1-processing-n:127.0.0.1:56000_) [n:127.0.0.1:56000_ c:control_collection s:shard1 r:core_node1 x:collection1] o.a.s.c.SolrCore Using default statsCache cache: org.apache.solr.search.stats.LocalStatsCache
    [junit4] 2> 191160 INFO (coreLoadExecutor-367-thread-1-processing-n:127.0.0.1:56000_) [n:127.0.0.1:56000_ c:control_collection s:shard1 r:core_node1 x:collection1] o.a.s.u.UpdateHandler Using UpdateLog implementation: org.apache.solr.update.UpdateLog
    [junit4] 2> 191160 INFO (coreLoadExecutor-367-thread-1-processing-n:127.0.0.1:56000_) [n:127.0.0.1:56000_ c:control_collection s:shard1 r:core_node1 x:collection1] o.a.s.u.UpdateLog Initializing UpdateLog: dataDir= defaultSyncLevel=FLUSH numRecordsToKeep=100 maxNumLogsToKeep=10 numVersionBuckets=65536
    [junit4] 2> 191162 INFO (coreLoadExecutor-367-thread-1-processing-n:127.0.0.1:56000_) [n:127.0.0.1:56000_ c:control_collection s:shard1 r:core_node1 x:collection1] o.a.s.u.CommitTracker Hard AutoCommit: disabled
    [junit4] 2> 191162 INFO (coreLoadExecutor-367-thread-1-processing-n:127.0.0.1:56000_) [n:127.0.0.1:56000_ c:control_collection s:shard1 r:core_node1 x:collection1] o.a.s.u.CommitTracker Soft AutoCommit: disabled
    [junit4] 2> 191166 INFO (coreLoadExecutor-367-thread-1-processing-n:127.0.0.1:56000_) [n:127.0.0.1:56000_ c:control_collection s:shard1 r:core_node1 x:collection1] o.a.s.u.RandomMergePolicy RandomMergePolicy wrapping class org.apache.lucene.index.LogDocMergePolicy: [LogDocMergePolicy: minMergeSize=1000, mergeFactor=16, maxMergeSize=9223372036854775807, maxMergeSizeForForcedMerge=9223372036854775807, calibrateSizeByDeletes=true, maxMergeDocs=2147483647, maxCFSSegmentSizeMB=8.796093022207999E12, noCFSRatio=0.3359080627685802]
    [junit4] 2> 191198 INFO (OldIndexDirectoryCleanupThreadForCore-collection1) [n:127.0.0.1:56000_ c:control_collection s:shard1 r:core_node1 x:collection1] o.a.s.c.SolrCore Looking for old index directories to cleanup for core collection1 in C:\Users\jenkins\workspace\Lucene-Solr-6.x-Windows\solr\build\solr-core\test\J0\temp\solr.handler.TestReqParamsAPI_55EAF178FFA0D4C-001\control-001\cores\collection1\data\
    [junit4] 2> 191203 INFO (coreLoadExecutor-367-thread-1-processing-n:127.0.0.1:56000_) [n:127.0.0.1:56000_ c:control_collection s:shard1 r:core_node1 x:collection1] o.a.s.c.SolrDeletionPolicy SolrDeletionPolicy.onInit: commits: num=1
    [junit4] 2> commit{dir=MockDirectoryWrapper(RAMDirectory@1409372 lockFactory=org.apache.lucene.store.SingleInstanceLockFactory@616511),segFN=segments_1,generation=1}
    [junit4] 2> 191203 INFO (coreLoadExecutor-367-thread-1-processing-n:127.0.0.1:56000_) [n:127.0.0.1:56000_ c:control_collection s:shard1 r:core_node1 x:collection1] o.a.s.c.SolrDeletionPolicy newest commit generation = 1
    [junit4] 2> 191204 INFO (coreLoadExecutor-367-thread-1-processing-n:127.0.0.1:56000_) [n:127.0.0.1:56000_ c:control_collection s:shard1 r:core_node1 x:collection1] o.a.s.s.SolrIndexSearcher Opening [Searcher@cd1304[collection1] main]
    [junit4] 2> 191204 INFO (coreLoadExecutor-367-thread-1-processing-n:127.0.0.1:56000_) [n:127.0.0.1:56000_ c:control_collection s:shard1 r:core_node1 x:collection1] o.a.s.c.c.ZkStateReader Load collection config from: [/collections/control_collection]
    [junit4] 2> 191205 INFO (coreLoadExecutor-367-thread-1-processing-n:127.0.0.1:56000_) [n:127.0.0.1:56000_ c:control_collection s:shard1 r:core_node1 x:collection1] o.a.s.c.c.ZkStateReader path=[/collections/control_collection] [configName]=[conf1] specified config exists in ZooKeeper
    [junit4] 2> 191205 INFO (coreLoadExecutor-367-thread-1-processing-n:127.0.0.1:56000_) [n:127.0.0.1:56000_ c:control_collection s:shard1 r:core_node1 x:collection1] o.a.s.r.ManagedResourceStorage Setting up ZooKeeper-based storage for the RestManager with znodeBase: /configs/conf1
    [junit4] 2> 191206 INFO (coreLoadExecutor-367-thread-1-processing-n:127.0.0.1:56000_) [n:127.0.0.1:56000_ c:control_collection s:shard1 r:core_node1 x:collection1] o.a.s.r.ManagedResourceStorage Configured ZooKeeperStorageIO with znodeBase: /configs/conf1
    [junit4] 2> 191206 INFO (coreLoadExecutor-367-thread-1-processing-n:127.0.0.1:56000_) [n:127.0.0.1:56000_ c:control_collection s:shard1 r:core_node1 x:collection1] o.a.s.r.RestManager Initializing RestManager with initArgs: {}
    [junit4] 2> 191206 INFO (coreLoadExecutor-367-thread-1-processing-n:127.0.0.1:56000_) [n:127.0.0.1:56000_ c:control_collection s:shard1 r:core_node1 x:collection1] o.a.s.r.ManagedResourceStorage Reading _rest_managed.json using ZooKeeperStorageIO:path=/configs/conf1
    [junit4] 2> 191207 INFO (coreLoadExecutor-367-thread-1-processing-n:127.0.0.1:56000_) [n:127.0.0.1:56000_ c:control_collection s:shard1 r:core_node1 x:collection1] o.a.s.r.ManagedResourceStorage No data found for znode /configs/conf1/_rest_managed.json
    [junit4] 2> 191207 INFO (coreLoadExecutor-367-thread-1-processing-n:127.0.0.1:56000_) [n:127.0.0.1:56000_ c:control_collection s:shard1 r:core_node1 x:collection1] o.a.s.r.ManagedResourceStorage Loaded null at path _rest_managed.json using ZooKeeperStorageIO:path=/configs/conf1
    [junit4] 2> 191207 INFO (coreLoadExecutor-367-thread-1-processing-n:127.0.0.1:56000_) [n:127.0.0.1:56000_ c:control_collection s:shard1 r:core_node1 x:collection1] o.a.s.r.RestManager Initializing 0 registered ManagedResources
    [junit4] 2> 191207 INFO (coreLoadExecutor-367-thread-1-processing-n:127.0.0.1:56000_) [n:127.0.0.1:56000_ c:control_collection s:shard1 r:core_node1 x:collection1] o.a.s.h.ReplicationHandler Commits will be reserved for 10000
    [junit4] 2> 191207 INFO (searcherExecutor-369-thread-1-processing-n:127.0.0.1:56000_ x:collection1 s:shard1 c:control_collection r:core_node1) [n:127.0.0.1:56000_ c:control_collection s:shard1 r:core_node1 x:collection1] o.a.s.c.SolrCore [collection1] Registered new searcher Searcher@cd1304[collection1] main{ExitableDirectoryReader(UninvertingDirectoryReader())}
    [junit4] 2> 191208 INFO (coreLoadExecutor-367-thread-1-processing-n:127.0.0.1:56000_) [n:127.0.0.1:56000_ c:control_collection s:shard1 r:core_node1 x:collection1] o.a.s.u.UpdateLog Looking up max value of version field to seed version buckets
    [junit4] 2> 191208 INFO (coreLoadExecutor-367-thread-1-processing-n:127.0.0.1:56000_) [n:127.0.0.1:56000_ c:control_collection s:shard1 r:core_node1 x:collection1] o.a.s.u.VersionInfo Refreshing highest value of _version_ for 65536 version buckets from index
    [junit4] 2> 191208 INFO (coreLoadExecutor-367-thread-1-processing-n:127.0.0.1:56000_) [n:127.0.0.1:56000_ c:control_collection s:shard1 r:core_node1 x:collection1] o.a.s.u.VersionInfo No terms found for _version_, cannot seed version bucket highest value from index
    [junit4] 2> 191208 INFO (coreLoadExecutor-367-thread-1-processing-n:127.0.0.1:56000_) [n:127.0.0.1:56000_ c:control_collection s:shard1 r:core_node1 x:collection1] o.a.s.u.UpdateLog Could not find max version in index or recent updates, using new clock 1537219956184186880
    [junit4] 2> 191209 INFO (coreLoadExecutor-367-thread-1-processing-n:127.0.0.1:56000_) [n:127.0.0.1:56000_ c:control_collection s:shard1 r:core_node1 x:collection1] o.a.s.u.UpdateLog Took 1.0ms to seed version buckets with highest version 1537219956184186880
    [junit4] 2> 191210 INFO (coreLoadExecutor-367-thread-1-processing-n:127.0.0.1:56000_) [n:127.0.0.1:56000_ c:control_collection s:shard1 r:core_node1 x:collection1] o.a.s.c.ZkController watch zkdir /configs/conf1
    [junit4] 2> 191210 INFO (coreLoadExecutor-367-thread-1-processing-n:127.0.0.1:56000_) [n:127.0.0.1:56000_ c:control_collection s:shard1 r:core_node1 x:collection1] o.a.s.c.CoreContainer registering core: collection1
    [junit4] 2> 191232 INFO (coreZkRegister-362-thread-1-processing-n:127.0.0.1:56000_ x:collection1 s:shard1 c:control_collection r:core_node1) [n:127.0.0.1:56000_ c:control_collection s:shard1 r:core_node1 x:collection1] o.a.s.c.ZkController Register replica - core:collection1 address:https://127.0.0.1:56000 collection:control_collection shard:shard1
    [junit4] 2> 191233 INFO (coreZkRegister-362-thread-1-processing-n:127.0.0.1:56000_ x:collection1 s:shard1 c:control_collection r:core_node1) [n:127.0.0.1:56000_ c:control_collection s:shard1 r:core_node1 x:collection1] o.a.s.c.c.SolrZkClient makePath: /collections/control_collection/leader_elect/shard1/election
    [junit4] 2> 191238 INFO (coreZkRegister-362-thread-1-processing-n:127.0.0.1:56000_ x:collection1 s:shard1 c:control_collection r:core_node1) [n:127.0.0.1:56000_ c:control_collection s:shard1 r:core_node1 x:collection1] o.a.s.c.LeaderElector Joined leadership election with path: /collections/control_collection/leader_elect/shard1/election/96076247043276805-core_node1-n_0000000000
    [junit4] 2> 191238 INFO (coreZkRegister-362-thread-1-processing-n:127.0.0.1:56000_ x:collection1 s:shard1 c:control_collection r:core_node1) [n:127.0.0.1:56000_ c:control_collection s:shard1 r:core_node1 x:collection1] o.a.s.c.ShardLeaderElectionContext Running the leader process for shard=shard1 and weAreReplacement=false and leaderVoteWait=10000
    [junit4] 2> 191240 INFO (OverseerStateUpdate-96076247043276805-127.0.0.1:56000_-n_0000000000) [n:127.0.0.1:56000_ ] o.a.s.c.Overseer processMessage: queueSize: 1, message = {
    [junit4] 2> "operation":"leader",
    [junit4] 2> "shard":"shard1",
    [junit4] 2> "collection":"control_collection"} current state version: 1
    [junit4] 2> 191242 INFO (zkCallback-207-thread-1-processing-n:127.0.0.1:56000_) [n:127.0.0.1:56000_ ] o.a.s.c.c.ZkStateReader A cluster state change: [WatchedEvent state:SyncConnected type:NodeDataChanged path:/clusterstate.json], has occurred - updating... (live nodes size: [1])
    [junit4] 2> 191246 INFO (coreZkRegister-362-thread-1-processing-n:127.0.0.1:56000_ x:collection1 s:shard1 c:control_collection r:core_node1) [n:127.0.0.1:56000_ c:control_collection s:shard1 r:core_node1 x:collection1] o.a.s.c.ShardLeaderElectionContext Enough replicas found to continue.
    [junit4] 2> 191246 INFO (coreZkRegister-362-thread-1-processing-n:127.0.0.1:56000_ x:collection1 s:shard1 c:control_collection r:core_node1) [n:127.0.0.1:56000_ c:control_collection s:shard1 r:core_node1 x:collection1] o.a.s.c.ShardLeaderElectionContext I may be the new leader - try and sync
    [junit4] 2> 191246 INFO (coreZkRegister-362-thread-1-processing-n:127.0.0.1:56000_ x:collection1 s:shard1 c:control_collection r:core_node1) [n:127.0.0.1:56000_ c:control_collection s:shard1 r:core_node1 x:collection1] o.a.s.c.SyncStrategy Sync replicas to https://127.0.0.1:56000/collection1/
    [junit4] 2> 191246 INFO (coreZkRegister-362-thread-1-processing-n:127.0.0.1:56000_ x:collection1 s:shard1 c:control_collection r:core_node1) [n:127.0.0.1:56000_ c:control_collection s:shard1 r:core_node1 x:collection1] o.a.s.c.SyncStrategy Sync Success - now sync replicas to me
    [junit4] 2> 191246 INFO (coreZkRegister-362-thread-1-processing-n:127.0.0.1:56000_ x:collection1 s:shard1 c:control_collection r:core_node1) [n:127.0.0.1:56000_ c:control_collection s:shard1 r:core_node1 x:collection1] o.a.s.c.SyncStrategy https://127.0.0.1:56000/collection1/ has no replicas
    [junit4] 2> 191247 INFO (coreZkRegister-362-thread-1-processing-n:127.0.0.1:56000_ x:collection1 s:shard1 c:control_collection r:core_node1) [n:127.0.0.1:56000_ c:control_collection s:shard1 r:core_node1 x:collection1] o.a.s.c.c.SolrZkClient makePath: /collections/control_collection/leaders/shard1
    [junit4] 2> 191249 INFO (coreZkRegister-362-thread-1-processing-n:127.0.0.1:56000_ x:collection1 s:shard1 c:control_collection r:core_node1) [n:127.0.0.1:56000_ c:control_collection s:shard1 r:core_node1 x:collection1] o.a.s.c.ShardLeaderElectionContextBase Creating leader registration node /collections/control_collection/leaders/shard1/leader after winning as /collections/control_collection/leader_elect/shard1/election/96076247043276805-core_node1-n_0000000000
    [junit4] 2> 191251 INFO (OverseerStateUpdate-96076247043276805-127.0.0.1:56000_-n_0000000000) [n:127.0.0.1:56000_ ] o.a.s.c.Overseer processMessage: queueSize: 1, message = {
    [junit4] 2> "operation":"leader",
    [junit4] 2> "shard":"shard1",
    [junit4] 2> "collection":"control_collection",
    [junit4] 2> "base_url":"https://127.0.0.1:56000",
    [junit4] 2> "core":"collection1",
    [junit4] 2> "state":"active"} current state version: 2
    [junit4] 2> 191253 INFO (coreZkRegister-362-thread-1-processing-n:127.0.0.1:56000_ x:collection1 s:shard1 c:control_collection r:core_node1) [n:127.0.0.1:56000_ c:control_collection s:shard1 r:core_node1 x:collection1] o.a.s.c.ShardLeaderElectionContext I am the new leader: https://127.0.0.1:56000/collection1/ shard1
    [junit4] 2> 191401 INFO (zkCallback-207-thread-5-processing-n:127.0.0.1:56000_) [n:127.0.0.1:56000_ ] o.a.s.c.c.ZkStateReader A cluster state change: [WatchedEvent state:SyncConnected type:NodeDataChanged path:/clusterstate.json], has occurred - updating... (live nodes size: [1])
    [junit4] 2> 191404 INFO (coreZkRegister-362-thread-1-processing-n:127.0.0.1:56000_ x:collection1 s:shard1 c:control_collection r:core_node1) [n:127.0.0.1:56000_ c:control_collection s:shard1 r:core_node1 x:collection1] o.a.s.c.ZkController We are https://127.0.0.1:56000/collection1/ and leader is https://127.0.0.1:56000/collection1/
    [junit4] 2> 191404 INFO (coreZkRegister-362-thread-1-processing-n:127.0.0.1:56000_ x:collection1 s:shard1 c:control_collection r:core_node1) [n:127.0.0.1:56000_ c:control_collection s:shard1 r:core_node1 x:collection1] o.a.s.c.ZkController No LogReplay needed for core=collection1 baseURL=https://127.0.0.1:56000
    [junit4] 2> 191404 INFO (coreZkRegister-362-thread-1-processing-n:127.0.0.1:56000_ x:collection1 s:shard1 c:control_collection r:core_node1) [n:127.0.0.1:56000_ c:control_collection s:shard1 r:core_node1 x:collection1] o.a.s.c.ZkController I am the leader, no recovery necessary
    [junit4] 2> 191404 INFO (coreZkRegister-362-thread-1-processing-n:127.0.0.1:56000_ x:collection1 s:shard1 c:control_collection r:core_node1) [n:127.0.0.1:56000_ c:control_collection s:shard1 r:core_node1 x:collection1] o.a.s.c.ZkController publishing state=active
    [junit4] 2> 191404 INFO (coreZkRegister-362-thread-1-processing-n:127.0.0.1:56000_ x:collection1 s:shard1 c:control_collection r:core_node1) [n:127.0.0.1:56000_ c:control_collection s:shard1 r:core_node1 x:collection1] o.a.s.c.ZkController numShards not found on descriptor - reading it from system property
    [junit4] 2> 191406 INFO (OverseerStateUpdate-96076247043276805-127.0.0.1:56000_-n_0000000000) [n:127.0.0.1:56000_ ] o.a.s.c.Overseer processMessage: queueSize: 1, message = {
    [junit4] 2> "core":"collection1",
    [junit4] 2> "core_node_name":"core_node1",
    [junit4] 2> "roles":null,
    [junit4] 2> "base_url":"https://127.0.0.1:56000",
    [junit4] 2> "node_name":"127.0.0.1:56000_",
    [junit4] 2> "numShards":"1",
    [junit4] 2> "state":"active",
    [junit4] 2> "shard":"shard1",
    [junit4] 2> "collection":"control_collection",
    [junit4] 2> "operation":"state"} current state version: 3
    [junit4] 2> 191407 INFO (OverseerStateUpdate-96076247043276805-127.0.0.1:56000_-n_0000000000) [n:127.0.0.1:56000_ ] o.a.s.c.o.ReplicaMutator Update state numShards=1 message={
    [junit4] 2> "core":"collection1",
    [junit4] 2> "core_node_name":"core_node1",
    [junit4] 2> "roles":null,
    [junit4] 2> "base_url":"https://127.0.0.1:56000",
    [junit4] 2> "node_name":"127.0.0.1:56000_",
    [junit4] 2> "numShards":"1",
    [junit4] 2> "state":"active",
    [junit4] 2> "shard":"shard1",
    [junit4] 2> "collection":"control_collection",
    [junit4] 2> "operation":"state"}
    [junit4] 2> 191516 INFO (zkCallback-207-thread-6-processing-n:127.0.0.1:56000_) [n:127.0.0.1:56000_ ] o.a.s.c.c.ZkStateReader A cluster state change: [WatchedEvent state:SyncConnected type:NodeDataChanged path:/clusterstate.json], has occurred - updating... (live nodes size: [1])
    [junit4] 2> 191635 INFO (TEST-TestReqParamsAPI.test-seed#[55EAF178FFA0D4C]) [ ] o.a.s.c.s.i.CloudSolrClient Final constructed zkHost string: 127.0.0.1:55990/solr
    [junit4] 2> 191636 INFO (TEST-TestReqParamsAPI.test-seed#[55EAF178FFA0D4C]) [ ] o.a.s.c.c.SolrZkClient Using default ZkCredentialsProvider
    [junit4] 2> 191647 INFO (TEST-TestReqParamsAPI.test-seed#[55EAF178FFA0D4C]) [ ] o.a.s.c.c.ConnectionManager Waiting for client to connect to ZooKeeper
    [junit4] 2> 191665 INFO (zkCallback-211-thread-1) [ ] o.a.s.c.c.ConnectionManager Watcher org.apache.solr.common.cloud.ConnectionManager@1709fb3 name:ZooKeeperConnection Watcher:127.0.0.1:55990/solr got event WatchedEvent state:SyncConnected type:None path:null path:null type:None
    [junit4] 2> 191665 INFO (TEST-TestReqParamsAPI.test-seed#[55EAF178FFA0D4C]) [ ] o.a.s.c.c.ConnectionManager Client is connected to ZooKeeper
    [junit4] 2> 191665 INFO (TEST-TestReqParamsAPI.test-seed#[55EAF178FFA0D4C]) [ ] o.a.s.c.c.SolrZkClient Using default ZkACLProvider
    [junit4] 2> 191665 INFO (TEST-TestReqParamsAPI.test-seed#[55EAF178FFA0D4C]) [ ] o.a.s.c.c.ZkStateReader Updating cluster state from ZooKeeper...
    [junit4] 2> 191668 INFO (TEST-TestReqParamsAPI.test-seed#[55EAF178FFA0D4C]) [ ] o.a.s.c.c.ZkStateReader Loaded cluster properties: {urlScheme=https}
    [junit4] 2> 191669 INFO (TEST-TestReqParamsAPI.test-seed#[55EAF178FFA0D4C]) [ ] o.a.s.c.c.ZkStateReader Updated live nodes from ZooKeeper... (0) -> (1)
    [junit4] 2> 191675 INFO (TEST-TestReqParamsAPI.test-seed#[55EAF178FFA0D4C]) [ ] o.a.s.c.ChaosMonkey monkey: init - expire sessions:false cause connection loss:false
    [junit4] 2> 193022 INFO (TEST-TestReqParamsAPI.test-seed#[55EAF178FFA0D4C]) [ ] o.a.s.SolrTestCaseJ4 Writing core.properties file to C:\Users\jenkins\workspace\Lucene-Solr-6.x-Windows\solr\build\solr-core\test\J0\temp\solr.handler.TestReqParamsAPI_55EAF178FFA0D4C-001\shard-1-001\cores\collection1
    [junit4] 2> 193024 INFO (TEST-TestReqParamsAPI.test-seed#[55EAF178FFA0D4C]) [ ] o.a.s.c.AbstractFullDistribZkTestBase create jetty 1 in directory C:\Users\jenkins\workspace\Lucene-Solr-6.x-Windows\solr\build\solr-core\test\J0\temp\solr.handler.TestReqParamsAPI_55EAF178FFA0D4C-001\shard-1-001
    [junit4] 2> 193033 INFO (TEST-TestReqParamsAPI.test-seed#[55EAF178FFA0D4C]) [ ] o.e.j.s.Server jetty-9.3.8.v20160314
    [junit4] 2> 193034 INFO (TEST-TestReqParamsAPI.test-seed#[55EAF178FFA0D4C]) [ ] o.e.j.s.h.ContextHandler Started o.e.j.s.ServletContextHandler@3c2071{/,null,AVAILABLE}
    [junit4] 2> 193040 INFO (TEST-TestReqParamsAPI.test-seed#[55EAF178FFA0D4C]) [ ] o.e.j.s.ServerConnector Started ServerConnector@3685e9{SSL,[ssl, http/1.1]}{127.0.0.1:56027}
    [junit4] 2> 193041 INFO (TEST-TestReqParamsAPI.test-seed#[55EAF178FFA0D4C]) [ ] o.e.j.s.Server Started @199207ms
    [junit4] 2> 193041 INFO (TEST-TestReqParamsAPI.test-seed#[55EAF178FFA0D4C]) [ ] o.a.s.c.s.e.JettySolrRunner Jetty properties: {solr.data.dir=C:\Users\jenkins\workspace\Lucene-Solr-6.x-Windows\solr\build\solr-core\test\J0\temp\solr.handler.TestReqParamsAPI_55EAF178FFA0D4C-001\tempDir-001/jetty1, solrconfig=solrconfig.xml, hostContext=/, hostPort=56027, coreRootDirectory=C:\Users\jenkins\workspace\Lucene-Solr-6.x-Windows\solr\build\solr-core\test\J0\..\..\..\..\..\..\..\..\..\Users\jenkins\workspace\Lucene-Solr-6.x-Windows\solr\build\solr-core\test\J0\temp\solr.handler.TestReqParamsAPI_55EAF178FFA0D4C-001\shard-1-001\cores}
    [junit4] 2> 193041 INFO (TEST-TestReqParamsAPI.test-seed#[55EAF178FFA0D4C]) [ ] o.a.s.s.SolrDispatchFilter SolrDispatchFilter.init(): sun.misc.Launcher$AppClassLoader@1d16e93
    [junit4] 2> 193041 INFO (TEST-TestReqParamsAPI.test-seed#[55EAF178FFA0D4C]) [ ] o.a.s.c.SolrResourceLoader new SolrResourceLoader for directory: 'C:\Users\jenkins\workspace\Lucene-Solr-6.x-Windows\solr\build\solr-core\test\J0\temp\solr.handler.TestReqParamsAPI_55EAF178FFA0D4C-001\shard-1-001'
    [junit4] 2> 193041 INFO (TEST-TestReqParamsAPI.test-seed#[55EAF178FFA0D4C]) [ ] o.a.s.c.SolrResourceLoader JNDI not configured for solr (NoInitialContextEx)
    [junit4] 2> 193041 INFO (TEST-TestReqParamsAPI.test-seed#[55EAF178FFA0D4C]) [ ] o.a.s.c.SolrResourceLoader solr home defaulted to 'solr/' (could not find system property or JNDI)
    [junit4] 2> 193043 INFO (TEST-TestReqParamsAPI.test-seed#[55EAF178FFA0D4C]) [ ] o.a.s.c.c.SolrZkClient Using default ZkCredentialsProvider
    [junit4] 2> 193043 INFO (TEST-TestReqParamsAPI.test-seed#[55EAF178FFA0D4C]) [ ] o.a.s.c.c.ConnectionManager Waiting for client to connect to ZooKeeper
    [junit4] 2> 193052 INFO (zkCallback-212-thread-1) [ ] o.a.s.c.c.ConnectionManager Watcher org.apache.solr.common.cloud.ConnectionManager@15cd8b3 name:ZooKeeperConnection Watcher:127.0.0.1:55990/solr got event WatchedEvent state:SyncConnected type:None path:null path:null type:None
    [junit4] 2> 193052 INFO (TEST-TestReqParamsAPI.test-seed#[55EAF178FFA0D4C]) [ ] o.a.s.c.c.ConnectionManager Client is connected to ZooKeeper
    [junit4] 2> 193052 INFO (TEST-TestReqParamsAPI.test-seed#[55EAF178FFA0D4C]) [ ] o.a.s.c.c.SolrZkClient Using default ZkACLProvider
    [junit4] 2> 193057 INFO (TEST-TestReqParamsAPI.test-seed#[55EAF178FFA0D4C]) [ ] o.a.s.s.SolrDispatchFilter Loading solr.xml from SolrHome (not found in ZooKeeper)
    [junit4] 2> 193057 INFO (TEST-TestReqParamsAPI.test-seed#[55EAF178FFA0D4C]) [ ] o.a.s.c.SolrXmlConfig Loading container configuration from C:\Users\jenkins\workspace\Lucene-Solr-6.x-Windows\solr\build\solr-core\test\J0\temp\solr.handler.TestReqParamsAPI_55EAF178FFA0D4C-001\shard-1-001\solr.xml
    [junit4] 2> 193067 INFO (TEST-TestReqParamsAPI.test-seed#[55EAF178FFA0D4C]) [ ] o.a.s.c.CorePropertiesLocator Config-defined core root directory: C:\Users\jenkins\workspace\Lucene-Solr-6.x-Windows\solr\build\solr-core\test\J0\..\..\..\..\..\..\..\..\..\Users\jenkins\workspace\Lucene-Solr-6.x-Windows\solr\build\solr-core\test\J0\temp\solr.handler.TestReqParamsAPI_55EAF178FFA0D4C-001\shard-1-001\cores
    [junit4] 2> 193067 INFO (TEST-TestReqParamsAPI.test-seed#[55EAF178FFA0D4C]) [ ] o.a.s.c.CoreContainer New CoreContainer 31982400
    [junit4] 2> 193067 INFO (TEST-TestReqParamsAPI.test-seed#[55EAF178FFA0D4C]) [ ] o.a.s.c.CoreContainer Loading cores into CoreContainer [instanceDir=C:\Users\jenkins\workspace\Lucene-Solr-6.x-Windows\solr\build\solr-core\test\J0\temp\solr.handler.TestReqParamsAPI_55EAF178FFA0D4C-001\shard-1-001]
    [junit4] 2> 193068 WARN (TEST-TestReqParamsAPI.test-seed#[55EAF178FFA0D4C]) [ ] o.a.s.c.CoreContainer Couldn't add files from C:\Users\jenkins\workspace\Lucene-Solr-6.x-Windows\solr\build\solr-core\test\J0\temp\solr.handler.TestReqParamsAPI_55EAF178FFA0D4C-001\shard-1-001\lib to classpath: C:\Users\jenkins\workspace\Lucene-Solr-6.x-Windows\solr\build\solr-core\test\J0\temp\solr.handler.TestReqParamsAPI_55EAF178FFA0D4C-001\shard-1-001\lib
    [junit4] 2> 193069 INFO (TEST-TestReqParamsAPI.test-seed#[55EAF178FFA0D4C]) [ ] o.a.s.h.c.HttpShardHandlerFactory created with socketTimeout : 90000,urlScheme : ,connTimeout : 15000,maxConnectionsPerHost : 20,maxConnections : 10000,corePoolSize : 0,maximumPoolSize : 2147483647,maxThreadIdleTime : 5,sizeOfQueue : -1,fairnessPolicy : false,useRetries : false,
    [junit4] 2> 193078 INFO (TEST-TestReqParamsAPI.test-seed#[55EAF178FFA0D4C]) [ ] o.a.s.u.UpdateShardHandler Creating UpdateShardHandler HTTP client with params: socketTimeout=340000&connTimeout=45000&retry=true
    [junit4] 2> 193079 INFO (TEST-TestReqParamsAPI.test-seed#[55EAF178FFA0D4C]) [ ] o.a.s.l.LogWatcher SLF4J impl is org.slf4j.impl.Log4jLoggerFactory
    [junit4] 2> 193079 INFO (TEST-TestReqParamsAPI.test-seed#[55EAF178FFA0D4C]) [ ] o.a.s.l.LogWatcher Registering Log Listener [Log4j (org.slf4j.impl.Log4jLoggerFactory)]
    [junit4] 2> 193079 INFO (TEST-TestReqParamsAPI.test-seed#[55EAF178FFA0D4C]) [ ] o.a.s.c.ZkContainer Zookeeper client=127.0.0.1:55990/solr
    [junit4] 2> 193079 INFO (TEST-TestReqParamsAPI.test-seed#[55EAF178FFA0D4C]) [ ] o.a.s.c.ZkController zkHost includes chroot
    [junit4] 2> 193079 INFO (TEST-TestReqParamsAPI.test-seed#[55EAF178FFA0D4C]) [ ] o.a.s.c.c.SolrZkClient Using default ZkCredentialsProvider
    [junit4] 2> 193080 INFO (TEST-TestReqParamsAPI.test-seed#[55EAF178FFA0D4C]) [ ] o.a.s.c.c.ConnectionManager Waiting for client to connect to ZooKeeper
    [junit4] 2> 193084 INFO (zkCallback-215-thread-1) [ ] o.a.s.c.c.ConnectionManager Watcher org.apache.solr.common.cloud.ConnectionManager@1a03c18 name:ZooKeeperConnection Watcher:127.0.0.1:55990 got event WatchedEvent state:SyncConnected type:None path:null path:null type:None
    [junit4] 2> 193085 INFO (TEST-TestReqParamsAPI.test-seed#[55EAF178FFA0D4C]) [ ] o.a.s.c.c.ConnectionManager Client is connected to ZooKeeper
    [junit4] 2> 193085 INFO (TEST-TestReqParamsAPI.test-seed#[55EAF178FFA0D4C]) [ ] o.a.s.c.c.SolrZkClient Using default ZkACLProvider
    [junit4] 2> 193086 WARN (NIOServerCxn.Factory:0.0.0.0/0.0.0.0:0) [ ] o.a.z.s.NIOServerCnxn caught end of stream exception
    [junit4] 2> EndOfStreamException: Unable to read additional data from client sessionid 0x15554d6705e0008, likely client has closed socket
    [junit4] 2> at org.apache.zookeeper.server.NIOServerCnxn.doIO(NIOServerCnxn.java:228)
    [junit4] 2> at org.apache.zookeeper.server.NIOServerCnxnFactory.run(NIOServerCnxnFactory.java:208)
    [junit4] 2> at java.lang.Thread.run(Thread.java:745)
    [junit4] 2> 193088 INFO (TEST-TestReqParamsAPI.test-seed#[55EAF178FFA0D4C]) [n:127.0.0.1:56027_ ] o.a.s.c.ZkController Added new OnReconnect listener org.apache.solr.cloud.ZkController$$Lambda$11/16530972@f0ed16
    [junit4] 2> 193090 INFO (TEST-TestReqParamsAPI.test-seed#[55EAF178FFA0D4C]) [n:127.0.0.1:56027_ ] o.a.s.c.c.ConnectionManager Waiting for client to connect to ZooKeeper
    [junit4] 2> 193096 INFO (zkCallback-216-thread-1-processing-n:127.0.0.1:56027_) [n:127.0.0.1:56027_ ] o.a.s.c.c.ConnectionManager Watcher org.apache.solr.common.cloud.ConnectionManager@9e7821 name:ZooKeeperConnection Watcher:127.0.0.1:55990/solr got event WatchedEvent state:SyncConnected type:None path:null path:null type:None
    [junit4] 2> 193096 INFO (TEST-TestReqParamsAPI.test-seed#[55EAF178FFA0D4C]) [n:127.0.0.1:56027_ ] o.a.s.c.c.ConnectionManager Client is connected to ZooKeeper
    [junit4] 2> 193109 INFO (TEST-TestReqParamsAPI.test-seed#[55EAF178FFA0D4C]) [n:127.0.0.1:56027_ ] o.a.s.c.c.ZkStateReader Updating cluster state from ZooKeeper...
    [junit4] 2> 193109 INFO (TEST-TestReqParamsAPI.test-seed#[55EAF178FFA0D4C]) [n:127.0.0.1:56027_ ] o.a.s.c.c.ZkStateReader Loaded cluster properties: {urlScheme=https}
    [junit4] 2> 193109 INFO (TEST-TestReqParamsAPI.test-seed#[55EAF178FFA0D4C]) [n:127.0.0.1:56027_ ] o.a.s.c.c.ZkStateReader Updated live nodes from ZooKeeper... (0) -> (1)
    [junit4] 2> 193113 INFO (TEST-TestReqParamsAPI.test-seed#[55EAF178FFA0D4C]) [n:127.0.0.1:56027_ ] o.a.s.c.Overseer Overseer (id=null) closing
    [junit4] 2> 193113 INFO (TEST-TestReqParamsAPI.test-seed#[55EAF178FFA0D4C]) [n:127.0.0.1:56027_ ] o.a.s.c.LeaderElector Joined leadership election with path: /overseer_elect/election/96076247043276809-127.0.0.1:56027_-n_0000000001
    [junit4] 2> 193115 INFO (TEST-TestReqParamsAPI.test-seed#[55EAF178FFA0D4C]) [n:127.0.0.1:56027_ ] o.a.s.c.LeaderElector Watching path /overseer_elect/election/96076247043276805-127.0.0.1:56000_-n_0000000000 to know if I could be the leader
    [junit4] 2> 193117 INFO (TEST-TestReqParamsAPI.test-seed#[55EAF178FFA0D4C]) [n:127.0.0.1:56027_ ] o.a.s.c.ZkController Publish node=127.0.0.1:56027_ as DOWN
    [junit4] 2> 193119 INFO (OverseerStateUpdate-96076247043276805-127.0.0.1:56000_-n_0000000000) [n:127.0.0.1:56000_ ] o.a.s.c.Overseer processMessage: queueSize: 1, message = {
    [junit4] 2> "operation":"downnode",
    [junit4] 2> "node_name":"127.0.0.1:56027_"} current state version: 4
    [junit4] 2> 193119 INFO (OverseerStateUpdate-96076247043276805-127.0.0.1:56000_-n_0000000000) [n:127.0.0.1:56000_ ] o.a.s.c.o.NodeMutator DownNode state invoked for node: 127.0.0.1:56027_
    [junit4] 2> 193123 INFO (zkCallback-207-thread-3-processing-n:127.0.0.1:56000_) [n:127.0.0.1:56000_ ] o.a.s.c.c.ZkStateReader A cluster state change: [WatchedEvent state:SyncConnected type:NodeDataChanged path:/clusterstate.json], has occurred - updating... (live nodes size: [1])
    [junit4] 2> 193123 INFO (zkCallback-211-thread-1) [ ] o.a.s.c.c.ZkStateReader A cluster state change: [WatchedEvent state:SyncConnected type:NodeDataChanged path:/clusterstate.json], has occurred - updating... (live nodes size: [1])
    [junit4] 2> 193123 INFO (zkCallback-216-thread-1-processing-n:127.0.0.1:56027_) [n:127.0.0.1:56027_ ] o.a.s.c.c.ZkStateReader A cluster state change: [WatchedEvent state:SyncConnected type:NodeDataChanged path:/clusterstate.json], has occurred - updating... (live nodes size: [1])
    [junit4] 2> 194121 INFO (TEST-TestReqParamsAPI.test-seed#[55EAF178FFA0D4C]) [n:127.0.0.1:56027_ ] o.a.s.c.ZkController Register node as live in ZooKeeper:/live_nodes/127.0.0.1:56027_
    [junit4] 2> 194122 INFO (TEST-TestReqParamsAPI.test-seed#[55EAF178FFA0D4C]) [n:127.0.0.1:56027_ ] o.a.s.c.c.SolrZkClient makePath: /live_nodes/127.0.0.1:56027_
    [junit4] 2> 194124 INFO (zkCallback-207-thread-3-processing-n:127.0.0.1:56000_) [n:127.0.0.1:56000_ ] o.a.s.c.c.ZkStateReader A live node change: [WatchedEvent state:SyncConnected type:NodeChildrenChanged path:/live_nodes], has occurred - updating... (live nodes size: [1])
    [junit4] 2> 194124 INFO (zkCallback-211-thread-1) [ ] o.a.s.c.c.ZkStateReader A live node change: [WatchedEvent state:SyncConnected type:NodeChildrenChanged path:/live_nodes], has occurred - updating... (live nodes size: [1])
    [junit4] 2> 194124 INFO (zkCallback-216-thread-1-processing-n:127.0.0.1:56027_) [n:127.0.0.1:56027_ ] o.a.s.c.c.ZkStateReader A live node change: [WatchedEvent state:SyncConnected type:NodeChildrenChanged path:/live_nodes], has occurred - updating... (live nodes size: [1])
    [junit4] 2> 194124 INFO (zkCallback-211-thread-1) [ ] o.a.s.c.c.ZkStateReader Updated live nodes from ZooKeeper... (1) -> (2)
    [junit4] 2> 194126 INFO (zkCallback-216-thread-1-processing-n:127.0.0.1:56027_) [n:127.0.0.1:56027_ ] o.a.s.c.c.ZkStateReader Updated live nodes from ZooKeeper... (1) -> (2)
    [junit4] 2> 194126 INFO (zkCallback-207-thread-3-processing-n:127.0.0.1:56000_) [n:127.0.0.1:56000_ ] o.a.s.c.c.ZkStateReader Updated live nodes from ZooKeeper... (1) -> (2)
    [junit4] 2> 194217 INFO (TEST-TestReqParamsAPI.test-seed#[55EAF178FFA0D4C]) [n:127.0.0.1:56027_ ] o.a.s.c.CoreContainer Security conf doesn't exist. Skipping setup for authorization module.
    [junit4] 2> 194217 INFO (TEST-TestReqParamsAPI.test-seed#[55EAF178FFA0D4C]) [n:127.0.0.1:56027_ ] o.a.s.c.CoreContainer No authentication plugin used.
    [junit4] 2> 194220 INFO (TEST-TestReqParamsAPI.test-seed#[55EAF178FFA0D4C]) [n:127.0.0.1:56027_ ] o.a.s.c.CorePropertiesLocator Looking for core definitions underneath C:\Users\jenkins\workspace\Lucene-Solr-6.x-Windows\solr\build\solr-core\test\J0\..\..\..\..\..\..\..\..\..\Users\jenkins\workspace\Lucene-Solr-6.x-Windows\solr\build\solr-core\test\J0\temp\solr.handler.TestReqParamsAPI_55EAF178FFA0D4C-001\shard-1-001\cores
    [junit4] 2> 194223 INFO (TEST-TestReqParamsAPI.test-seed#[55EAF178FFA0D4C]) [n:127.0.0.1:56027_ ] o.a.s.c.CoreDescriptor Created CoreDescriptor: {name=collection1, config=solrconfig.xml, transient=false, schema=schema.xml, loadOnStartup=true, configSetProperties=configsetprops.json, collection=collection1, coreNodeName=, dataDir=data\, shard=}
    [junit4] 2> 194223 INFO (TEST-TestReqParamsAPI.test-seed#[55EAF178FFA0D4C]) [n:127.0.0.1:56027_ ] o.a.s.c.CorePropertiesLocator Found core collection1 in C:\Users\jenkins\workspace\Lucene-Solr-6.x-Windows\solr\build\solr-core\test\J0\..\..\..\..\..\..\..\..\..\Users\jenkins\workspace\Lucene-Solr-6.x-Windows\solr\build\solr-core\test\J0\temp\solr.handler.TestReqParamsAPI_55EAF178FFA0D4C-001\shard-1-001\cores\collection1
    [junit4] 2> 194223 INFO (TEST-TestReqParamsAPI.test-seed#[55EAF178FFA0D4C]) [n:127.0.0.1:56027_ ] o.a.s.c.CorePropertiesLocator Found 1 core definitions
    [junit4] 2> 194224 INFO (TEST-TestReqParamsAPI.test-seed#[55EAF178FFA0D4C]) [n:127.0.0.1:56027_ ] o.a.s.s.SolrDispatchFilter user.dir=C:\Users\jenkins\workspace\Lucene-Solr-6.x-Windows\solr\build\solr-core\test\J0
    [junit4] 2> 194224 INFO (TEST-TestReqParamsAPI.test-seed#[55EAF178FFA0D4C]) [n:127.0.0.1:56027_ ] o.a.s.s.SolrDispatchFilter SolrDispatchFilter.init() done
    [junit4] 2> 194233 INFO (coreLoadExecutor-379-thread-1-processing-n:127.0.0.1:56027_) [n:127.0.0.1:56027_ c:collection1 x:collection1] o.a.s.c.ZkController publishing state=down
    [junit4] 2> 194233 INFO (coreLoadExecutor-379-thread-1-processing-n:127.0.0.1:56027_) [n:127.0.0.1:56027_ c:collection1 x:collection1] o.a.s.c.ZkController numShards not found on descriptor - reading it from system property
    [junit4] 2> 194234 INFO (coreLoadExecutor-379-thread-1-processing-n:127.0.0.1:56027_) [n:127.0.0.1:56027_ c:collection1 x:collection1] o.a.s.c.ZkController Collection collection1 not visible yet, but flagging it so a watch is registered when it becomes visible
    [junit4] 2> 194236 INFO (OverseerStateUpdate-96076247043276805-127.0.0.1:56000_-n_0000000000) [n:127.0.0.1:56000_ ] o.a.s.c.Overseer processMessage: queueSize: 1, message = {
    [junit4] 2> "core":"collection1",
    [junit4] 2> "roles":null,
    [junit4] 2> "base_url":"https://127.0.0.1:56027",
    [junit4] 2> "node_name":"127.0.0.1:56027_",
    [junit4] 2> "numShards":"2",
    [junit4] 2> "state":"down",
    [junit4] 2> "shard":null,
    [junit4] 2> "collection":"collection1",
    [junit4] 2> "operation":"state"} current state version: 5
    [junit4] 2> 194236 INFO (OverseerStateUpdate-96076247043276805-127.0.0.1:56000_-n_0000000000) [n:127.0.0.1:56000_ ] o.a.s.c.o.ReplicaMutator Update state numShards=2 message={
    [junit4] 2> "core":"collection1",
    [junit4] 2> "roles":null,
    [junit4] 2> "base_url":"https://127.0.0.1:56027",
    [junit4] 2> "node_name":"127.0.0.1:56027_",
    [junit4] 2> "numShards":"2",
    [junit4] 2> "state":"down",
    [junit4] 2> "shard":null,
    [junit4] 2> "collection":"collection1",
    [junit4] 2> "operation":"state"}
    [junit4] 2> 194236 INFO (OverseerStateUpdate-96076247043276805-127.0.0.1:56000_-n_0000000000) [n:127.0.0.1:56000_ ] o.a.s.c.o.ClusterStateMutator building a new cName: collection1
    [junit4] 2> 194236 INFO (OverseerStateUpdate-96076247043276805-127.0.0.1:56000_-n_0000000000) [n:127.0.0.1:56000_ ] o.a.s.c.o.ReplicaMutator Assigning new node to shard shard=shard2
    [junit4] 2> 194236 INFO (coreLoadExecutor-379-thread-1-processing-n:127.0.0.1:56027_) [n:127.0.0.1:56027_ c:collection1 x:collection1] o.a.s.c.c.ZkStateReader Deleting data for [collection1]
    [junit4] 2> 194239 INFO (coreLoadExecutor-379-thread-1-processing-n:127.0.0.1:56027_) [n:127.0.0.1:56027_ c:collection1 x:collection1] o.a.s.c.ZkController look for our core node name
    [junit4] 2> 194346 INFO (zkCallback-207

[...truncated too long message...]

onFieldDocValues, TermsComponentTest, AnalyticsMergeStrategyTest, TestSchemaResource, SuggestComponentTest, RecoveryZkTest, DistributedFacetPivotSmallTest, TestDocBasedVersionConstraints, SpatialHeatmapFacetsTest, StatelessScriptUpdateProcessorFactoryTest, DeleteShardTest, TestInfoStreamLogging, ZkCLITest, DistributedQueryElevationComponentTest, SaslZkACLProviderTest, JSONWriterTest, TestNamedUpdateProcessors, URLClassifyProcessorTest, TestExactStatsCache, DirectUpdateHandlerTest, TestLeaderElectionZkExpiry, TestHashPartitioner, FullHLLTest, TestDynamicLoading, TestRawResponseWriter, TestObjectReleaseTracker, PrimUtilsTest, TestPhraseSuggestions, BigEndianAscendingWordDeserializerTest, CdcrReplicationDistributedZkTest, TestFileDictionaryLookup, AsyncMigrateRouteKeyTest, TestBulkSchemaConcurrent, TestCoreContainer, TestShortCircuitedRequests, TestXmlQParser, JsonLoaderTest, TestDocSet, TestUniqueKeyFieldResource, TestPartialUpdateDeduplication, TestStressReorder, AddBlockUpdateTest, CloudExitableDirectoryReaderTest, HdfsRecoverLeaseTest, ConcurrentDeleteAndCreateCollectionTest, TestCloudBackupRestore, TestFaceting, BooleanFieldTest, XmlUpdateRequestHandlerTest, CursorMarkTest, TestConfigReload, HdfsDirectoryTest, SolrIndexConfigTest, TestFieldCacheReopen, TestCursorMarkWithoutUniqueKey, TestFilteredDocIdSet, PreAnalyzedFieldTest, DocValuesMultiTest, EnumFieldTest, ParsingFieldUpdateProcessorsTest, TestSQLHandler, OverseerTest, SimpleFacetsTest, HdfsUnloadDistributedZkTest, TestHdfsUpdateLog, BasicDistributedZkTest, BasicDistributedZk2Test, SyncSliceTest, ShardRoutingTest, ClusterStateUpdateTest, ZkSolrClientTest, TestRandomDVFaceting, AutoCommitTest, TestDistributedGrouping, ZkControllerTest, TestRealTimeGet, TestJoin, TestStressVersions, DistributedTermsComponentTest, StatsComponentTest, PeerSyncTest, TestFunctionQuery, TestIndexSearcher, HighlighterTest, ShowFileRequestHandlerTest, CurrencyFieldXmlFileTest, SimplePostToolTest, TestCoreDiscovery, AnalysisAfterCoreReloadTest, TestExtendedDismaxParser, SuggesterFSTTest, TestFoldingMultitermQuery, SuggesterTSTTest, TestStressLucene, SuggesterWFSTTest, TestCSVLoader, PolyFieldTest, NoCacheHeaderTest, SolrCoreCheckLockOnStartupTest, TestPseudoReturnFields, TestWordDelimiterFilterFactory, QueryEqualityTest, DirectUpdateHandlerOptimizeTest, DefaultValueUpdateProcessorTest, SortByFunctionTest, TestRemoteStreaming, CacheHeaderTest, IndexBasedSpellCheckerTest, LukeRequestHandlerTest, TermVectorComponentTest, FieldAnalysisRequestHandlerTest, LoggingHandlerTest, SolrPluginUtilsTest, QueryParsingTest, UniqFieldsUpdateProcessorFactoryTest, TestPHPSerializedResponseWriter, TestBinaryResponseWriter, SOLR749Test, TestQuerySenderListener, UpdateParamsTest, AlternateDirectoryTest, TestQuerySenderNoQuery, CopyFieldTest, ResponseLogComponentTest, BadComponentTest, TestStressRecovery, TestMergePolicyConfig, TestBinaryField, TestSearchPerf, TestElisionMultitermQuery, TestConfig, ExternalFileFieldSortTest, TestSolrCoreProperties, NotRequiredUniqueKeyTest, TestCharFilters, TestCodecSupport, EchoParamsTest, TestLMDirichletSimilarityFactory, TestIBSimilarityFactory, TimeZoneUtilsTest, TestFastLRUCache, DateMathParserTest, DateFieldTest, SystemInfoHandlerTest, UUIDFieldTest, DistributedMLTComponentTest, DistributedIntervalFacetingTest, TestSimpleTrackingShardHandler, AsyncCallRequestStatusResponseTest, CdcrReplicationHandlerTest, CdcrRequestHandlerTest, CdcrVersionReplicationTest, CollectionStateFormat2Test, CollectionsAPIAsyncDistributedZkTest, ConnectionManagerTest, CreateCollectionCleanupTest, CustomCollectionTest, DistribJoinFromCollectionTest, DistributedQueueTest, ForceLeaderTest, LeaderFailoverAfterPartitionTest, OverriddenZkACLAndCredentialsProvidersTest, OverseerCollectionConfigSetProcessorTest, OverseerRolesTest, ReplicationFactorTest, RollingRestartTest, SolrCloudExampleTest, TestCloudDeleteByQuery, TestConfigSetsAPI, TestConfigSetsAPIZkFailure, TestCryptoKeys, TestDownShardTolerantSearch, TestLockTree, TestMiniSolrCloudCluster, TestSizeLimitedDistributedMap, TestStressLiveNodes, BlobRepositoryCloudTest, CachingDirectoryFactoryTest, ExitableDirectoryReaderTest, QueryResultKeyTest, TestConfigSets, TestInitParams, TestNRTOpen, RequestLoggingTest, TestBlobHandler, TestRestoreCore, TestSolrConfigHandlerCloud]
    [junit4] 2> NOTE: reproduce with: ant test -Dtestcase=TestSolrConfigHandlerCloud -Dtests.seed=55EAF178FFA0D4C -Dtests.slow=true -Dtests.locale=es -Dtests.timezone=America/Scoresbysund -Dtests.asserts=true -Dtests.file.encoding=US-ASCII
    [junit4] ERROR 0.00s J0 | TestSolrConfigHandlerCloud (suite) <<<
    [junit4] > Throwable #1: com.carrotsearch.randomizedtesting.ThreadLeakError: 3 threads leaked from SUITE scope at org.apache.solr.handler.TestSolrConfigHandlerCloud:
    [junit4] > 1) Thread[id=42013, name=Thread-7270, state=TIMED_WAITING, group=TGRP-TestSolrConfigHandlerCloud]
    [junit4] > at java.lang.Thread.sleep(Native Method)
    [junit4] > at org.apache.solr.cloud.ZkSolrResourceLoader.openResource(ZkSolrResourceLoader.java:101)
    [junit4] > at org.apache.solr.core.SolrResourceLoader.openSchema(SolrResourceLoader.java:333)
    [junit4] > at org.apache.solr.schema.IndexSchemaFactory.create(IndexSchemaFactory.java:48)
    [junit4] > at org.apache.solr.schema.IndexSchemaFactory.buildIndexSchema(IndexSchemaFactory.java:75)
    [junit4] > at org.apache.solr.core.ConfigSetService.createIndexSchema(ConfigSetService.java:107)
    [junit4] > at org.apache.solr.core.ConfigSetService.getConfig(ConfigSetService.java:78)
    [junit4] > at org.apache.solr.core.CoreContainer.reload(CoreContainer.java:911)
    [junit4] > at org.apache.solr.core.SolrCore.lambda$getConfListener$6(SolrCore.java:2509)
    [junit4] > at org.apache.solr.core.SolrCore$$Lambda$53/18224461.run(Unknown Source)
    [junit4] > at org.apache.solr.cloud.ZkController$4.run(ZkController.java:2405)
    [junit4] > 2) Thread[id=41980, name=Thread-7259, state=TIMED_WAITING, group=TGRP-TestSolrConfigHandlerCloud]
    [junit4] > at java.lang.Thread.sleep(Native Method)
    [junit4] > at org.apache.solr.cloud.ZkSolrResourceLoader.openResource(ZkSolrResourceLoader.java:101)
    [junit4] > at org.apache.solr.core.SolrResourceLoader.openSchema(SolrResourceLoader.java:333)
    [junit4] > at org.apache.solr.schema.IndexSchemaFactory.create(IndexSchemaFactory.java:48)
    [junit4] > at org.apache.solr.schema.IndexSchemaFactory.buildIndexSchema(IndexSchemaFactory.java:75)
    [junit4] > at org.apache.solr.core.ConfigSetService.createIndexSchema(ConfigSetService.java:107)
    [junit4] > at org.apache.solr.core.ConfigSetService.getConfig(ConfigSetService.java:78)
    [junit4] > at org.apache.solr.core.CoreContainer.reload(CoreContainer.java:911)
    [junit4] > at org.apache.solr.core.SolrCore.lambda$getConfListener$6(SolrCore.java:2509)
    [junit4] > at org.apache.solr.core.SolrCore$$Lambda$53/18224461.run(Unknown Source)
    [junit4] > at org.apache.solr.cloud.ZkController$4.run(ZkController.java:2405)
    [junit4] > 3) Thread[id=41947, name=Thread-7250, state=TIMED_WAITING, group=TGRP-TestSolrConfigHandlerCloud]
    [junit4] > at java.lang.Thread.sleep(Native Method)
    [junit4] > at org.apache.solr.cloud.ZkSolrResourceLoader.openResource(ZkSolrResourceLoader.java:101)
    [junit4] > at org.apache.solr.core.SolrResourceLoader.openSchema(SolrResourceLoader.java:333)
    [junit4] > at org.apache.solr.schema.IndexSchemaFactory.create(IndexSchemaFactory.java:48)
    [junit4] > at org.apache.solr.schema.IndexSchemaFactory.buildIndexSchema(IndexSchemaFactory.java:75)
    [junit4] > at org.apache.solr.core.ConfigSetService.createIndexSchema(ConfigSetService.java:107)
    [junit4] > at org.apache.solr.core.ConfigSetService.getConfig(ConfigSetService.java:78)
    [junit4] > at org.apache.solr.core.CoreContainer.reload(CoreContainer.java:911)
    [junit4] > at org.apache.solr.core.SolrCore.lambda$getConfListener$6(SolrCore.java:2509)
    [junit4] > at org.apache.solr.core.SolrCore$$Lambda$53/18224461.run(Unknown Source)
    [junit4] > at org.apache.solr.cloud.ZkController$4.run(ZkController.java:2405)
    [junit4] > at __randomizedtesting.SeedInfo.seed([55EAF178FFA0D4C]:0)
    [junit4] Completed [514/615 (2!)] on J0 in 60.38s, 1 test, 1 error <<< FAILURES!

[...truncated 323 lines...]
BUILD FAILED
C:\Users\jenkins\workspace\Lucene-Solr-6.x-Windows\build.xml:740: The following error occurred while executing this line:
C:\Users\jenkins\workspace\Lucene-Solr-6.x-Windows\build.xml:684: The following error occurred while executing this line:
C:\Users\jenkins\workspace\Lucene-Solr-6.x-Windows\build.xml:59: The following error occurred while executing this line:
C:\Users\jenkins\workspace\Lucene-Solr-6.x-Windows\solr\build.xml:233: The following error occurred while executing this line:
C:\Users\jenkins\workspace\Lucene-Solr-6.x-Windows\solr\common-build.xml:531: The following error occurred while executing this line:
C:\Users\jenkins\workspace\Lucene-Solr-6.x-Windows\lucene\common-build.xml:1427: The following error occurred while executing this line:
C:\Users\jenkins\workspace\Lucene-Solr-6.x-Windows\lucene\common-build.xml:984: There were test failures: 615 suites (10 ignored), 2591 tests, 1 suite-level error, 1 failure, 127 ignored (83 assumptions) [seed: 55EAF178FFA0D4C]

Total time: 75 minutes 16 seconds
Build step 'Invoke Ant' marked build as failure
Archiving artifacts
[WARNINGS] Skipping publisher since build result is FAILURE
Recording test results
Email was triggered for: Failure - Any
Sending email for trigger: Failure - Any

Search Discussions

Discussion Posts

Previous

Follow ups

Related Discussions

Discussion Navigation
viewthread | post
posts ‹ prev | 2 of 7 | next ›
Discussion Overview
groupdev @
categorieslucene
postedJun 15, '16 at 5:53a
activeJun 17, '16 at 1:34a
posts7
users3
websitelucene.apache.org

People

Translate

site design / logo © 2017 Grokbase