Grokbase Groups Lucene dev June 2016
FAQ
Build: http://jenkins.thetaphi.de/job/Lucene-Solr-6.1-Linux/41/
Java: 32bit/jdk1.8.0_92 -client -XX:+UseParallelGC

2 tests failed.
FAILED: junit.framework.TestSuite.org.apache.solr.handler.TestReplicationHandler

Error Message:
ObjectTracker found 1 object(s) that were not released!!! [NRTCachingDirectory]

Stack Trace:
java.lang.AssertionError: ObjectTracker found 1 object(s) that were not released!!! [NRTCachingDirectory]
  at __randomizedtesting.SeedInfo.seed([7FC8E61B0B7E2ECC]:0)
  at org.junit.Assert.fail(Assert.java:93)
  at org.junit.Assert.assertTrue(Assert.java:43)
  at org.junit.Assert.assertNull(Assert.java:551)
  at org.apache.solr.SolrTestCaseJ4.teardownTestCases(SolrTestCaseJ4.java:257)
  at sun.reflect.GeneratedMethodAccessor23.invoke(Unknown Source)
  at sun.reflect.DelegatingMethodAccessorImpl.invoke(DelegatingMethodAccessorImpl.java:43)
  at java.lang.reflect.Method.invoke(Method.java:498)
  at com.carrotsearch.randomizedtesting.RandomizedRunner.invoke(RandomizedRunner.java:1764)
  at com.carrotsearch.randomizedtesting.RandomizedRunner$7.evaluate(RandomizedRunner.java:834)
  at com.carrotsearch.randomizedtesting.rules.StatementAdapter.evaluate(StatementAdapter.java:36)
  at com.carrotsearch.randomizedtesting.rules.SystemPropertiesRestoreRule$1.evaluate(SystemPropertiesRestoreRule.java:57)
  at org.apache.lucene.util.AbstractBeforeAfterRule$1.evaluate(AbstractBeforeAfterRule.java:45)
  at com.carrotsearch.randomizedtesting.rules.StatementAdapter.evaluate(StatementAdapter.java:36)
  at org.apache.lucene.util.TestRuleStoreClassName$1.evaluate(TestRuleStoreClassName.java:41)
  at com.carrotsearch.randomizedtesting.rules.NoShadowingOrOverridesOnMethodsRule$1.evaluate(NoShadowingOrOverridesOnMethodsRule.java:40)
  at com.carrotsearch.randomizedtesting.rules.NoShadowingOrOverridesOnMethodsRule$1.evaluate(NoShadowingOrOverridesOnMethodsRule.java:40)
  at com.carrotsearch.randomizedtesting.rules.StatementAdapter.evaluate(StatementAdapter.java:36)
  at com.carrotsearch.randomizedtesting.rules.StatementAdapter.evaluate(StatementAdapter.java:36)
  at com.carrotsearch.randomizedtesting.rules.StatementAdapter.evaluate(StatementAdapter.java:36)
  at org.apache.lucene.util.TestRuleAssertionsRequired$1.evaluate(TestRuleAssertionsRequired.java:53)
  at org.apache.lucene.util.TestRuleMarkFailure$1.evaluate(TestRuleMarkFailure.java:47)
  at org.apache.lucene.util.TestRuleIgnoreAfterMaxFailures$1.evaluate(TestRuleIgnoreAfterMaxFailures.java:64)
  at org.apache.lucene.util.TestRuleIgnoreTestSuites$1.evaluate(TestRuleIgnoreTestSuites.java:54)
  at com.carrotsearch.randomizedtesting.rules.StatementAdapter.evaluate(StatementAdapter.java:36)
  at com.carrotsearch.randomizedtesting.ThreadLeakControl$StatementRunner.run(ThreadLeakControl.java:367)
  at java.lang.Thread.run(Thread.java:745)


FAILED: junit.framework.TestSuite.org.apache.solr.schema.TestManagedSchemaAPI

Error Message:
ObjectTracker found 4 object(s) that were not released!!! [TransactionLog, MDCAwareThreadPoolExecutor, MockDirectoryWrapper, MockDirectoryWrapper]

Stack Trace:
java.lang.AssertionError: ObjectTracker found 4 object(s) that were not released!!! [TransactionLog, MDCAwareThreadPoolExecutor, MockDirectoryWrapper, MockDirectoryWrapper]
  at __randomizedtesting.SeedInfo.seed([7FC8E61B0B7E2ECC]:0)
  at org.junit.Assert.fail(Assert.java:93)
  at org.junit.Assert.assertTrue(Assert.java:43)
  at org.junit.Assert.assertNull(Assert.java:551)
  at org.apache.solr.SolrTestCaseJ4.teardownTestCases(SolrTestCaseJ4.java:257)
  at sun.reflect.GeneratedMethodAccessor23.invoke(Unknown Source)
  at sun.reflect.DelegatingMethodAccessorImpl.invoke(DelegatingMethodAccessorImpl.java:43)
  at java.lang.reflect.Method.invoke(Method.java:498)
  at com.carrotsearch.randomizedtesting.RandomizedRunner.invoke(RandomizedRunner.java:1764)
  at com.carrotsearch.randomizedtesting.RandomizedRunner$7.evaluate(RandomizedRunner.java:834)
  at com.carrotsearch.randomizedtesting.rules.StatementAdapter.evaluate(StatementAdapter.java:36)
  at com.carrotsearch.randomizedtesting.rules.SystemPropertiesRestoreRule$1.evaluate(SystemPropertiesRestoreRule.java:57)
  at org.apache.lucene.util.AbstractBeforeAfterRule$1.evaluate(AbstractBeforeAfterRule.java:45)
  at com.carrotsearch.randomizedtesting.rules.StatementAdapter.evaluate(StatementAdapter.java:36)
  at org.apache.lucene.util.TestRuleStoreClassName$1.evaluate(TestRuleStoreClassName.java:41)
  at com.carrotsearch.randomizedtesting.rules.NoShadowingOrOverridesOnMethodsRule$1.evaluate(NoShadowingOrOverridesOnMethodsRule.java:40)
  at com.carrotsearch.randomizedtesting.rules.NoShadowingOrOverridesOnMethodsRule$1.evaluate(NoShadowingOrOverridesOnMethodsRule.java:40)
  at com.carrotsearch.randomizedtesting.rules.StatementAdapter.evaluate(StatementAdapter.java:36)
  at com.carrotsearch.randomizedtesting.rules.StatementAdapter.evaluate(StatementAdapter.java:36)
  at com.carrotsearch.randomizedtesting.rules.StatementAdapter.evaluate(StatementAdapter.java:36)
  at org.apache.lucene.util.TestRuleAssertionsRequired$1.evaluate(TestRuleAssertionsRequired.java:53)
  at org.apache.lucene.util.TestRuleMarkFailure$1.evaluate(TestRuleMarkFailure.java:47)
  at org.apache.lucene.util.TestRuleIgnoreAfterMaxFailures$1.evaluate(TestRuleIgnoreAfterMaxFailures.java:64)
  at org.apache.lucene.util.TestRuleIgnoreTestSuites$1.evaluate(TestRuleIgnoreTestSuites.java:54)
  at com.carrotsearch.randomizedtesting.rules.StatementAdapter.evaluate(StatementAdapter.java:36)
  at com.carrotsearch.randomizedtesting.ThreadLeakControl$StatementRunner.run(ThreadLeakControl.java:367)
  at java.lang.Thread.run(Thread.java:745)




Build Log:
[...truncated 11564 lines...]
    [junit4] Suite: org.apache.solr.handler.TestReplicationHandler
    [junit4] 2> Creating dataDir: /home/jenkins/workspace/Lucene-Solr-6.1-Linux/solr/build/solr-core/test/J1/temp/solr.handler.TestReplicationHandler_7FC8E61B0B7E2ECC-001/init-core-data-001
    [junit4] 2> 1066840 INFO (SUITE-TestReplicationHandler-seed#[7FC8E61B0B7E2ECC]-worker) [ ] o.a.s.SolrTestCaseJ4 Randomized ssl (false) and clientAuth (false) via: @org.apache.solr.SolrTestCaseJ4$SuppressSSL(bugUrl=None)
    [junit4] 2> 1066843 INFO (TEST-TestReplicationHandler.testRateLimitedReplication-seed#[7FC8E61B0B7E2ECC]) [ ] o.a.s.SolrTestCaseJ4 ###Starting testRateLimitedReplication
    [junit4] 2> 1066843 INFO (TEST-TestReplicationHandler.testRateLimitedReplication-seed#[7FC8E61B0B7E2ECC]) [ ] o.a.s.SolrTestCaseJ4 Writing core.properties file to /home/jenkins/workspace/Lucene-Solr-6.1-Linux/solr/build/solr-core/test/J1/temp/solr.handler.TestReplicationHandler_7FC8E61B0B7E2ECC-001/solr-instance-001/collection1
    [junit4] 2> 1066847 INFO (TEST-TestReplicationHandler.testRateLimitedReplication-seed#[7FC8E61B0B7E2ECC]) [ ] o.e.j.s.Server jetty-9.3.8.v20160314
    [junit4] 2> 1066848 INFO (TEST-TestReplicationHandler.testRateLimitedReplication-seed#[7FC8E61B0B7E2ECC]) [ ] o.e.j.s.h.ContextHandler Started o.e.j.s.ServletContextHandler@1105531{/solr,null,AVAILABLE}
    [junit4] 2> 1066849 INFO (TEST-TestReplicationHandler.testRateLimitedReplication-seed#[7FC8E61B0B7E2ECC]) [ ] o.e.j.s.ServerConnector Started ServerConnector@19acf46{HTTP/1.1,[http/1.1]}{127.0.0.1:46267}
    [junit4] 2> 1066849 INFO (TEST-TestReplicationHandler.testRateLimitedReplication-seed#[7FC8E61B0B7E2ECC]) [ ] o.e.j.s.Server Started @1068156ms
    [junit4] 2> 1066849 INFO (TEST-TestReplicationHandler.testRateLimitedReplication-seed#[7FC8E61B0B7E2ECC]) [ ] o.a.s.c.s.e.JettySolrRunner Jetty properties: {solr.data.dir=/home/jenkins/workspace/Lucene-Solr-6.1-Linux/solr/build/solr-core/test/J1/temp/solr.handler.TestReplicationHandler_7FC8E61B0B7E2ECC-001/solr-instance-001/collection1/data, hostContext=/solr, hostPort=46267}
    [junit4] 2> 1066849 INFO (TEST-TestReplicationHandler.testRateLimitedReplication-seed#[7FC8E61B0B7E2ECC]) [ ] o.a.s.s.SolrDispatchFilter SolrDispatchFilter.init(): sun.misc.Launcher$AppClassLoader@1d16e93
    [junit4] 2> 1066849 INFO (TEST-TestReplicationHandler.testRateLimitedReplication-seed#[7FC8E61B0B7E2ECC]) [ ] o.a.s.c.SolrResourceLoader new SolrResourceLoader for directory: '/home/jenkins/workspace/Lucene-Solr-6.1-Linux/solr/build/solr-core/test/J1/temp/solr.handler.TestReplicationHandler_7FC8E61B0B7E2ECC-001/solr-instance-001'
    [junit4] 2> 1066849 INFO (TEST-TestReplicationHandler.testRateLimitedReplication-seed#[7FC8E61B0B7E2ECC]) [ ] o.a.s.c.SolrResourceLoader JNDI not configured for solr (NoInitialContextEx)
    [junit4] 2> 1066850 INFO (TEST-TestReplicationHandler.testRateLimitedReplication-seed#[7FC8E61B0B7E2ECC]) [ ] o.a.s.c.SolrResourceLoader solr home defaulted to 'solr/' (could not find system property or JNDI)
    [junit4] 2> 1066850 INFO (TEST-TestReplicationHandler.testRateLimitedReplication-seed#[7FC8E61B0B7E2ECC]) [ ] o.a.s.c.SolrXmlConfig Loading container configuration from /home/jenkins/workspace/Lucene-Solr-6.1-Linux/solr/build/solr-core/test/J1/temp/solr.handler.TestReplicationHandler_7FC8E61B0B7E2ECC-001/solr-instance-001/solr.xml
    [junit4] 2> 1066855 INFO (TEST-TestReplicationHandler.testRateLimitedReplication-seed#[7FC8E61B0B7E2ECC]) [ ] o.a.s.c.CorePropertiesLocator Config-defined core root directory: /home/jenkins/workspace/Lucene-Solr-6.1-Linux/solr/build/solr-core/test/J1/temp/solr.handler.TestReplicationHandler_7FC8E61B0B7E2ECC-001/solr-instance-001/.
    [junit4] 2> 1066855 INFO (TEST-TestReplicationHandler.testRateLimitedReplication-seed#[7FC8E61B0B7E2ECC]) [ ] o.a.s.c.CoreContainer New CoreContainer 2223103
    [junit4] 2> 1066855 INFO (TEST-TestReplicationHandler.testRateLimitedReplication-seed#[7FC8E61B0B7E2ECC]) [ ] o.a.s.c.CoreContainer Loading cores into CoreContainer [instanceDir=/home/jenkins/workspace/Lucene-Solr-6.1-Linux/solr/build/solr-core/test/J1/temp/solr.handler.TestReplicationHandler_7FC8E61B0B7E2ECC-001/solr-instance-001]
    [junit4] 2> 1066855 WARN (TEST-TestReplicationHandler.testRateLimitedReplication-seed#[7FC8E61B0B7E2ECC]) [ ] o.a.s.c.CoreContainer Couldn't add files from /home/jenkins/workspace/Lucene-Solr-6.1-Linux/solr/build/solr-core/test/J1/temp/solr.handler.TestReplicationHandler_7FC8E61B0B7E2ECC-001/solr-instance-001/lib to classpath: /home/jenkins/workspace/Lucene-Solr-6.1-Linux/solr/build/solr-core/test/J1/temp/solr.handler.TestReplicationHandler_7FC8E61B0B7E2ECC-001/solr-instance-001/lib
    [junit4] 2> 1066855 INFO (TEST-TestReplicationHandler.testRateLimitedReplication-seed#[7FC8E61B0B7E2ECC]) [ ] o.a.s.h.c.HttpShardHandlerFactory created with socketTimeout : 90000,urlScheme : ,connTimeout : 15000,maxConnectionsPerHost : 20,maxConnections : 10000,corePoolSize : 0,maximumPoolSize : 2147483647,maxThreadIdleTime : 5,sizeOfQueue : -1,fairnessPolicy : false,useRetries : false,
    [junit4] 2> 1066857 INFO (TEST-TestReplicationHandler.testRateLimitedReplication-seed#[7FC8E61B0B7E2ECC]) [ ] o.a.s.u.UpdateShardHandler Creating UpdateShardHandler HTTP client with params: socketTimeout=340000&connTimeout=45000&retry=true
    [junit4] 2> 1066857 INFO (TEST-TestReplicationHandler.testRateLimitedReplication-seed#[7FC8E61B0B7E2ECC]) [ ] o.a.s.l.LogWatcher SLF4J impl is org.slf4j.impl.Log4jLoggerFactory
    [junit4] 2> 1066857 INFO (TEST-TestReplicationHandler.testRateLimitedReplication-seed#[7FC8E61B0B7E2ECC]) [ ] o.a.s.l.LogWatcher Registering Log Listener [Log4j (org.slf4j.impl.Log4jLoggerFactory)]
    [junit4] 2> 1066857 INFO (TEST-TestReplicationHandler.testRateLimitedReplication-seed#[7FC8E61B0B7E2ECC]) [ ] o.a.s.c.CoreContainer Security conf doesn't exist. Skipping setup for authorization module.
    [junit4] 2> 1066857 INFO (TEST-TestReplicationHandler.testRateLimitedReplication-seed#[7FC8E61B0B7E2ECC]) [ ] o.a.s.c.CoreContainer No authentication plugin used.
    [junit4] 2> 1066858 INFO (TEST-TestReplicationHandler.testRateLimitedReplication-seed#[7FC8E61B0B7E2ECC]) [ ] o.a.s.c.CorePropertiesLocator Looking for core definitions underneath /home/jenkins/workspace/Lucene-Solr-6.1-Linux/solr/build/solr-core/test/J1/temp/solr.handler.TestReplicationHandler_7FC8E61B0B7E2ECC-001/solr-instance-001/.
    [junit4] 2> 1066859 INFO (TEST-TestReplicationHandler.testRateLimitedReplication-seed#[7FC8E61B0B7E2ECC]) [ ] o.a.s.c.CoreDescriptor Created CoreDescriptor: {name=collection1, config=solrconfig.xml, loadOnStartup=true, schema=schema.xml, configSetProperties=configsetprops.json, transient=false, dataDir=data/}
    [junit4] 2> 1066859 INFO (TEST-TestReplicationHandler.testRateLimitedReplication-seed#[7FC8E61B0B7E2ECC]) [ ] o.a.s.c.CorePropertiesLocator Found core collection1 in /home/jenkins/workspace/Lucene-Solr-6.1-Linux/solr/build/solr-core/test/J1/temp/solr.handler.TestReplicationHandler_7FC8E61B0B7E2ECC-001/solr-instance-001/./collection1
    [junit4] 2> 1066859 INFO (TEST-TestReplicationHandler.testRateLimitedReplication-seed#[7FC8E61B0B7E2ECC]) [ ] o.a.s.c.CorePropertiesLocator Found 1 core definitions
    [junit4] 2> 1066859 INFO (coreLoadExecutor-3710-thread-1) [ ] o.a.s.c.SolrResourceLoader new SolrResourceLoader for directory: '/home/jenkins/workspace/Lucene-Solr-6.1-Linux/solr/build/solr-core/test/J1/temp/solr.handler.TestReplicationHandler_7FC8E61B0B7E2ECC-001/solr-instance-001/collection1'
    [junit4] 2> 1066859 INFO (coreLoadExecutor-3710-thread-1) [ ] o.a.s.c.SolrResourceLoader JNDI not configured for solr (NoInitialContextEx)
    [junit4] 2> 1066859 INFO (coreLoadExecutor-3710-thread-1) [ ] o.a.s.c.SolrResourceLoader solr home defaulted to 'solr/' (could not find system property or JNDI)
    [junit4] 2> 1066863 INFO (TEST-TestReplicationHandler.testRateLimitedReplication-seed#[7FC8E61B0B7E2ECC]) [ ] o.a.s.s.SolrDispatchFilter user.dir=/home/jenkins/workspace/Lucene-Solr-6.1-Linux/solr/build/solr-core/test/J1
    [junit4] 2> 1066863 INFO (TEST-TestReplicationHandler.testRateLimitedReplication-seed#[7FC8E61B0B7E2ECC]) [ ] o.a.s.s.SolrDispatchFilter SolrDispatchFilter.init() done
    [junit4] 2> 1066865 INFO (coreLoadExecutor-3710-thread-1) [ ] o.a.s.c.SolrConfig current version of requestparams : -1
    [junit4] 2> 1066869 INFO (coreLoadExecutor-3710-thread-1) [ ] o.a.s.c.SolrConfig Using Lucene MatchVersion: 6.1.0
    [junit4] 2> 1066874 INFO (coreLoadExecutor-3710-thread-1) [ ] o.a.s.c.SolrConfig Loaded SolrConfig: solrconfig.xml
    [junit4] 2> 1066877 INFO (coreLoadExecutor-3710-thread-1) [ ] o.a.s.s.IndexSchema [collection1] Schema name=test
    [junit4] 2> 1066879 INFO (coreLoadExecutor-3710-thread-1) [ ] o.a.s.s.IndexSchema unique key field: id
    [junit4] 2> 1066880 INFO (coreLoadExecutor-3710-thread-1) [ ] o.a.s.c.ConfigSetProperties Did not find ConfigSet properties, assuming default properties: Can't find resource 'configsetprops.json' in classpath or '/home/jenkins/workspace/Lucene-Solr-6.1-Linux/solr/build/solr-core/test/J1/temp/solr.handler.TestReplicationHandler_7FC8E61B0B7E2ECC-001/solr-instance-001/collection1'
    [junit4] 2> 1066880 INFO (coreLoadExecutor-3710-thread-1) [ ] o.a.s.c.CoreContainer Creating SolrCore 'collection1' using configuration from instancedir /home/jenkins/workspace/Lucene-Solr-6.1-Linux/solr/build/solr-core/test/J1/temp/solr.handler.TestReplicationHandler_7FC8E61B0B7E2ECC-001/solr-instance-001/./collection1
    [junit4] 2> 1066880 INFO (coreLoadExecutor-3710-thread-1) [ x:collection1] o.a.s.c.SolrCore org.apache.solr.core.MockDirectoryFactory
    [junit4] 2> 1066881 INFO (coreLoadExecutor-3710-thread-1) [ x:collection1] o.a.s.c.SolrCore [[collection1] ] Opening new SolrCore at [/home/jenkins/workspace/Lucene-Solr-6.1-Linux/solr/build/solr-core/test/J1/temp/solr.handler.TestReplicationHandler_7FC8E61B0B7E2ECC-001/solr-instance-001/collection1], dataDir=[/home/jenkins/workspace/Lucene-Solr-6.1-Linux/solr/build/solr-core/test/J1/temp/solr.handler.TestReplicationHandler_7FC8E61B0B7E2ECC-001/solr-instance-001/./collection1/data/]
    [junit4] 2> 1066881 INFO (coreLoadExecutor-3710-thread-1) [ x:collection1] o.a.s.c.SolrCore JMX monitoring not detected for core: collection1
    [junit4] 2> 1066881 INFO (coreLoadExecutor-3710-thread-1) [ x:collection1] o.a.s.c.CachingDirectoryFactory return new directory for /home/jenkins/workspace/Lucene-Solr-6.1-Linux/solr/build/solr-core/test/J1/temp/solr.handler.TestReplicationHandler_7FC8E61B0B7E2ECC-001/solr-instance-001/./collection1/data
    [junit4] 2> 1066881 INFO (coreLoadExecutor-3710-thread-1) [ x:collection1] o.a.s.c.SolrCore New index directory detected: old=null new=/home/jenkins/workspace/Lucene-Solr-6.1-Linux/solr/build/solr-core/test/J1/temp/solr.handler.TestReplicationHandler_7FC8E61B0B7E2ECC-001/solr-instance-001/./collection1/data/index/
    [junit4] 2> 1066882 WARN (coreLoadExecutor-3710-thread-1) [ x:collection1] o.a.s.c.SolrCore [collection1] Solr index directory '/home/jenkins/workspace/Lucene-Solr-6.1-Linux/solr/build/solr-core/test/J1/temp/solr.handler.TestReplicationHandler_7FC8E61B0B7E2ECC-001/solr-instance-001/./collection1/data/index' doesn't exist. Creating new index...
    [junit4] 2> 1066882 INFO (coreLoadExecutor-3710-thread-1) [ x:collection1] o.a.s.c.CachingDirectoryFactory return new directory for /home/jenkins/workspace/Lucene-Solr-6.1-Linux/solr/build/solr-core/test/J1/temp/solr.handler.TestReplicationHandler_7FC8E61B0B7E2ECC-001/solr-instance-001/./collection1/data/index
    [junit4] 2> 1066882 INFO (coreLoadExecutor-3710-thread-1) [ x:collection1] o.a.s.u.RandomMergePolicy RandomMergePolicy wrapping class org.apache.lucene.index.TieredMergePolicy: [TieredMergePolicy: maxMergeAtOnce=13, maxMergeAtOnceExplicit=48, maxMergedSegmentMB=86.2685546875, floorSegmentMB=2.001953125, forceMergeDeletesPctAllowed=8.308009866936768, segmentsPerTier=47.0, maxCFSSegmentSizeMB=8.796093022207999E12, noCFSRatio=0.7211452611192063
    [junit4] 2> 1066882 INFO (coreLoadExecutor-3710-thread-1) [ x:collection1] o.a.s.c.SolrDeletionPolicy SolrDeletionPolicy.onCommit: commits: num=1
    [junit4] 2> commit{dir=MockDirectoryWrapper(RAMDirectory@1dc5554 lockFactory=org.apache.lucene.store.SingleInstanceLockFactory@1f4eb58),segFN=segments_1,generation=1}
    [junit4] 2> 1066883 INFO (coreLoadExecutor-3710-thread-1) [ x:collection1] o.a.s.c.SolrDeletionPolicy newest commit generation = 1
    [junit4] 2> 1066883 INFO (OldIndexDirectoryCleanupThreadForCore-collection1) [ x:collection1] o.a.s.c.SolrCore Looking for old index directories to cleanup for core collection1 in /home/jenkins/workspace/Lucene-Solr-6.1-Linux/solr/build/solr-core/test/J1/temp/solr.handler.TestReplicationHandler_7FC8E61B0B7E2ECC-001/solr-instance-001/./collection1/data/
    [junit4] 2> 1066884 INFO (coreLoadExecutor-3710-thread-1) [ x:collection1] o.a.s.c.SolrCore no updateRequestProcessorChain defined as default, creating implicit default
    [junit4] 2> 1066885 INFO (coreLoadExecutor-3710-thread-1) [ x:collection1] o.a.s.h.l.XMLLoader xsltCacheLifetimeSeconds=60
    [junit4] 2> 1066886 INFO (coreLoadExecutor-3710-thread-1) [ x:collection1] o.a.s.h.l.XMLLoader xsltCacheLifetimeSeconds=60
    [junit4] 2> 1066887 INFO (coreLoadExecutor-3710-thread-1) [ x:collection1] o.a.s.h.l.XMLLoader xsltCacheLifetimeSeconds=60
    [junit4] 2> 1066887 INFO (coreLoadExecutor-3710-thread-1) [ x:collection1] o.a.s.h.l.XMLLoader xsltCacheLifetimeSeconds=60
    [junit4] 2> 1066888 INFO (coreLoadExecutor-3710-thread-1) [ x:collection1] o.a.s.c.PluginBag requestHandler : 'lazy' created with startup=lazy
    [junit4] 2> 1066888 INFO (coreLoadExecutor-3710-thread-1) [ x:collection1] o.a.s.c.RequestHandlers Registered paths: /admin/mbeans,standard,lazy,/update/json/docs,/admin/luke,/export,/get,/admin/properties,/update/json,/admin/threads,/update/csv,/sql,/graph,/admin/segments,/admin/system,/replication,defaults,/config,/stream,/schema,/admin/plugins,/admin/logging,/admin/ping,/update,/admin/file
    [junit4] 2> 1066889 INFO (coreLoadExecutor-3710-thread-1) [ x:collection1] o.a.s.c.SolrCore Using default statsCache cache: org.apache.solr.search.stats.LocalStatsCache
    [junit4] 2> 1066889 INFO (coreLoadExecutor-3710-thread-1) [ x:collection1] o.a.s.u.CommitTracker Hard AutoCommit: disabled
    [junit4] 2> 1066889 INFO (coreLoadExecutor-3710-thread-1) [ x:collection1] o.a.s.u.CommitTracker Soft AutoCommit: disabled
    [junit4] 2> 1066889 INFO (coreLoadExecutor-3710-thread-1) [ x:collection1] o.a.s.u.RandomMergePolicy RandomMergePolicy wrapping class org.apache.lucene.index.LogDocMergePolicy: [LogDocMergePolicy: minMergeSize=1000, mergeFactor=16, maxMergeSize=9223372036854775807, maxMergeSizeForForcedMerge=9223372036854775807, calibrateSizeByDeletes=false, maxMergeDocs=2147483647, maxCFSSegmentSizeMB=8.796093022207999E12, noCFSRatio=0.7263600665751396]
    [junit4] 2> 1066889 INFO (coreLoadExecutor-3710-thread-1) [ x:collection1] o.a.s.c.SolrDeletionPolicy SolrDeletionPolicy.onInit: commits: num=1
    [junit4] 2> commit{dir=MockDirectoryWrapper(RAMDirectory@1dc5554 lockFactory=org.apache.lucene.store.SingleInstanceLockFactory@1f4eb58),segFN=segments_1,generation=1}
    [junit4] 2> 1066889 INFO (coreLoadExecutor-3710-thread-1) [ x:collection1] o.a.s.c.SolrDeletionPolicy newest commit generation = 1
    [junit4] 2> 1066890 INFO (coreLoadExecutor-3710-thread-1) [ x:collection1] o.a.s.s.SolrIndexSearcher Opening [Searcher@db492c[collection1] main]
    [junit4] 2> 1066890 INFO (coreLoadExecutor-3710-thread-1) [ x:collection1] o.a.s.r.ManagedResourceStorage File-based storage initialized to use dir: /home/jenkins/workspace/Lucene-Solr-6.1-Linux/solr/build/solr-core/test/J1/temp/solr.handler.TestReplicationHandler_7FC8E61B0B7E2ECC-001/solr-instance-001/collection1/conf
    [junit4] 2> 1066890 INFO (coreLoadExecutor-3710-thread-1) [ x:collection1] o.a.s.r.RestManager Initializing RestManager with initArgs: {storageDir=/home/jenkins/workspace/Lucene-Solr-6.1-Linux/solr/build/solr-core/test/J1/temp/solr.handler.TestReplicationHandler_7FC8E61B0B7E2ECC-001/solr-instance-001/collection1/conf}
    [junit4] 2> 1066890 INFO (coreLoadExecutor-3710-thread-1) [ x:collection1] o.a.s.r.ManagedResourceStorage Reading _rest_managed.json using file:dir=/home/jenkins/workspace/Lucene-Solr-6.1-Linux/solr/build/solr-core/test/J1/temp/solr.handler.TestReplicationHandler_7FC8E61B0B7E2ECC-001/solr-instance-001/collection1/conf
    [junit4] 2> 1066890 INFO (coreLoadExecutor-3710-thread-1) [ x:collection1] o.a.s.r.RestManager Initializing 0 registered ManagedResources
    [junit4] 2> 1066890 INFO (coreLoadExecutor-3710-thread-1) [ x:collection1] o.a.s.h.ReplicationHandler Replication enabled for following config files: schema.xml,xslt/dummy.xsl
    [junit4] 2> 1066890 INFO (coreLoadExecutor-3710-thread-1) [ x:collection1] o.a.s.h.ReplicationHandler Commits will be reserved for 10000
    [junit4] 2> 1066890 INFO (searcherExecutor-3711-thread-1-processing-x:collection1) [ x:collection1] o.a.s.c.SolrCore [collection1] Registered new searcher Searcher@db492c[collection1] main{ExitableDirectoryReader(UninvertingDirectoryReader())}
    [junit4] 2> 1066891 INFO (coreLoadExecutor-3710-thread-1) [ x:collection1] o.a.s.c.CoreContainer registering core: collection1
    [junit4] 2> 1067364 INFO (TEST-TestReplicationHandler.testRateLimitedReplication-seed#[7FC8E61B0B7E2ECC]) [ ] o.a.s.SolrTestCaseJ4 Writing core.properties file to /home/jenkins/workspace/Lucene-Solr-6.1-Linux/solr/build/solr-core/test/J1/temp/solr.handler.TestReplicationHandler_7FC8E61B0B7E2ECC-001/solr-instance-002/collection1
    [junit4] 2> 1067367 INFO (TEST-TestReplicationHandler.testRateLimitedReplication-seed#[7FC8E61B0B7E2ECC]) [ ] o.e.j.s.Server jetty-9.3.8.v20160314
    [junit4] 2> 1067368 INFO (TEST-TestReplicationHandler.testRateLimitedReplication-seed#[7FC8E61B0B7E2ECC]) [ ] o.e.j.s.h.ContextHandler Started o.e.j.s.ServletContextHandler@4c894f{/solr,null,AVAILABLE}
    [junit4] 2> 1067369 INFO (TEST-TestReplicationHandler.testRateLimitedReplication-seed#[7FC8E61B0B7E2ECC]) [ ] o.e.j.s.ServerConnector Started ServerConnector@1dec636{HTTP/1.1,[http/1.1]}{127.0.0.1:44188}
    [junit4] 2> 1067369 INFO (TEST-TestReplicationHandler.testRateLimitedReplication-seed#[7FC8E61B0B7E2ECC]) [ ] o.e.j.s.Server Started @1068676ms
    [junit4] 2> 1067369 INFO (TEST-TestReplicationHandler.testRateLimitedReplication-seed#[7FC8E61B0B7E2ECC]) [ ] o.a.s.c.s.e.JettySolrRunner Jetty properties: {solr.data.dir=/home/jenkins/workspace/Lucene-Solr-6.1-Linux/solr/build/solr-core/test/J1/temp/solr.handler.TestReplicationHandler_7FC8E61B0B7E2ECC-001/solr-instance-002/collection1/data, hostContext=/solr, hostPort=44188}
    [junit4] 2> 1067369 INFO (TEST-TestReplicationHandler.testRateLimitedReplication-seed#[7FC8E61B0B7E2ECC]) [ ] o.a.s.s.SolrDispatchFilter SolrDispatchFilter.init(): sun.misc.Launcher$AppClassLoader@1d16e93
    [junit4] 2> 1067369 INFO (TEST-TestReplicationHandler.testRateLimitedReplication-seed#[7FC8E61B0B7E2ECC]) [ ] o.a.s.c.SolrResourceLoader new SolrResourceLoader for directory: '/home/jenkins/workspace/Lucene-Solr-6.1-Linux/solr/build/solr-core/test/J1/temp/solr.handler.TestReplicationHandler_7FC8E61B0B7E2ECC-001/solr-instance-002'
    [junit4] 2> 1067370 INFO (TEST-TestReplicationHandler.testRateLimitedReplication-seed#[7FC8E61B0B7E2ECC]) [ ] o.a.s.c.SolrResourceLoader JNDI not configured for solr (NoInitialContextEx)
    [junit4] 2> 1067370 INFO (TEST-TestReplicationHandler.testRateLimitedReplication-seed#[7FC8E61B0B7E2ECC]) [ ] o.a.s.c.SolrResourceLoader solr home defaulted to 'solr/' (could not find system property or JNDI)
    [junit4] 2> 1067370 INFO (TEST-TestReplicationHandler.testRateLimitedReplication-seed#[7FC8E61B0B7E2ECC]) [ ] o.a.s.c.SolrXmlConfig Loading container configuration from /home/jenkins/workspace/Lucene-Solr-6.1-Linux/solr/build/solr-core/test/J1/temp/solr.handler.TestReplicationHandler_7FC8E61B0B7E2ECC-001/solr-instance-002/solr.xml
    [junit4] 2> 1067374 INFO (TEST-TestReplicationHandler.testRateLimitedReplication-seed#[7FC8E61B0B7E2ECC]) [ ] o.a.s.c.CorePropertiesLocator Config-defined core root directory: /home/jenkins/workspace/Lucene-Solr-6.1-Linux/solr/build/solr-core/test/J1/temp/solr.handler.TestReplicationHandler_7FC8E61B0B7E2ECC-001/solr-instance-002/.
    [junit4] 2> 1067374 INFO (TEST-TestReplicationHandler.testRateLimitedReplication-seed#[7FC8E61B0B7E2ECC]) [ ] o.a.s.c.CoreContainer New CoreContainer 19772436
    [junit4] 2> 1067374 INFO (TEST-TestReplicationHandler.testRateLimitedReplication-seed#[7FC8E61B0B7E2ECC]) [ ] o.a.s.c.CoreContainer Loading cores into CoreContainer [instanceDir=/home/jenkins/workspace/Lucene-Solr-6.1-Linux/solr/build/solr-core/test/J1/temp/solr.handler.TestReplicationHandler_7FC8E61B0B7E2ECC-001/solr-instance-002]
    [junit4] 2> 1067374 WARN (TEST-TestReplicationHandler.testRateLimitedReplication-seed#[7FC8E61B0B7E2ECC]) [ ] o.a.s.c.CoreContainer Couldn't add files from /home/jenkins/workspace/Lucene-Solr-6.1-Linux/solr/build/solr-core/test/J1/temp/solr.handler.TestReplicationHandler_7FC8E61B0B7E2ECC-001/solr-instance-002/lib to classpath: /home/jenkins/workspace/Lucene-Solr-6.1-Linux/solr/build/solr-core/test/J1/temp/solr.handler.TestReplicationHandler_7FC8E61B0B7E2ECC-001/solr-instance-002/lib
    [junit4] 2> 1067374 INFO (TEST-TestReplicationHandler.testRateLimitedReplication-seed#[7FC8E61B0B7E2ECC]) [ ] o.a.s.h.c.HttpShardHandlerFactory created with socketTimeout : 90000,urlScheme : ,connTimeout : 15000,maxConnectionsPerHost : 20,maxConnections : 10000,corePoolSize : 0,maximumPoolSize : 2147483647,maxThreadIdleTime : 5,sizeOfQueue : -1,fairnessPolicy : false,useRetries : false,
    [junit4] 2> 1067375 INFO (TEST-TestReplicationHandler.testRateLimitedReplication-seed#[7FC8E61B0B7E2ECC]) [ ] o.a.s.u.UpdateShardHandler Creating UpdateShardHandler HTTP client with params: socketTimeout=340000&connTimeout=45000&retry=true
    [junit4] 2> 1067375 INFO (TEST-TestReplicationHandler.testRateLimitedReplication-seed#[7FC8E61B0B7E2ECC]) [ ] o.a.s.l.LogWatcher SLF4J impl is org.slf4j.impl.Log4jLoggerFactory
    [junit4] 2> 1067375 INFO (TEST-TestReplicationHandler.testRateLimitedReplication-seed#[7FC8E61B0B7E2ECC]) [ ] o.a.s.l.LogWatcher Registering Log Listener [Log4j (org.slf4j.impl.Log4jLoggerFactory)]
    [junit4] 2> 1067376 INFO (TEST-TestReplicationHandler.testRateLimitedReplication-seed#[7FC8E61B0B7E2ECC]) [ ] o.a.s.c.CoreContainer Security conf doesn't exist. Skipping setup for authorization module.
    [junit4] 2> 1067376 INFO (TEST-TestReplicationHandler.testRateLimitedReplication-seed#[7FC8E61B0B7E2ECC]) [ ] o.a.s.c.CoreContainer No authentication plugin used.
    [junit4] 2> 1067376 INFO (TEST-TestReplicationHandler.testRateLimitedReplication-seed#[7FC8E61B0B7E2ECC]) [ ] o.a.s.c.CorePropertiesLocator Looking for core definitions underneath /home/jenkins/workspace/Lucene-Solr-6.1-Linux/solr/build/solr-core/test/J1/temp/solr.handler.TestReplicationHandler_7FC8E61B0B7E2ECC-001/solr-instance-002/.
    [junit4] 2> 1067377 INFO (TEST-TestReplicationHandler.testRateLimitedReplication-seed#[7FC8E61B0B7E2ECC]) [ ] o.a.s.c.CoreDescriptor Created CoreDescriptor: {name=collection1, config=solrconfig.xml, loadOnStartup=true, schema=schema.xml, configSetProperties=configsetprops.json, transient=false, dataDir=data/}
    [junit4] 2> 1067377 INFO (TEST-TestReplicationHandler.testRateLimitedReplication-seed#[7FC8E61B0B7E2ECC]) [ ] o.a.s.c.CorePropertiesLocator Found core collection1 in /home/jenkins/workspace/Lucene-Solr-6.1-Linux/solr/build/solr-core/test/J1/temp/solr.handler.TestReplicationHandler_7FC8E61B0B7E2ECC-001/solr-instance-002/./collection1
    [junit4] 2> 1067377 INFO (TEST-TestReplicationHandler.testRateLimitedReplication-seed#[7FC8E61B0B7E2ECC]) [ ] o.a.s.c.CorePropertiesLocator Found 1 core definitions
    [junit4] 2> 1067378 INFO (coreLoadExecutor-3720-thread-1) [ ] o.a.s.c.SolrResourceLoader new SolrResourceLoader for directory: '/home/jenkins/workspace/Lucene-Solr-6.1-Linux/solr/build/solr-core/test/J1/temp/solr.handler.TestReplicationHandler_7FC8E61B0B7E2ECC-001/solr-instance-002/collection1'
    [junit4] 2> 1067378 INFO (coreLoadExecutor-3720-thread-1) [ ] o.a.s.c.SolrResourceLoader JNDI not configured for solr (NoInitialContextEx)
    [junit4] 2> 1067378 INFO (coreLoadExecutor-3720-thread-1) [ ] o.a.s.c.SolrResourceLoader solr home defaulted to 'solr/' (could not find system property or JNDI)
    [junit4] 2> 1067378 INFO (TEST-TestReplicationHandler.testRateLimitedReplication-seed#[7FC8E61B0B7E2ECC]) [ ] o.a.s.s.SolrDispatchFilter user.dir=/home/jenkins/workspace/Lucene-Solr-6.1-Linux/solr/build/solr-core/test/J1
    [junit4] 2> 1067378 INFO (TEST-TestReplicationHandler.testRateLimitedReplication-seed#[7FC8E61B0B7E2ECC]) [ ] o.a.s.s.SolrDispatchFilter SolrDispatchFilter.init() done
    [junit4] 2> 1067383 INFO (coreLoadExecutor-3720-thread-1) [ ] o.a.s.c.SolrConfig current version of requestparams : -1
    [junit4] 2> 1067386 INFO (coreLoadExecutor-3720-thread-1) [ ] o.a.s.c.SolrConfig Using Lucene MatchVersion: 6.1.0
    [junit4] 2> 1067391 INFO (coreLoadExecutor-3720-thread-1) [ ] o.a.s.c.SolrConfig Loaded SolrConfig: solrconfig.xml
    [junit4] 2> 1067394 INFO (coreLoadExecutor-3720-thread-1) [ ] o.a.s.s.IndexSchema [collection1] Schema name=test
    [junit4] 2> 1067396 INFO (coreLoadExecutor-3720-thread-1) [ ] o.a.s.s.IndexSchema unique key field: id
    [junit4] 2> 1067397 INFO (coreLoadExecutor-3720-thread-1) [ ] o.a.s.c.ConfigSetProperties Did not find ConfigSet properties, assuming default properties: Can't find resource 'configsetprops.json' in classpath or '/home/jenkins/workspace/Lucene-Solr-6.1-Linux/solr/build/solr-core/test/J1/temp/solr.handler.TestReplicationHandler_7FC8E61B0B7E2ECC-001/solr-instance-002/collection1'
    [junit4] 2> 1067398 INFO (coreLoadExecutor-3720-thread-1) [ ] o.a.s.c.CoreContainer Creating SolrCore 'collection1' using configuration from instancedir /home/jenkins/workspace/Lucene-Solr-6.1-Linux/solr/build/solr-core/test/J1/temp/solr.handler.TestReplicationHandler_7FC8E61B0B7E2ECC-001/solr-instance-002/./collection1
    [junit4] 2> 1067398 INFO (coreLoadExecutor-3720-thread-1) [ x:collection1] o.a.s.c.SolrCore org.apache.solr.core.MockDirectoryFactory
    [junit4] 2> 1067398 INFO (coreLoadExecutor-3720-thread-1) [ x:collection1] o.a.s.c.SolrCore [[collection1] ] Opening new SolrCore at [/home/jenkins/workspace/Lucene-Solr-6.1-Linux/solr/build/solr-core/test/J1/temp/solr.handler.TestReplicationHandler_7FC8E61B0B7E2ECC-001/solr-instance-002/collection1], dataDir=[/home/jenkins/workspace/Lucene-Solr-6.1-Linux/solr/build/solr-core/test/J1/temp/solr.handler.TestReplicationHandler_7FC8E61B0B7E2ECC-001/solr-instance-002/./collection1/data/]
    [junit4] 2> 1067398 INFO (coreLoadExecutor-3720-thread-1) [ x:collection1] o.a.s.c.SolrCore JMX monitoring not detected for core: collection1
    [junit4] 2> 1067399 INFO (coreLoadExecutor-3720-thread-1) [ x:collection1] o.a.s.c.CachingDirectoryFactory return new directory for /home/jenkins/workspace/Lucene-Solr-6.1-Linux/solr/build/solr-core/test/J1/temp/solr.handler.TestReplicationHandler_7FC8E61B0B7E2ECC-001/solr-instance-002/./collection1/data
    [junit4] 2> 1067399 INFO (coreLoadExecutor-3720-thread-1) [ x:collection1] o.a.s.c.SolrCore New index directory detected: old=null new=/home/jenkins/workspace/Lucene-Solr-6.1-Linux/solr/build/solr-core/test/J1/temp/solr.handler.TestReplicationHandler_7FC8E61B0B7E2ECC-001/solr-instance-002/./collection1/data/index/
    [junit4] 2> 1067399 WARN (coreLoadExecutor-3720-thread-1) [ x:collection1] o.a.s.c.SolrCore [collection1] Solr index directory '/home/jenkins/workspace/Lucene-Solr-6.1-Linux/solr/build/solr-core/test/J1/temp/solr.handler.TestReplicationHandler_7FC8E61B0B7E2ECC-001/solr-instance-002/./collection1/data/index' doesn't exist. Creating new index...
    [junit4] 2> 1067399 INFO (coreLoadExecutor-3720-thread-1) [ x:collection1] o.a.s.c.CachingDirectoryFactory return new directory for /home/jenkins/workspace/Lucene-Solr-6.1-Linux/solr/build/solr-core/test/J1/temp/solr.handler.TestReplicationHandler_7FC8E61B0B7E2ECC-001/solr-instance-002/./collection1/data/index
    [junit4] 2> 1067400 INFO (coreLoadExecutor-3720-thread-1) [ x:collection1] o.a.s.u.RandomMergePolicy RandomMergePolicy wrapping class org.apache.lucene.index.TieredMergePolicy: [TieredMergePolicy: maxMergeAtOnce=13, maxMergeAtOnceExplicit=48, maxMergedSegmentMB=86.2685546875, floorSegmentMB=2.001953125, forceMergeDeletesPctAllowed=8.308009866936768, segmentsPerTier=47.0, maxCFSSegmentSizeMB=8.796093022207999E12, noCFSRatio=0.7211452611192063
    [junit4] 2> 1067400 INFO (coreLoadExecutor-3720-thread-1) [ x:collection1] o.a.s.c.SolrDeletionPolicy SolrDeletionPolicy.onCommit: commits: num=1
    [junit4] 2> commit{dir=MockDirectoryWrapper(RAMDirectory@1911424 lockFactory=org.apache.lucene.store.SingleInstanceLockFactory@1f8f8b1),segFN=segments_1,generation=1}
    [junit4] 2> 1067400 INFO (coreLoadExecutor-3720-thread-1) [ x:collection1] o.a.s.c.SolrDeletionPolicy newest commit generation = 1
    [junit4] 2> 1067400 INFO (OldIndexDirectoryCleanupThreadForCore-collection1) [ x:collection1] o.a.s.c.SolrCore Looking for old index directories to cleanup for core collection1 in /home/jenkins/workspace/Lucene-Solr-6.1-Linux/solr/build/solr-core/test/J1/temp/solr.handler.TestReplicationHandler_7FC8E61B0B7E2ECC-001/solr-instance-002/./collection1/data/
    [junit4] 2> 1067402 INFO (coreLoadExecutor-3720-thread-1) [ x:collection1] o.a.s.c.SolrCore no updateRequestProcessorChain defined as default, creating implicit default
    [junit4] 2> 1067403 INFO (coreLoadExecutor-3720-thread-1) [ x:collection1] o.a.s.h.l.XMLLoader xsltCacheLifetimeSeconds=60
    [junit4] 2> 1067404 INFO (coreLoadExecutor-3720-thread-1) [ x:collection1] o.a.s.h.l.XMLLoader xsltCacheLifetimeSeconds=60
    [junit4] 2> 1067405 INFO (coreLoadExecutor-3720-thread-1) [ x:collection1] o.a.s.h.l.XMLLoader xsltCacheLifetimeSeconds=60
    [junit4] 2> 1067405 INFO (coreLoadExecutor-3720-thread-1) [ x:collection1] o.a.s.h.l.XMLLoader xsltCacheLifetimeSeconds=60
    [junit4] 2> 1067406 INFO (coreLoadExecutor-3720-thread-1) [ x:collection1] o.a.s.c.PluginBag requestHandler : 'lazy' created with startup=lazy
    [junit4] 2> 1067406 INFO (coreLoadExecutor-3720-thread-1) [ x:collection1] o.a.s.c.RequestHandlers Registered paths: /admin/mbeans,standard,lazy,/update/json/docs,/admin/luke,/export,/get,/admin/properties,/update/json,/admin/threads,/update/csv,/sql,/graph,/admin/segments,/admin/system,/replication,defaults,/config,/stream,/schema,/admin/plugins,/admin/logging,/admin/ping,/update,/admin/file
    [junit4] 2> 1067406 INFO (coreLoadExecutor-3720-thread-1) [ x:collection1] o.a.s.c.SolrCore Using default statsCache cache: org.apache.solr.search.stats.LocalStatsCache
    [junit4] 2> 1067407 INFO (coreLoadExecutor-3720-thread-1) [ x:collection1] o.a.s.u.CommitTracker Hard AutoCommit: disabled
    [junit4] 2> 1067407 INFO (coreLoadExecutor-3720-thread-1) [ x:collection1] o.a.s.u.CommitTracker Soft AutoCommit: disabled
    [junit4] 2> 1067407 INFO (coreLoadExecutor-3720-thread-1) [ x:collection1] o.a.s.u.RandomMergePolicy RandomMergePolicy wrapping class org.apache.lucene.index.LogDocMergePolicy: [LogDocMergePolicy: minMergeSize=1000, mergeFactor=16, maxMergeSize=9223372036854775807, maxMergeSizeForForcedMerge=9223372036854775807, calibrateSizeByDeletes=false, maxMergeDocs=2147483647, maxCFSSegmentSizeMB=8.796093022207999E12, noCFSRatio=0.7263600665751396]
    [junit4] 2> 1067407 INFO (coreLoadExecutor-3720-thread-1) [ x:collection1] o.a.s.c.SolrDeletionPolicy SolrDeletionPolicy.onInit: commits: num=1
    [junit4] 2> commit{dir=MockDirectoryWrapper(RAMDirectory@1911424 lockFactory=org.apache.lucene.store.SingleInstanceLockFactory@1f8f8b1),segFN=segments_1,generation=1}
    [junit4] 2> 1067407 INFO (coreLoadExecutor-3720-thread-1) [ x:collection1] o.a.s.c.SolrDeletionPolicy newest commit generation = 1
    [junit4] 2> 1067407 INFO (coreLoadExecutor-3720-thread-1) [ x:collection1] o.a.s.s.SolrIndexSearcher Opening [Searcher@fd17ca[collection1] main]
    [junit4] 2> 1067408 INFO (coreLoadExecutor-3720-thread-1) [ x:collection1] o.a.s.r.ManagedResourceStorage File-based storage initialized to use dir: /home/jenkins/workspace/Lucene-Solr-6.1-Linux/solr/build/solr-core/test/J1/temp/solr.handler.TestReplicationHandler_7FC8E61B0B7E2ECC-001/solr-instance-002/collection1/conf
    [junit4] 2> 1067408 INFO (coreLoadExecutor-3720-thread-1) [ x:collection1] o.a.s.r.RestManager Initializing RestManager with initArgs: {storageDir=/home/jenkins/workspace/Lucene-Solr-6.1-Linux/solr/build/solr-core/test/J1/temp/solr.handler.TestReplicationHandler_7FC8E61B0B7E2ECC-001/solr-instance-002/collection1/conf}
    [junit4] 2> 1067408 INFO (coreLoadExecutor-3720-thread-1) [ x:collection1] o.a.s.r.ManagedResourceStorage Reading _rest_managed.json using file:dir=/home/jenkins/workspace/Lucene-Solr-6.1-Linux/solr/build/solr-core/test/J1/temp/solr.handler.TestReplicationHandler_7FC8E61B0B7E2ECC-001/solr-instance-002/collection1/conf
    [junit4] 2> 1067408 INFO (coreLoadExecutor-3720-thread-1) [ x:collection1] o.a.s.r.RestManager Initializing 0 registered ManagedResources
    [junit4] 2> 1067410 INFO (coreLoadExecutor-3720-thread-1) [ x:collection1] o.a.s.h.ReplicationHandler Poll scheduled at an interval of 1000ms
    [junit4] 2> 1067410 INFO (searcherExecutor-3721-thread-1-processing-x:collection1) [ x:collection1] o.a.s.c.SolrCore [collection1] Registered new searcher Searcher@fd17ca[collection1] main{ExitableDirectoryReader(UninvertingDirectoryReader())}
    [junit4] 2> 1067410 INFO (coreLoadExecutor-3720-thread-1) [ x:collection1] o.a.s.c.CoreContainer registering core: collection1
    [junit4] 2> 1067451 INFO (qtp28368041-7540) [ x:collection1] o.a.s.c.S.Request [collection1] webapp=/solr path=/replication params={qt=/replication&wt=javabin&version=2&command=indexversion} status=0 QTime=0
    [junit4] 2> 1067881 INFO (qtp28368041-7542) [ x:collection1] o.a.s.u.DirectUpdateHandler2 [collection1] REMOVING ALL DOCUMENTS FROM INDEX
    [junit4] 2> 1067881 INFO (qtp28368041-7542) [ x:collection1] o.a.s.u.p.LogUpdateProcessorFactory [collection1] webapp=/solr path=/update params={wt=javabin&version=2}{deleteByQuery=*:*} 0 0
    [junit4] 2> 1067882 INFO (qtp7442040-7557) [ x:collection1] o.a.s.u.DirectUpdateHandler2 [collection1] REMOVING ALL DOCUMENTS FROM INDEX
    [junit4] 2> 1067883 INFO (qtp7442040-7557) [ x:collection1] o.a.s.u.p.LogUpdateProcessorFactory [collection1] webapp=/solr path=/update params={wt=javabin&version=2}{deleteByQuery=*:*} 0 0
    [junit4] 2> 1067885 INFO (qtp28368041-7535) [ x:collection1] o.a.s.u.DirectUpdateHandler2 start commit{,optimize=false,openSearcher=true,waitSearcher=true,expungeDeletes=false,softCommit=false,prepareCommit=false}
    [junit4] 2> 1067886 INFO (qtp28368041-7535) [ x:collection1] o.a.s.c.SolrDeletionPolicy SolrDeletionPolicy.onCommit: commits: num=2
    [junit4] 2> commit{dir=MockDirectoryWrapper(RAMDirectory@1dc5554 lockFactory=org.apache.lucene.store.SingleInstanceLockFactory@1f4eb58),segFN=segments_1,generation=1}
    [junit4] 2> commit{dir=MockDirectoryWrapper(RAMDirectory@1dc5554 lockFactory=org.apache.lucene.store.SingleInstanceLockFactory@1f4eb58),segFN=segments_2,generation=2}
    [junit4] 2> 1067886 INFO (qtp28368041-7535) [ x:collection1] o.a.s.c.SolrDeletionPolicy newest commit generation = 2
    [junit4] 2> 1067887 INFO (qtp28368041-7535) [ x:collection1] o.a.s.s.SolrIndexSearcher Opening [Searcher@85c8b3[collection1] main]
    [junit4] 2> 1067887 INFO (qtp28368041-7535) [ x:collection1] o.a.s.u.DirectUpdateHandler2 end_commit_flush
    [junit4] 2> 1067887 INFO (searcherExecutor-3711-thread-1-processing-x:collection1) [ x:collection1] o.a.s.c.SolrCore [collection1] Registered new searcher Searcher@85c8b3[collection1] main{ExitableDirectoryReader(UninvertingDirectoryReader())}
    [junit4] 2> 1067887 INFO (qtp28368041-7535) [ x:collection1] o.a.s.u.p.LogUpdateProcessorFactory [collection1] webapp=/solr path=/update params={waitSearcher=true&commit=true&softCommit=false&wt=javabin&version=2}{commit=} 0 2
    [junit4] 2> 1067890 INFO (qtp7442040-7558) [ x:collection1] o.a.s.u.DirectUpdateHandler2 start commit{,optimize=false,openSearcher=true,waitSearcher=true,expungeDeletes=false,softCommit=false,prepareCommit=false}
    [junit4] 2> 1067890 INFO (qtp7442040-7558) [ x:collection1] o.a.s.c.SolrDeletionPolicy SolrDeletionPolicy.onCommit: commits: num=2
    [junit4] 2> commit{dir=MockDirectoryWrapper(RAMDirectory@1911424 lockFactory=org.apache.lucene.store.SingleInstanceLockFactory@1f8f8b1),segFN=segments_1,generation=1}
    [junit4] 2> commit{dir=MockDirectoryWrapper(RAMDirectory@1911424 lockFactory=org.apache.lucene.store.SingleInstanceLockFactory@1f8f8b1),segFN=segments_2,generation=2}
    [junit4] 2> 1067890 INFO (qtp7442040-7558) [ x:collection1] o.a.s.c.SolrDeletionPolicy newest commit generation = 2
    [junit4] 2> 1067891 INFO (qtp7442040-7558) [ x:collection1] o.a.s.s.SolrIndexSearcher Opening [Searcher@16ff98b[collection1] main]
    [junit4] 2> 1067891 INFO (qtp7442040-7558) [ x:collection1] o.a.s.u.DirectUpdateHandler2 end_commit_flush
    [junit4] 2> 1067891 INFO (searcherExecutor-3721-thread-1-processing-x:collection1) [ x:collection1] o.a.s.c.SolrCore [collection1] Registered new searcher Searcher@16ff98b[collection1] main{ExitableDirectoryReader(UninvertingDirectoryReader())}
    [junit4] 2> 1067891 INFO (qtp7442040-7558) [ x:collection1] o.a.s.u.p.LogUpdateProcessorFactory [collection1] webapp=/solr path=/update params={waitSearcher=true&commit=true&softCommit=false&wt=javabin&version=2}{commit=} 0 1
    [junit4] 2> 1067893 INFO (TEST-TestReplicationHandler.testRateLimitedReplication-seed#[7FC8E61B0B7E2ECC]) [ ] o.e.j.s.ServerConnector Stopped ServerConnector@19acf46{HTTP/1.1,[http/1.1]}{127.0.0.1:0}
    [junit4] 2> 1067893 INFO (TEST-TestReplicationHandler.testRateLimitedReplication-seed#[7FC8E61B0B7E2ECC]) [ ] o.a.s.c.CoreContainer Shutting down CoreContainer instance=2223103
    [junit4] 2> 1067894 INFO (coreCloseExecutor-3726-thread-1) [ x:collection1] o.a.s.c.SolrCore [collection1] CLOSING SolrCore org.apache.solr.core.SolrCore@15eca74
    [junit4] 2> 1067894 INFO (coreCloseExecutor-3726-thread-1) [ x:collection1] o.a.s.u.DirectUpdateHandler2 closing DirectUpdateHandler2{commits=1,autocommits=0,soft autocommits=0,optimizes=0,rollbacks=0,expungeDeletes=0,docsPending=0,adds=0,deletesById=0,deletesByQuery=0,errors=0,cumulative_adds=0,cumulative_deletesById=0,cumulative_deletesByQuery=1,cumulative_errors=0}
    [junit4] 2> 1067894 INFO (coreCloseExecutor-3726-thread-1) [ x:collection1] o.a.s.u.SolrCoreState Closing SolrCoreState
    [junit4] 2> 1067894 INFO (coreCloseExecutor-3726-thread-1) [ x:collection1] o.a.s.u.DefaultSolrCoreState SolrCoreState ref count has reached 0 - closing IndexWriter
    [junit4] 2> 1067894 INFO (coreCloseExecutor-3726-thread-1) [ x:collection1] o.a.s.u.DefaultSolrCoreState closing IndexWriter with IndexWriterCloser
    [junit4] 2> 1067894 INFO (coreCloseExecutor-3726-thread-1) [ x:collection1] o.a.s.c.SolrCore [collection1] Closing main searcher on request.
    [junit4] 2> 1067894 INFO (coreCloseExecutor-3726-thread-1) [ x:collection1] o.a.s.c.CachingDirectoryFactory Closing MockDirectoryFactory - 2 directories currently being tracked
    [junit4] 2> 1067894 INFO (coreCloseExecutor-3726-thread-1) [ x:collection1] o.a.s.c.CachingDirectoryFactory looking to close /home/jenkins/workspace/Lucene-Solr-6.1-Linux/solr/build/solr-core/test/J1/temp/solr.handler.TestReplicationHandler_7FC8E61B0B7E2ECC-001/solr-instance-001/./collection1/data/index [CachedDir<<refCount=0;path=/home/jenkins/workspace/Lucene-Solr-6.1-Linux/solr/build/solr-core/test/J1/temp/solr.handler.TestReplicationHandler_7FC8E61B0B7E2ECC-001/solr-instance-001/./collection1/data/index;done=false>>]
    [junit4] 2> 1067895 INFO (coreCloseExecutor-3726-thread-1) [ x:collection1] o.a.s.c.CachingDirectoryFactory Closing directory, CoreContainer#isShutdown=true
    [junit4] 2> 1067895 INFO (coreCloseExecutor-3726-thread-1) [ x:collection1] o.a.s.c.CachingDirectoryFactory Closing directory: /home/jenkins/workspace/Lucene-Solr-6.1-Linux/solr/build/solr-core/test/J1/temp/solr.handler.TestReplicationHandler_7FC8E61B0B7E2ECC-001/solr-instance-001/./collection1/data/index
    [junit4] 2> 1067895 INFO (coreCloseExecutor-3726-thread-1) [ x:collection1] o.a.s.c.CachingDirectoryFactory looking to close /home/jenkins/workspace/Lucene-Solr-6.1-Linux/solr/build/solr-core/test/J1/temp/solr.handler.TestReplicationHandler_7FC8E61B0B7E2ECC-001/solr-instance-001/./collection1/data [CachedDir<<refCount=0;path=/home/jenkins/workspace/Lucene-Solr-6.1-Linux/solr/build/solr-core/test/J1/temp/solr.handler.TestReplicationHandler_7FC8E61B0B7E2ECC-001/solr-instance-001/./collection1/data;done=false>>]
    [junit4] 2> 1067895 INFO (coreCloseExecutor-3726-thread-1) [ x:collection1] o.a.s.c.CachingDirectoryFactory Closing directory, CoreContainer#isShutdown=true
    [junit4] 2> 1067895 INFO (coreCloseExecutor-3726-thread-1) [ x:collection1] o.a.s.c.CachingDirectoryFactory Closing directory: /home/jenkins/workspace/Lucene-Solr-6.1-Linux/solr/build/solr-core/test/J1/temp/solr.handler.TestReplicationHandler_7FC8E61B0B7E2ECC-001/solr-instance-001/./collection1/data
    [junit4] 2> 1067895 INFO (TEST-TestReplicationHandler.testRateLimitedReplication-seed#[7FC8E61B0B7E2ECC]) [ ] o.e.j.s.h.ContextHandler Stopped o.e.j.s.ServletContextHandler@1105531{/solr,null,UNAVAILABLE}
    [junit4] 2> 1067896 INFO (TEST-TestReplicationHandler.testRateLimitedReplication-seed#[7FC8E61B0B7E2ECC]) [ ] o.e.j.s.ServerConnector Stopped ServerConnector@1dec636{HTTP/1.1,[http/1.1]}{127.0.0.1:0}
    [junit4] 2> 1067896 INFO (TEST-TestReplicationHandler.testRateLimitedReplication-seed#[7FC8E61B0B7E2ECC]) [ ] o.a.s.c.CoreContainer Shutting down CoreContainer instance=19772436
    [junit4] 2> 1067896 INFO (coreCloseExecutor-3728-thread-1) [ x:collection1] o.a.s.c.SolrCore [collection1] CLOSING SolrCore org.apache.solr.core.SolrCore@9eee4d
    [junit4] 2> 1067897 INFO (coreCloseExecutor-3728-thread-1) [ x:collection1] o.a.s.u.DirectUpdateHandler2 closing DirectUpdateHandler2{commits=1,autocommits=0,soft autocommits=0,optimizes=0,rollbacks=0,expungeDeletes=0,docsPending=0,adds=0,deletesById=0,deletesByQuery=0,errors=0,cumulative_adds=0,cumulative_deletesById=0,cumulative_deletesByQuery=1,cumulative_errors=0}
    [junit4] 2> 1067897 INFO (coreCloseExecutor-3728-thread-1) [ x:collection1] o.a.s.u.SolrCoreState Closing SolrCoreState
    [junit4] 2> 1067897 INFO (coreCloseExecutor-3728-thread-1) [ x:collection1] o.a.s.u.DefaultSolrCoreState SolrCoreState ref count has reached 0 - closing IndexWriter
    [junit4] 2> 1067897 INFO (coreCloseExecutor-3728-thread-1) [ x:collection1] o.a.s.u.DefaultSolrCoreState closing IndexWriter with IndexWriterCloser
    [junit4] 2> 1067897 INFO (coreCloseExecutor-3728-thread-1) [ x:collection1] o.a.s.c.SolrCore [collection1] Closing main searcher on request.
    [junit4] 2> 1067897 INFO (coreCloseExecutor-3728-thread-1) [ x:collection1] o.a.s.c.CachingDirectoryFactory Closing MockDirectoryFactory - 2 directories currently being tracked
    [junit4] 2> 1067897 INFO (coreCloseExecutor-3728-thread-1) [ x:collection1] o.a.s.c.CachingDirectoryFactory looking to close /home/jenkins/workspace/Lucene-Solr-6.1-Linux/solr/build/solr-core/test/J1/temp/solr.handler.TestReplicationHandler_7FC8E61B0B7E2ECC-001/solr-instance-002/./collection1/data [CachedDir<<refCount=0;path=/home/jenkins/workspace/Lucene-Solr-6.1-Linux/solr/build/solr-core/test/J1/temp/solr.handler.TestReplicationHandler_7FC8E61B0B7E2ECC-001/solr-instance-002/./collection1/data;done=false>>]
    [junit4] 2> 1067897 INFO (coreCloseExecutor-3728-thread-1) [ x:collection1] o.a.s.c.CachingDirectoryFactory Closing directory, CoreContainer#isShutdown=true
    [junit4] 2> 1067897 INFO (coreCloseExecutor-3728-thread-1) [ x:collection1] o.a.s.c.CachingDirectoryFactory Closing directory: /home/jenkins/workspace/Lucene-Solr-6.1-Linux/solr/build/solr-core/test/J1/temp/solr.handler.TestReplicationHandler_7FC8E61B0B7E2ECC-001/solr-instance-002/./collection1/data
    [junit4] 2> 1067898 INFO (coreCloseExecutor-3728-thread-1) [ x:collection1] o.a.s.c.CachingDirectoryFactory looking to close /home/jenkins/workspace/Lucene-Solr-6.1-Linux/solr/build/solr-core/test/J1/temp/solr.handler.TestReplicationHandler_7FC8E61B0B7E2ECC-001/solr-instance-002/./collection1/data/index [CachedDir<<refCount=0;path=/home/jenkins/workspace/Lucene-Solr-6.1-Linux/solr/build/solr-core/test/J1/temp/solr.handler.TestReplicationHandler_7FC8E61B0B7E2ECC-001/solr-instance-002/./collection1/data/index;done=false>>]
    [junit4] 2> 1067898 INFO (coreCloseExecutor-3728-thread-1) [ x:collection1] o.a.s.c.CachingDirectoryFactory Closing directory, CoreContainer#isShutdown=true
    [junit4] 2> 1067898 INFO (coreCloseExecutor-3728-thread-1) [ x:collection1] o.a.s.c.CachingDirectoryFactory Closing directory: /home/jenkins/workspace/Lucene-Solr-6.1-Linux/solr/build/solr-core/test/J1/temp/solr.handler.TestReplicationHandler_7FC8E61B0B7E2ECC-001/solr-instance-002/./collection1/data/index
    [junit4] 2> 1067898 INFO (TEST-TestReplicationHandler.testRateLimitedReplication-seed#[7FC8E61B0B7E2ECC]) [ ] o.e.j.s.h.ContextHandler Stopped o.e.j.s.ServletContextHandler@4c894f{/solr,null,UNAVAILABLE}
    [junit4] 2> 1067915 INFO (TEST-TestReplicationHandler.testRateLimitedReplication-seed#[7FC8E61B0B7E2ECC]) [ ] o.e.j.s.Server jetty-9.3.8.v20160314
    [junit4] 2> 1067916 INFO (TEST-TestReplicationHandler.testRateLimitedReplication-seed#[7FC8E61B0B7E2ECC]) [ ] o.e.j.s.h.ContextHandler Started o.e.j.s.ServletContextHandler@1fd61c0{/solr,null,AVAILABLE}
    [junit4] 2> 1067917 INFO (TEST-TestReplicationHandler.testRateLimitedReplication-seed#[7FC8E61B0B7E2ECC]) [ ] o.e.j.s.ServerConnector Started ServerConnector@1236606{HTTP/1.1,[http/1.1]}{127.0.0.1:41769}
    [junit4] 2> 1067917 INFO (TEST-TestReplicationHandler.testRateLimitedReplication-seed#[7FC8E61B0B7E2ECC]) [ ] o.e.j.s.Server Started @1069224ms
    [junit4] 2> 1067917 INFO (TEST-TestReplicationHandler.testRateLimitedReplication-seed#[7FC8E61B0B7E2ECC]) [ ] o.a.s.c.s.e.JettySolrRunner Jetty properties: {solr.data.dir=/home/jenkins/workspace/Lucene-Solr-6.1-Linux/solr/build/solr-core/test/J1/temp/solr.handler.TestReplicationHandler_7FC8E61B0B7E2ECC-001/solr-instance-001/collection1/data, hostContext=/solr, hostPort=41769}
    [junit4] 2> 1067917 INFO (TEST-TestReplicationHandler.testRateLimitedReplication-seed#[7FC8E61B0B7E2ECC]) [ ] o.a.s.s.SolrDispatchFilter SolrDispatchFilter.init(): sun.misc.Launcher$AppClassLoader@1d16e93
    [junit4] 2> 1067917 INFO (TEST-TestReplicationHandler.testRateLimitedReplication-seed#[7FC8E61B0B7E2ECC]) [ ] o.a.s.c.SolrResourceLoader new SolrResourceLoader for directory: '/home/jenkins/workspace/Lucene-Solr-6.1-Linux/solr/build/solr-core/test/J1/temp/solr.handler.TestReplicationHandler_7FC8E61B0B7E2ECC-001/solr-instance-001'
    [junit4] 2> 1067917 INFO (TEST-TestReplicationHandler.testRateLimitedReplication-seed#[7FC8E61B0B7E2ECC]) [ ] o.a.s.c.SolrResourceLoader JNDI not configured for solr (NoInitialContextEx)
    [junit4] 2> 1067917 INFO (TEST-TestReplicationHandler.testRateLimitedReplication-seed#[7FC8E61B0B7E2ECC]) [ ] o.a.s.c.SolrResourceLoader solr home defaulted to 'solr/' (could not find system property or JNDI)
    [junit4] 2> 1067918 INFO (TEST-TestReplicationHandler.testRateLimitedReplication-seed#[7FC8E61B0B7E2ECC]) [ ] o.a.s.c.SolrXmlConfig Loading container configuration from /home/jenkins/workspace/Lucene-Solr-6.1-Linux/solr/build/solr-core/test/J1/temp/solr.handler.TestReplicationHandler_7FC8E61B0B7E2ECC-001/solr-instance-001/solr.xml
    [junit4] 2> 1067921 INFO (TEST-TestReplicationHandler.testRateLimitedReplication-seed#[7FC8E61B0B7E2ECC]) [ ] o.a.s.c.CorePropertiesLocator Config-defined core root directory: /home/jenkins/workspace/Lucene-Solr-6.1-Linux/solr/build/solr-core/test/J1/temp/solr.handler.TestReplicationHandler_7FC8E61B0B7E2ECC-001/solr-instance-001/.
    [junit4] 2> 1067921 INFO (TEST-TestReplicationHandler.testRateLimitedReplication-seed#[7FC8E61B0B7E2ECC]) [ ] o.a.s.c.CoreContainer New CoreContainer 24456129
    [junit4] 2> 1067921 INFO (TEST-TestReplicationHandler.testRateLimitedReplication-seed#[7FC8E61B0B7E2ECC]) [ ] o.a.s.c.CoreContainer Loading cores into CoreContainer [instanceDir=/home/jenkins/workspace/Lucene-Solr-6.1-Linux/solr/build/solr-core/test/J1/temp/solr.handler.TestReplicationHandler_7FC8E61B0B7E2ECC-001/solr-instance-001]
    [junit4] 2> 1067921 WARN (TEST-TestReplicationHandler.testRateLimitedReplication-seed#[7FC8E61B0B7E2ECC]) [ ] o.a.s.c.CoreContainer Couldn't add files from /home/jenkins/workspace/Lucene-Solr-6.1-Linux/solr/build/solr-core/test/J1/temp/solr.handler.TestReplicationHandler_7FC8E61B0B7E2ECC-001/solr-instance-001/lib to classpath: /home/jenkins/workspace/Lucene-Solr-6.1-Linux/solr/build/solr-core/test/J1/temp/solr.handler.TestReplicationHandler_7FC8E61B0B7E2ECC-001/solr-instance-001/lib
    [junit4] 2> 1067921 INFO (TEST-TestReplicationHandler.testRateLimitedReplication-seed#[7FC8E61B0B7E2ECC]) [ ] o.a.s.h.c.HttpShardHandlerFactory created with socketTimeout : 90000,urlScheme : ,connTimeout : 15000,maxConnectionsPerHost : 20,maxConnections : 10000,corePoolSize : 0,maximumPoolSize : 2147483647,maxThreadIdleTime : 5,sizeOfQueue : -1,fairnessPolicy : false,useRetries : false,
    [junit4] 2> 1067922 INFO (TEST-TestReplicationHandler.testRateLimitedReplication-seed#[7FC8E61B0B7E2ECC]) [ ] o.a.s.u.UpdateShardHandler Creating UpdateShardHandler HTTP client with params: socketTimeout=340000&connTimeout=45000&retry=true
    [junit4] 2> 1067922 INFO (TEST-TestReplicationHandler.testRateLimitedReplication-seed#[7FC8E61B0B7E2ECC]) [ ] o.a.s.l.LogWatcher SLF4J impl is org.slf4j.impl.Log4jLoggerFactory
    [junit4] 2> 1067922 INFO (TEST-TestReplicationHandler.testRateLimitedReplication-seed#[7FC8E61B0B7E2ECC]) [ ] o.a.s.l.LogWatcher Registering Log Listener [Log4j (org.slf4j.impl.Log4jLoggerFactory)]
    [junit4] 2> 1067923 INFO (TEST-TestReplicationHandler.testRateLimitedReplication-seed#[7FC8E61B0B7E2ECC]) [ ] o.a.s.c.CoreContainer Security conf doesn't exist. Skipping setup for authorization module.
    [junit4] 2> 1067923 INFO (TEST-TestReplicationHandler.testRateLimitedReplication-seed#[7FC8E61B0B7E2ECC]) [ ] o.a.s.c.CoreContainer No authentication plugin used.
    [junit4] 2> 1067923 INFO (TEST-TestReplicationHandler.testRateLimitedReplication-seed#[7FC8E61B0B7E2ECC]) [ ] o.a.s.c.CorePropertiesLocator Looking for core definitions underneath /home/jenkins/workspace/Lucene-Solr-6.1-Linux/solr/build/solr-core/test/J1/temp/solr.handler.TestReplicationHandler_7FC8E61B0B7E2ECC-001/solr-instance-001/.
    [junit4] 2> 1067924 INFO (TEST-TestReplicationHandler.testRateLimitedReplication-seed#[7FC8E61B0B7E2ECC]) [ ] o.a.s.c.CoreDescriptor Created CoreDescriptor: {name=collection1, config=solrconfig.xml, loadOnStartup=true, schema=schema.xml, configSetProperties=configsetprops.json, transient=false, dataDir=data/}
    [junit4] 2> 1067924 INFO (TEST-TestReplicationHandler.testRateLimitedReplication-seed#[7FC8E61B0B7E2ECC]) [ ] o.a.s.c.CorePropertiesLocator Found core collection1 in /home/jenkins/workspace/Lucene-Solr-6.1-Linux/solr/build/solr-core/test/J1/temp/solr.handler.TestReplicationHandler_7FC8E61B0B7E2ECC-001/solr-instance-001/./collection1
    [junit4] 2> 1067924 INFO (TEST-TestReplicationHandler.testRateLimitedReplication-seed#[7FC8E61B0B7E2ECC]) [ ] o.a.s.c.CorePropertiesLocator Found 1 core definitions
    [junit4] 2> 1067924 INFO (coreLoadExecutor-3735-thread-1) [ ] o.a.s.c.SolrResourceLoader new SolrResourceLoader for directory: '/home/jenkins/workspace/Lucene-Solr-6.1-Linux/solr/build/solr-core/test/J1/temp/solr.handler.TestReplicationHandler_7FC8E61B0B7E2ECC-001/solr-instance-001/collection1'
    [junit4] 2> 1067924 INFO (coreLoadExecutor-3735-thread-1) [ ] o.a.s.c.SolrResourceLoader JNDI not configured for solr (NoInitialContextEx)
    [junit4] 2> 1067924 INFO (coreLoadExecutor-3735-thread-1) [ ] o.a.s.c.SolrResourceLoader solr home defaulted to 'solr/' (could not find system property or JNDI)
    [junit4] 2> 1067928 INFO (TEST-TestReplicationHandler.testRateLimitedReplication-seed#[7FC8E61B0B7E2ECC]) [ ] o.a.s.s.SolrDispatchFilter user.dir=/home/jenkins/workspace/Lucene-Solr-6.1-Linux/solr/build/solr-core/test/J1
    [junit4] 2> 1067928 INFO (TEST-TestReplicationHandler.testRateLimitedReplication-seed#[7FC8E61B0B7E2ECC]) [ ] o.a.s.s.SolrDispatchFilter SolrDispatchFilter.init() done
    [junit4] 2> 1067929 INFO (coreLoadExecutor-3735-thread-1) [ ] o.a.s.c.SolrConfig current version of requestparams : -1
    [junit4] 2> 1067933 INFO (coreLoadExecutor-3735-thread-1) [ ] o.a.s.c.SolrConfig Using Lucene MatchVersion: 6.1.0
    [junit4] 2> 1067943 INFO (coreLoadExecutor-3735-thread-1) [ ] o.a.s.c.SolrConfig Loaded SolrConfig: solrconfig.xml
    [junit4] 2> 1067947 INFO (coreLoadExecutor-3735-thread-1) [ ] o.a.s.s.IndexSchema [collection1] Schema name=test
    [junit4] 2> 1067949 INFO (coreLoadExecutor-3735-thread-1) [ ] o.a.s.s.IndexSchema unique key field: id
    [junit4] 2> 1067951 INFO (coreLoadExecutor-3735-thread-1) [ ] o.a.s.c.ConfigSetProperties Did not find ConfigSet properties, assuming default properties: Can't find resource 'configsetprops.json' in classpath or '/home/jenkins/workspace/Lucene-Solr-6.1-Linux/solr/build/solr-core/test/J1/temp/solr.handler.TestReplicationHandler_7FC8E61B0B7E2ECC-001/solr-instance-001/collection1'
    [junit4] 2> 1067951 INFO (coreLoadExecutor-3735-thread-1) [ ] o.a.s.c.CoreContainer Creating SolrCore 'collection1' using configuration from instancedir /home/jenkins/workspace/Lucene-Solr-6.1-Linux/solr/build/solr-core/test/J1/temp/solr.handler.TestReplicationHandler_7FC8E61B0B7E2ECC-001/solr-instance-001/./collection1
    [junit4] 2> 1067951 INFO (coreLoadExecutor-3735-thread-1) [ x:collection1] o.a.s.c.SolrCore solr.StandardDirectoryFactory
    [junit4] 2> 1067951 INFO (coreLoadExecutor-3735-thread-1) [ x:collection1] o.a.s.c.SolrCore [[collection1] ] Opening new SolrCore at [/home/jenkins/workspace/Lucene-Solr-6.1-Linux/solr/build/solr-core/test/J1/temp/solr.handler.TestReplicationHandler_7FC8E61B0B7E2ECC-001/solr-instance-001/collection1], dataDir=[/home/jenkins/workspace/Lucene-Solr-6.1-Linux/solr/build/solr-core/test/J1/temp/solr.handler.TestReplicationHandler_7FC8E61B0B7E2ECC-001/solr-instance-001/./collection1/data/]
    [junit4] 2> 1067951 INFO (coreLoadExecutor-3735-thread-1) [ x:collection1] o.a.s.c.SolrCore JMX monitoring not detected for core: collection1
    [junit4] 2> 1067952 INFO (coreLoadExecutor-3735-thread-1) [ x:collection1] o.a.s.c.CachingDirectoryFactory return new directory for /home/jenkins/workspace/Lucene-Solr-6.1-Linux/solr/build/solr-core/test/J1/temp/solr.handler.TestReplicationHandler_7FC8E61B0B7E2ECC-001/solr-instance-001/collection1/data
    [junit4] 2> 1067952 INFO (coreLoadExecutor-3735-thread-1) [ x:collection1] o.a.s.c.SolrCore New index directory detected: old=null new=/home/jenkins/workspace/Lucene-Solr-6.1-Linux/solr/build/solr-core/test/J1/temp/solr.handler.TestReplicationHandler_7FC8E61B0B7E2ECC-001/solr-instance-001/./collection1/data/index/
    [junit4] 2> 1067953 WARN (coreLoadExecutor-3735-thread-1) [ x:collection1] o.a.s.c.SolrCore [collection1] Solr index directory '/home/jenkins/workspace/Lucene-Solr-6.1-Linux/solr/build/solr-core/test/J1/temp/solr.handler.TestReplicationHandler_7FC8E61B0B7E2ECC-001/solr-instance-001/./collection1/data/index' doesn't exist. Creating new index...
    [junit4] 2> 1067953 INFO (coreLoadExecutor-3735-thread-1) [ x:collection1] o.a.s.c.CachingDirectoryFactory return new directory for /home/jenkins/workspace/Lucene-Solr-6.1-Linux/solr/build/solr-core/test/J1/temp/solr.handler.TestReplicationHandler_7FC8E61B0B7E2ECC-001/solr-instance-001/collection1/data/index
    [junit4] 2> 1067953 INFO (coreLoadExecutor-3735-thread-1) [ x:collection1] o.a.s.u.RandomMergePolicy RandomMergePolicy wrapping class org.apache.lucene.index.MockRandomMergePolicy: org.apache.lucene.index.MockRandomMergePolicy@13655db
    [junit4] 2> 1068022 INFO (coreLoadExecutor-3735-thread-1) [ x:collection1] o.a.s.c.SolrDeletionPolicy SolrDeletionPolicy.onCommit: commits: num=1
    [junit4] 2> commit{dir=/home/jenkins/workspace/Lucene-Solr-6.1-Linux/solr/build/solr-core/test/J1/temp/solr.handler.TestReplicationHandler_7FC8E61B0B7E2ECC-001/solr-instance-001/collection1/data/index,segFN=segments_1,generation=1}
    [junit4] 2> 1068022 INFO (coreLoadExecutor-3735-thread-1) [ x:collection1] o.a.s.c.SolrDeletionPolicy newest commit generation = 1
    [junit4] 2> 1068023 INFO (OldIndexDirectoryCleanupThreadForCore-collection1) [ x:collection1] o.a.s.c.SolrCore Looking for old index directories to cleanup for core collection1 in /home/jenkins/workspace/Lucene-Solr-6.1-Linux/solr/build/solr-core/test/J1/temp/solr.handler.TestReplicationHandler_7FC8E61B0B7E2ECC-001/solr-instance-001/./collection1/data/
    [junit4] 2> 1068024 INFO (coreLoadExecutor-3735-thread-1) [ x:collection1] o.a.s.c.SolrCore no updateRequestProcessorChain defined as default, creating implicit default
    [junit4] 2> 1068025 INFO (coreLoadExecutor-3735-thread-1) [ x:collection1] o.a.s.h.l.XMLLoader xsltCacheLifetimeSeconds=60
    [junit4] 2> 1068026 INFO (coreLoadExecutor-3735-thread-1) [ x:collection1] o.a.s.h.l.XMLLoader xsltCacheLifetimeSeconds=60
    [junit4] 2> 1068027 INFO (coreLoadExecutor-3735-thread-1) [ x:collection1] o.a.s.h.l.XMLLoader xsltCacheLifetimeSeconds=60
    [junit4] 2> 1068027 INFO (coreLoadExecutor-3735-thread-1) [ x:collection1] o.a.s.h.l.XMLLoader xsltCacheLifetimeSeconds=60
    [junit4] 2> 1068028 INFO (coreLoadExecutor-3735-thread-1) [ x:collection1] o.a.s.c.PluginBag requestHandler : 'lazy' created with startup=lazy
    [junit4] 2> 1068028 INFO (coreLoadExecutor-3735-thread-1) [ x:collection1] o.a.s.c.RequestHandlers Registered paths: /admin/mbeans,standard,lazy,/update/json/docs,/admin/luke,/export,/get,/admin/properties,/update/json,/admin/threads,/update/csv,/sql,/graph,/admin/segments,/admin/system,/replication,defaults,/config,/stream,/schema,/admin/plugins,/admin/logging,/admin/ping,/update,/admin/file
    [junit4] 2> 1068028 INFO (coreLoadExecutor-3735-thread-1) [ x:collection1] o.a.s.c.SolrCore Using default statsCache cache: org.apache.solr.search.stats.LocalStatsCache
    [junit4] 2> 1068029 INFO (coreLoadExecutor-3735-thread-1) [ x:collection1] o.a.s.u.CommitTracker Hard AutoCommit: disabled
    [junit4] 2> 1068029 INFO (coreLoadExecutor-3735-thread-1) [ x:collection1] o.a.s.u.CommitTracker Soft AutoCommit: disabled
    [junit4] 2> 1068029 INFO (coreLoadExecutor-3735-thread-1) [ x:collection1] o.a.s.u.RandomMergePolicy RandomMergePolicy wrapping class org.apache.lucene.index.TieredMergePolicy: [TieredMergePolicy: maxMergeAtOnce=15, maxMergeAtOnceExplicit=35, maxMergedSegmentMB=88.302734375, floorSegmentMB=2.01171875, forceMergeDeletesPctAllowed=22.243426636386193, segmentsPerTier=20.0, maxCFSSegmentSizeMB=8.796093022207999E12, noCFSRatio=0.6522425446144778
    [junit4] 2> 1068030 INFO (coreLoadExecutor-3735-thread-1) [ x:collection1] o.a.s.c.SolrDeletionPolicy SolrDeletionPolicy.onInit: commits: num=1
    [junit4] 2> commit{dir=/home/jenkins/workspace/Lucene-Solr-6.1-Linux/solr/build/solr-core/test/J1/temp/solr.handler.TestReplicationHandler_7FC8E61B0B7E2ECC-001/solr-instance-001/collection1/data/index,segFN=segments_1,generation=1}
    [junit4] 2> 1068030 INFO (coreLoadExecutor-3735-thread-1) [ x:collection1] o.a.s.c.SolrDeletionPolicy newest commit generation = 1
    [junit4] 2> 1068030 INFO (coreLoadExecutor-3735-thread-1) [ x:collection1] o.a.s.s.SolrIndexSearcher Opening [Searcher@a2cb56[collection1] main]
    [junit4] 2> 1068030 INFO (coreLoadExecutor-3735-thread-1) [ x:collection1] o.a.s.r.ManagedResourceStorage File-based storage initialized to use dir: /home/jenkins/workspace/Lucene-Solr-6.1-Linux/solr/build/solr-core/test/J1/temp/solr.handler.TestReplicationHandler_7FC8E61B0B7E2ECC-001/solr-instance-001/collection1/conf
    [junit4] 2> 1068030 INFO (coreLoadExecutor-3735-thread-1) [ x:collection1] o.a.s.r.RestManager Initializing RestManager with initArgs: {storageDir=/home/jenkins/workspace/Lucene-Solr-6.1-Linux/solr/build/solr-core/test/J1/temp/solr.handler.TestReplicationHandler_7FC8E61B0B7E2ECC-001/solr-instance-001/collection1/conf}
    [junit4] 2> 1068030 INFO (coreLoadExecutor-3735-thread-1) [ x:collection1] o.a.s.r.ManagedResourceStorage Reading _rest_managed.json using file:dir=/home/jenkins/workspace/Lucene-Solr-6.1-Linux/solr/build/solr-core/test/J1/temp/solr.handler.TestReplicationHandler_7FC8E61B0B7E2ECC-001/solr-instance-001/collection1/conf
    [junit4] 2> 1068030 INFO (coreLoadExecutor-3735-thread-1) [ x:collection1] o.a.s.r.RestManager Initializing 0 registered ManagedResources
    [junit4] 2> 1068030 INFO (coreLoadExecutor-3735-thread-1) [ x:collection1] o.a.s.h.ReplicationHandler Commits will be reserved for 10000
    [junit4] 2> 1068030 INFO (searcherExecutor-3736-thread-1-processing-x:collection1) [ x:collection1] o.a.s.c.SolrCore [collection1] Registered new searcher Searcher@a2cb56[collection1] main{ExitableDirectoryReader(UninvertingDirectoryReader())}
    [junit4] 2> 1068030 INFO (coreLoadExecutor-3735-thread-1) [ x:collection1] o.a.s.c.CoreContainer registering core: collection1
    [junit4] 2> 1068434 INFO (qtp25454725-7579) [ x:collection1] o.a.s.u.p.LogUpdateProcessorFactory [collection1] webapp=/solr path=/update params={wt=javabin&version=2}{add=[0]} 0 1
    [junit4] 2> 1068436 INFO (qtp25454725-7580) [ x:collection1] o.a.s.u.p.LogUpdateProcessorFactory [collection1] webapp=/solr path=/update params={wt=javabin&version=2}{add=[1]} 0 0
    [junit4] 2> 1068439 INFO (qtp25454725-7581) [ x:collection1] o.a.s.u.p.LogUpdateProcessorFactory [collection1] webapp=/solr path=/update params={wt=javabin&version=2}{add=[2]} 0 0
    [junit4] 2> 1068442 INFO (qtp25454725-7574) [ x:collection1] o.a.s.u.p.LogUpdateProcessorFactory [collection1] webapp=/solr path=/update params={wt=javabin&version=2}{add=[3]} 0 0
    [junit4] 2> 1068445 INFO (qtp25454725-7579) [ x:collection1] o.a.s.u.p.LogUpdateProcessorFactory [collection1] webapp=/solr path=/update params={wt=javabin&version=2}{add=[4]} 0 0
    [junit4] 2> 1068447 INFO (qtp25454725-7580) [ x:collection1] o.a.s.u.p.LogUpdateProcessorFactory [collection1] webapp=/solr path=/update params={wt=javabin&version=2}{add=[5]} 0 0
    [junit4] 2> 1068449 INFO (qtp25454725-7581) [ x:collection1] o.a.s.u.p.LogUpdateProcessorFactory [collection1] webapp=/solr path=/update params={wt=javabin&version=2}{add=[6]} 0 0
    [junit4] 2> 1068451 INFO (qtp25454725-7574) [ x:collection1] o.a.s.u.p.LogUpdateProcessorFactory [collection1] webapp=/solr path=/update params={wt=javabin&version=2}{add=[7]} 0 0
    [junit4] 2> 1068457 INFO (qtp25454725-7579) [ x:collection1] o.a.s.u.p.LogUpdateProcessorFactory [collection1] webapp=/solr path=/update params={wt=javabin&version=2}{add=[8]} 0 2
    [junit4] 2> 1068459 INFO (qtp25454725-7580) [ x:collection1] o.a.s.u.p.LogUpdateProcessorFactory [collection1] webapp=/solr path=/update params={wt=javabin&version=2}{add=[9]} 0 0
    [junit4] 2> 1068462 INFO (qtp25454725-7581) [ x:collection1] o.a.s.u.p.LogUpdateProcessorFactory [collection1] webapp=/solr path=/update params={wt=javabin&version=2}{add=[10]} 0 0
    [junit4] 2> 1068465 INFO (qtp25454725-7574) [ x:collection1] o.a.s.u.p.LogUpdateProcessorFactory [collection1] webapp=/solr path=/update params={wt=javabin&version=2}{add=[11]} 0 0
    [junit4] 2> 1068467 INFO (qtp25454725-7579) [ x:collection1] o.a.s.u.p.LogUpdateProcessorFactory [collection1] webapp=/solr path=/update params={wt=javabin&version=2}{add=[12]} 0 0
    [junit4] 2> 1068470 INFO (qtp25454725-7580) [ x:collection1] o.a.s.u.p.LogUpdateProcessorFactory [collection1] webapp=/solr path=/update params={wt=javabin&version=2}{add=[13]} 0 0
    [junit4] 2> 1068472 INFO (qtp25454725-7581) [ x:collection1] o.a.s.u.p.LogUpdateProcessorFactory [collection1] webapp=/solr path=/update params={wt=javabin&version=2}{add=[14]} 0 0
    [junit4] 2> 1068474 INFO (qtp25454725-7574) [ x:collection1] o.a.s.u.p.LogUpdateProcessorFactory [collection1] webapp=/solr path=/update params={wt=javabin&version=2}{add=[15]} 0 0
    [junit4] 2> 1068477 INFO (qtp25454725-7579) [ x:collection1] o.a.s.u.p.LogUpdateProcessorFactory [collection1] webapp=/solr path=/update params={wt=javabin&version=2}{add=[16]} 0 0
    [junit4] 2> 1068480 INFO (qtp25454725-7580) [ x:collection1] o.a.s.u.p.LogUpdateProcessorFactory [collection1] webapp=/solr path=/update params={wt=javabin&version=2}{add=[17]} 0 1
    [junit4] 2> 1068483 INFO (qtp25454725-7581) [ x:collection1] o.a.s.u.p.LogUpdateProcessorFactory [collection1] webapp=/solr path=/update params={wt=javabin&version=2}{add=[18]} 0 0
    [junit4] 2> 1068485 INFO (qtp25454725-7574) [ x:collection1] o.a.s.u.p.LogUpdateProcessorFactory [collection1] webapp=/solr path=/update params={wt=javabin&version=2}{add=[19]} 0 0
    [junit4] 2> 1068487 INFO (qtp25454725-7579) [ x:collection1] o.a.s.u.p.LogUpdateProcessorFactory [collection1] webapp=/solr path=/update params={wt=javabin&version=2}{add=[20]} 0 0
    [junit4] 2> 1068489 INFO (qtp25454725-7580) [ x:collection1] o.a.s.u.p.LogUpdateProcessorFactory [collection1] webapp=/solr path=/update params={wt=javabin&version=2}{add=[21]} 0 0
    [junit4] 2> 1068491 INFO (qtp25454725-7581) [ x:collection1] o.a.s.u.p.LogUpdateProcessorFactory [collection1] webapp=/solr path=/update params={wt=javabin&version=2}{add=[22]} 0 0
    [junit4] 2> 1068494 INFO (qtp25454725-7574) [ x:collection1] o.a.s.u.p.LogUpdateProcessorFactory [collection1] webapp=/solr path=/update params={wt=javabin&version=2}{add=[23]} 0 0
    [junit4] 2> 1068496 INFO (qtp25454725-7579) [ x:collection1] o.a.s.u.p.LogUpdateProcessorFactory [collection1] webapp=/solr path=/update params={wt=javabin&version=2}{add=[24]} 0 0
    [junit4] 2> 1068498 INFO (qtp25454725-7580) [ x:collection1] o.a.s.u.p.LogUpdateProcessorFactory [collection1] webapp=/solr path=/update params={wt=javabin&version=2}{add=[25]} 0 0
    [junit4] 2> 1068502 INFO (qtp25454725-7581) [ x:collection1] o.a.s.u.p.LogUpdateProcessorFactory [collection1] webapp=/solr path=/update params={wt=javabin&version=2}{add=[26]} 0 1
    [junit4] 2> 1068504 INFO (qtp25454725-7574) [ x:collection1] o.a.s.u.p.LogUpdateProcessorFactory [collection1] webapp=/solr path=/update params={wt=javabin&version=2}{add=[27]} 0 0
    [junit4] 2> 1068506 INFO (qtp25454725-7579) [ x:collection1] o.a.s.u.p.LogUpdateProcessorFactory [collection1] webapp=/solr path=/update params={wt=javabin&version=2}{add=[28]} 0 0
    [junit4] 2> 1068509 INFO (qtp25454725-7580) [ x:collection1] o.a.s.u.p.LogUpdateProcessorFactory [collection1] webapp=/solr path=/update params={wt=javabin&version=2}{add=[29]} 0 0
    [junit4] 2> 1068511 INFO (qtp25454725-7581) [ x:collection1] o.a.s.u.p.LogUpdateProcessorFactory [collection1] webapp=/solr path=/update params={wt=javabin&version=2}{add=[30]} 0 0
    [junit4] 2> 1068513 INFO (qtp25454725-7574) [ x:collection1] o.a.s.u.p.LogUpdateProcessorFactory [collection1] webapp=/solr path=/update params={wt=javabin&version=2}{add=[31]} 0 0
    [junit4] 2> 1068515 INFO (qtp25454725-7579) [ x:collection1] o.a.s.u.p.LogUpdateProcessorFactory [collection1] webapp=/solr path=/update params={wt=javabin&version=2}{add=[32]} 0 0
    [junit4] 2> 1068517 INFO (qtp25454725-7580) [ x:collection1] o.a.s.u.p.LogUpdateProcessorFactory [collection1] webapp=/solr path=/update params={wt=javabin&version=2}{add=[33]} 0 0
    [junit4] 2> 1068520 INFO (qtp25454725-7581) [ x:collection1] o.a.s.u.p.LogUpdateProcessorFactory [collection1] webapp=/solr path=/update params={wt=javabin&version=2}{add=[34]} 0 0
    [junit4] 2> 1068523 INFO (qtp25454725-7574) [ x:collection1] o.a.s.u.p.LogUpdateProcessorFactory [collection1] webapp=/solr path=/update params={wt=javabin&version=2}{add=[35]} 0 1
    [junit4] 2> 1068525 INFO (qtp25454725-7579) [ x:collection1] o.a.s.u.p.LogUpdateProcessorFactory [collection1] webapp=/solr path=/update params={wt=javabin&version=2}{add=[36]} 0 0
    [junit4] 2> 1068527 INFO (qtp25454725-7580) [ x:collection1] o.a.s.u.p.LogUpdateProcessorFactory [collection1] webapp=/solr path=/update params={wt=javabin&version=2}{add=[37]} 0 0
    [junit4] 2> 1068530 INFO (qtp25454725-7581) [ x:collection1] o.a.s.u.p.LogUpdateProcessorFactory [collection1] webapp=/solr path=/update params={wt=javabin&version=2}{add=[38]} 0 0
    [junit4] 2> 1068532 INFO (qtp25454725-7574) [ x:collection1] o.a.s.u.p.LogUpdateProcessorFactory [collection1] webapp=/solr path=/update params={wt=javabin&version=2}{add=[39]} 0 0
    [junit4] 2> 1068534 INFO (qtp25454725-7579) [ x:collection1] o.a.s.u.p.LogUpdateProcessorFactory [collection1] webapp=/solr path=/update params={wt=javabin&version=2}{add=[40]} 0 0
    [junit4] 2> 1068537 INFO (qtp25454725-7580) [ x:collection1] o.a.s.u.p.LogUpdateProcessorFactory [collection1] webapp=/solr path=/update params={wt=javabin&version=2}{add=[41]} 0 0
    [junit4] 2> 1068539 INFO (qtp25454725-7581) [ x:collection1] o.a.s.u.p.LogUpdateProcessorFactory [collection1] webapp=/solr path=/update params={wt=javabin&version=2}{add=[42]} 0 0
    [junit4] 2> 1068541 INFO (qtp25454725-7574) [ x:collection1] o.a.s.u.p.LogUpdateProcessorFactory [collection1] webapp=/solr path=/update params={wt=javabin&version=2}{add=[43]} 0 0
    [junit4] 2> 1068544 INFO (qtp25454725-7579) [ x:collection1] o.a.s.u.p.LogUpdateProcessorFactory [collection1] webapp=/solr path=/update params={wt=javabin&version=2}{add=[44]} 0 1
    [junit4] 2> 1068547 INFO (qtp25454725-7580) [ x:collection1] o.a.s.u.p.LogUpdateProcessorFactory [collection1] webapp=/solr path=/update params={wt=javabin&version=2}{add=[45]} 0 0
    [junit4] 2> 1068549 INFO (qtp25454725-7581) [ x:collection1] o.a.s.u.p.LogUpdateProcessorFactory [collection1] webapp=/solr path=/update params={wt=javabin&version=2}{add=[46]} 0 0
    [junit4] 2> 1068551 INFO (qtp25454725-7574) [ x:collection1] o.a.s.u.p.LogUpdateProcessorFactory [collection1] webapp=/solr path=/update params={wt=javabin&version=2}{add=[47]} 0 0
    [junit4] 2> 1068554 INFO (qtp25454725-7579) [ x:collection1] o.a.s.u.p.LogUpdateProcessorFactory [collection1] webapp=/solr path=/update params={wt=javabin&version=2}{add=[48]} 0 0
    [junit4] 2> 1068556 INFO (qtp25454725-7580) [ x:collection1] o.a.s.u.p.LogUpdateProcessorFactory [collection1] webapp=/solr path=/update params={wt=javabin&version=2}{add=[49]} 0 0
    [junit4] 2> 1068559 INFO (qtp25454725-7581) [ x:collection1] o.a.s.u.p.LogUpdateProcessorFactory [collection1] webapp=/solr path=/update params={wt=javabin&version=2}{add=[50]} 0 0
    [junit4] 2> 1068561 INFO (qtp25454725-7574) [ x:collection1] o.a.s.u.p.LogUpdateProcessorFactory [collection1] webapp=/solr path=/update params={wt=javabin&version=2}{add=[51]} 0 0
    [junit4] 2> 1068563 INFO (qtp25454725-7579) [ x:collection1] o.a.s.u.p.LogUpdateProcessorFactory [collection1] webapp=/solr path=/update params={wt=javabin&version=2}{add=[52]} 0 0
    [junit4] 2> 1068567 INFO (qtp25454725-7580) [ x:collection1] o.a.s.u.p.LogUpdateProcessorFactory [collection1] webapp=/solr path=/update params={wt=javabin&version=2}{add=[53]} 0 2
    [junit4] 2> 1068569 INFO (qtp25454725-7581) [ x:collection1] o.a.s.u.p.LogUpdateProcessorFactory [collection1] webapp=/solr path=/update params={wt=javabin&version=2}{add=[54]} 0 0
    [junit4] 2> 1068572 INFO (qtp25454725-7574) [ x:collection1] o.a.s.u.p.LogUpdateProcessorFactory [collection1] webapp=/solr path=/update params={wt=javabin&version=2}{add=[55]} 0 0
    [junit4] 2> 1068574 INFO (qtp25454725-7579) [ x:collection1] o.a.s.u.p.LogUpdateProcessorFactory [collection1] webapp=/solr path=/update params={wt=javabin&version=2}{add=[56]} 0 0
    [junit4] 2> 1068576 INFO (qtp25454725-7580) [ x:collection1] o.a.s.u.DirectUpdateHandler2 start commit{,optimize=false,openSearcher=true,waitSearcher=true,expungeDeletes=false,softCommit=false,prepareCommit=false}
    [junit4] 2> 1068813 INFO (qtp25454725-7580) [ x:collection1] o.a.s.c.SolrDeletionPolicy SolrDeletionPolicy.onCommit: commits: num=2
    [junit4] 2> commit{dir=/home/jenkins/workspace/Lucene-Solr-6.1-Linux/solr/build/solr-core/test/J1/temp/solr.handler.TestReplicationHandler_7FC8E61B0B7E2ECC-001/solr-instance-001/collection1/data/index,segFN=segments_1,generation=1}
    [junit4] 2> commit{dir=/home/jenkins/workspace/Lucene-Solr-6.1-Linux/solr/build/solr-core/test/J1/temp/solr.handler.TestReplicationHandler_7FC8E61B0B7E2ECC-001/solr-instance-001/collection1/data/index,segFN=segments_2,generation=2}
    [junit4] 2> 1068814 INFO (qtp25454725-7580) [ x:collection1] o.a.s.c.SolrDeletionPolicy newest commit generation = 2
    [junit4] 2> 1068815 INFO (qtp25454725-7580) [ x:collection1] o.a.s.s.SolrIndexSearcher Opening [Searcher@7fc3ac[collection1] main]
    [junit4] 2> 1068816 INFO (qtp25454725-7580) [ x:collection1] o.a.s.u.DirectUpdateHandler2 end_commit_flush
    [junit4] 2> 1068816 INFO (searcherExecutor-3736-thread-1-processing-x:collection1) [ x:collection1] o.a.s.c.SolrCore [collection1] Registered new searcher Searcher@7fc3ac[collection1] main{ExitableDirectoryReader(UninvertingDirectoryReader(Uninverting(_0(6.1.0):C57)))}
    [junit4] 2> 1068816 INFO (qtp25454725-7580) [ x:collection1] o.a.s.u.p.LogUpdateProcessorFactory [collection1] webapp=/solr path=/update params={waitSearcher=true&commit=true&softCommit=false&wt=javabin&version=2}{commit=} 0 239
    [junit4] 2> 1068817 INFO (TEST-TestReplicationHandler.testRateLimitedReplication-seed#[7FC8E61B0B7E2ECC]) [ ] o.e.j.s.ServerConnector Stopped ServerConnector@1236606{HTTP/1.1,[http/1.1]}{127.0.0.1:0}
    [junit4] 2> 1068817 INFO (TEST-TestReplicationHandler.testRateLimitedReplication-seed#[7FC8E61B0B7E2ECC]) [ ] o.a.s.c.CoreContainer Shutting down CoreContainer instance=24456129
    [junit4] 2> 1068817 INFO (coreCloseExecutor-3740-thread-1) [ x:collection1] o.a.s.c.SolrCore [collection1] CLOSING SolrCore org.apache.solr.core.SolrCore@11e1537
    [junit4] 2> 1068817 INFO (coreCloseExecutor-3740-thread-1) [ x:collection1] o.a.s.u.DirectUpdateHandler2 closing DirectUpdateHandler2{commits=1,autocommits=0,soft autocommits=0,optimizes=0,rollbacks=0,expungeDeletes=0,docsPending=0,adds=0,deletesById=0,deletesByQuery=0,errors=0,cumulative_adds=57,cumulative_deletesById=0,cumulative_deletesByQuery=0,cumulative_errors=0}
    [junit4] 2> 1068818 INFO (coreCloseExecutor-3740-thread-1) [ x:collection1] o.a.s.u.SolrCoreState Closing SolrCoreState
    [junit4] 2> 1068818 INFO (coreCloseExecutor-3740-thread-1) [ x:collection1] o.a.s.u.DefaultSolrCoreState SolrCoreState ref count has reached 0 - closing IndexWriter
    [junit4] 2> 1068818 INFO (coreCloseExecutor-3740-thread-1) [ x:collection1] o.a.s.u.DefaultSolrCoreState closing IndexWriter with IndexWriterCloser
    [junit4] 2> 1068818 INFO (coreCloseExecutor-3740-thread-1) [ x:collection1] o.a.s.c.SolrCore [collection1] Closing main searcher on request.
    [junit4] 2> 1068818 INFO (coreCloseExecutor-3740-thread-1) [ x:collection1] o.a.s.c.CachingDirectoryFactory Closing StandardDirectoryFactory - 2 directories currently being tracked
    [junit4] 2> 1068818 INFO (coreCloseExecutor-3740-thread-1) [ x:collection1] o.a.s.c.CachingDirectoryFactory looking to close /home/jenkins/workspace/Lucene-Solr-6.1-Linux/solr/build/solr-core/test/J1/temp/solr.handler.TestReplicationHandler_7FC8E61B0B7E2ECC-001/solr-instance-001/collection1/data/index [CachedDir<<refCount=0;path=/home/jenkins/workspace/Lucene-Solr-6.1-Linux/solr/build/solr-core/test/J1/temp/solr.handler.TestReplicationHandler_7FC8E61B0B7E2ECC-001/solr-instance-001/collection1/data/index;done=false>>]
    [junit4] 2> 1068818 INFO (coreCloseExecutor-3740-thread-1) [ x:collection1] o.a.s.c.CachingDirectoryFactory Closing directory, CoreContainer#isShutdown=true
    [junit4] 2> 1068818 INFO (coreCloseExecutor-3740-thread-1) [ x:collection1] o.a.s.c.CachingDirectoryFactory Closing directory: /home/jenkins/workspace/Lucene-Solr-6.1-Linux/solr/build/solr-core/test/J1/temp/solr.handler.TestReplicationHandler_7FC8E61B0B7E2ECC-001/solr-instance-001/collection1/data/index
    [junit4] 2> 1068819 INFO (coreCloseExecutor-3740-thread-1) [ x:collection1] o.a.s.c.CachingDirectoryFactory looking to close /home/jenkins/workspace/Lucene-Solr-6.1-Linux/solr/build/solr-core/test/J1/temp/solr.handler.TestReplicationHandler_7FC8E61B0B7E2ECC-001/solr-instance-001/collection1/data [CachedDir<<refCount=0;path=/home/jenkins/workspace/Lucene-Solr-6.1-Linux/solr/build/solr-core/test/J1/temp/solr.handler.TestReplicationHandler_7FC8E61B0B7E2ECC-001/solr-instance-001/collection1/data;done=false>>]
    [junit4] 2> 1068819 INFO (coreCloseExecutor-3740-thread-1) [ x:collection1] o.a.s.c.CachingDirectoryFactory Closing directory, CoreContainer#isShutdown=true
    [junit4] 2> 1068819 INFO (coreCloseExecutor-3740-thread-1) [ x:collection1] o.a.s.c.CachingDirectoryFactory Closing directory: /home/jenkins/workspace/Lucene-Solr-6.1-Linux/solr/build/solr-core/test/J1/temp/solr.handler.TestReplicationHandler_7FC8E61B0B7E2ECC-001/solr-instance-001/collection1/data
    [junit4] 2> 1068819 INFO (TEST-TestReplicationHandler.testRateLimitedReplication-seed#[7FC8E61B0B7E2ECC]) [ ] o.e.j.s.h.ContextHandler Stopped o.e.j.s.ServletContextHandler@1fd61c0{/solr,null,UNAVAILABLE}
    [junit4] 2> 1068821 INFO (TEST-TestReplicationHandler.testRateLimitedReplication-seed#[7FC8E61B0B7E2ECC]) [ ] o.e.j.s.Server jetty-9.3.8.v20160314
    [junit4] 2> 1068822 INFO (TEST-TestReplicationHandler.testRateLimitedReplication-seed#[7FC8E61B0B7E2ECC]) [ ] o.e.j.s.h.ContextHandler Started o.e.j.s.ServletContextHandler@16f7d04{/solr,null,AVAILABLE}
    [junit4] 2> 1068822 INFO (TEST-TestReplicationHandler.testRateLimitedReplication-seed#[7FC8E61B0B7E2ECC]) [ ] o.e.j.s.ServerConnector Started ServerConnector@a6c7ba{HTTP/1.1,[http/1.1]}{127.0.0.1:36743}
    [junit4] 2> 1068822 INFO (TEST-TestReplicationHandler.testRateLimitedReplication-seed#[7FC8E61B0B7E2ECC]) [ ] o.e.j.s.Server Started @1070129ms
    [junit4] 2> 1068822 INFO (TEST-TestReplicationHandler.testRateLimitedReplication-seed#[7FC8E61B0B7E2ECC]) [ ] o.a.s.c.s.e.JettySolrRunner Jetty properties: {solr.data.dir=/home/jenkins/workspace/Lucene-Solr-6.1-Linux/solr/build/solr-core/test/J1/temp/solr.handler.TestReplicationHandler_7FC8E61B0B7E2ECC-001/solr-instance-001/collection1/data, hostContext=/solr, hostPort=36743}
    [junit4] 2> 1068823 INFO (TEST-TestReplicationHandler.testRateLimitedReplication-seed#[7FC8E61B0B7E2ECC]) [ ] o.a.s.s.SolrDispatchFilter SolrDispatchFilter.init(): sun.misc.Launcher$AppClassLoader@1d16e93
    [junit4] 2> 1068823 INFO (TEST-TestReplicationHandler.testRateLimitedReplication-seed#[7FC8E61B0B7E2ECC]) [ ] o.a.s.c.SolrResourceLoader new SolrResourceLoader for directory: '/home/jenkins/workspace/Lucene-Solr-6.1-Linux/solr/build/solr-core/test/J1/temp/solr.handler.TestReplicationHandler_7FC8E61B0B7E2ECC-001/solr-instance-001'
    [junit4] 2> 1068823 INFO (TEST-TestReplicationHandler.testRateLimitedReplication-seed#[7FC8E61B0B7E2ECC]) [ ] o.a.s.c.SolrResourceLoader JNDI not configured for solr (NoInitialContextEx)
    [junit4] 2> 1068823 INFO (TEST-TestReplicationHandler.testRateLimitedReplication-seed#[7FC8E61B0B7E2ECC]) [ ] o.a.s.c.SolrResourceLoader solr home defaulted to 'solr/' (could not find system property or JNDI)
    [junit4] 2> 1068823 INFO (TEST-TestReplicationHandler.testRateLimitedReplication-seed#[7FC8E61B0B7E2ECC]) [ ] o.a.s.c.SolrXmlConfig Loading container configuration from /home/jenkins/workspace/Lucene-Solr-6.1-Linux/solr/build/solr-core/test/J1/temp/solr.handler.TestReplicationHandler_7FC8E61B0B7E2ECC-001/solr-instance-001/solr.xml
    [junit4] 2> 1068829 INFO (TEST-TestReplicationHandler.testRateLimitedReplication-seed#[7FC8E61B0B7E2ECC]) [ ] o.a.s.c.CorePropertiesLocator Config-defined core root directory: /home/jenkins/workspace/Lucene-Solr-6.1-Linux/solr/build/solr-core/test/J1/temp/solr.handler.TestReplicationHandler_7FC8E61B0B7E2ECC-001/solr-instance-001/.
    [junit4] 2> 1068829 INFO (TEST-TestReplicationHandler.testRateLimitedReplication-seed#[7FC8E61B0B7E2ECC]) [ ] o.a.s.c.CoreContainer New CoreContainer 29761481
    [junit4] 2> 1068829 INFO (TEST-TestReplicationHandler.testRateLimitedReplication-seed#[7FC8E61B0B7E2ECC]) [ ] o.a.s.c.CoreContainer Loading cores into CoreContainer [instanceDir=/home/jenkins/workspace/Lucene-Solr-6.1-Linux/solr/build/solr-core/test/J1/temp/solr.handler.TestReplicationHandler_7FC8E61B0B7E2ECC-001/solr-instance-001]
    [junit4] 2> 1068829 WARN (TEST-TestReplicationHandler.testRateLimitedReplication-seed#[7FC8E61B0B7E2ECC]) [ ] o.a.s.c.CoreContainer Couldn't add files from /home/jenkins/workspace/Lucene-Solr-6.1-Linux/solr/build/solr-core/test/J1/temp/solr.handler.TestReplicationHandler_7FC8E61B0B7E2ECC-001/solr-instance-001/lib to classpath: /home/jenkins/workspace/Lucene-Solr-6.1-Linux/solr/build/solr-core/test/J1/temp/solr.handler.TestReplicationHandler_7FC8E61B0B7E2ECC-001/solr-instance-001/lib
    [junit4] 2> 1068830 INFO (TEST-TestReplicationHandler.testRateLimitedReplication-seed#[7FC8E61B0B7E2ECC]) [ ] o.a.s.h.c.HttpShardHandlerFactory created with socketTimeout : 90000,urlScheme : ,connTimeout : 15000,maxConnectionsPerHost : 20,maxConnections : 10000,corePoolSize : 0,maximumPoolSize : 2147483647,maxThreadIdleTime : 5,sizeOfQueue : -1,fairnessPolicy : false,useRetries : false,
    [junit4] 2> 1068831 INFO (TEST-TestReplicationHandler.testRateLimitedReplication-seed#[7FC8E61B0B7E2ECC]) [ ] o.a.s.u.UpdateShardHandler Creating UpdateShardHandler HTTP client with params: socketTimeout=340000&connTimeout=45000&retry=true
    [junit4] 2> 1068831 INFO (TEST-TestReplicationHandler.testRateLimitedReplication

[...truncated too long message...]

api s:shard1 r:core_node2 x:testschemaapi_shard1_replica2] o.a.s.c.CachingDirectoryFactory looking to close /home/jenkins/workspace/Lucene-Solr-6.1-Linux/solr/build/solr-core/test/J1/temp/solr.schema.TestManagedSchemaAPI_7FC8E61B0B7E2ECC-001/tempDir-001/node2/./testschemaapi_shard1_replica2/data [CachedDir<<refCount=0;path=/home/jenkins/workspace/Lucene-Solr-6.1-Linux/solr/build/solr-core/test/J1/temp/solr.schema.TestManagedSchemaAPI_7FC8E61B0B7E2ECC-001/tempDir-001/node2/./testschemaapi_shard1_replica2/data;done=false>>]
    [junit4] 2> 1999559 INFO (Thread-6006) [n:127.0.0.1:44566_solr c:testschemaapi s:shard1 r:core_node2 x:testschemaapi_shard1_replica2] o.a.s.c.CachingDirectoryFactory Closing directory, CoreContainer#isShutdown=true
    [junit4] 2> 1999559 INFO (Thread-6006) [n:127.0.0.1:44566_solr c:testschemaapi s:shard1 r:core_node2 x:testschemaapi_shard1_replica2] o.a.s.c.CachingDirectoryFactory Closing directory: /home/jenkins/workspace/Lucene-Solr-6.1-Linux/solr/build/solr-core/test/J1/temp/solr.schema.TestManagedSchemaAPI_7FC8E61B0B7E2ECC-001/tempDir-001/node2/./testschemaapi_shard1_replica2/data
    [junit4] 2> 1999559 WARN (Thread-6006) [n:127.0.0.1:44566_solr c:testschemaapi s:shard1 r:core_node2 x:testschemaapi_shard1_replica2] o.a.s.c.ZkController listener throws error
    [junit4] 2> org.apache.solr.common.SolrException: Unable to reload core [testschemaapi_shard1_replica2]
    [junit4] 2> at org.apache.solr.core.CoreContainer.reload(CoreContainer.java:920)
    [junit4] 2> at org.apache.solr.core.SolrCore.lambda$getConfListener$6(SolrCore.java:2510)
    [junit4] 2> at org.apache.solr.cloud.ZkController$4.run(ZkController.java:2408)
    [junit4] 2> Caused by: org.apache.solr.common.SolrException: Could not find config name for collection:testschemaapi
    [junit4] 2> at org.apache.solr.core.SolrCore.<init>(SolrCore.java:773)
    [junit4] 2> at org.apache.solr.core.SolrCore.reload(SolrCore.java:462)
    [junit4] 2> at org.apache.solr.core.CoreContainer.reload(CoreContainer.java:914)
    [junit4] 2> ... 2 more
    [junit4] 2> Caused by: org.apache.solr.common.SolrException: Could not find config name for collection:testschemaapi
    [junit4] 2> at org.apache.solr.rest.ManagedResourceStorage.newStorageIO(ManagedResourceStorage.java:101)
    [junit4] 2> at org.apache.solr.core.SolrCore.initRestManager(SolrCore.java:2305)
    [junit4] 2> at org.apache.solr.core.SolrCore.<init>(SolrCore.java:749)
    [junit4] 2> ... 4 more
    [junit4] 2> Jun 15, 2016 10:53:47 PM com.carrotsearch.randomizedtesting.ThreadLeakControl checkThreadLeaks
    [junit4] 2> WARNING: Will linger awaiting termination of 4 leaked thread(s).
    [junit4] 2> NOTE: test params are: codec=Asserting(Lucene60), sim=RandomSimilarity(queryNorm=true,coord=no): {}, locale=lv-LV, timezone=America/Danmarkshavn
    [junit4] 2> NOTE: Linux 4.4.0-24-generic i386/Oracle Corporation 1.8.0_92 (32-bit)/cpus=12,threads=1,free=85182272,total=439353344
    [junit4] 2> NOTE: All tests run in this JVM: [TestSimpleTrackingShardHandler, BigEndianAscendingWordSerializerTest, WordBreakSolrSpellCheckerTest, FullHLLTest, TestUseDocValuesAsStored, HttpPartitionTest, TestStandardQParsers, TermsComponentTest, DOMUtilTest, TriLevelCompositeIdRoutingTest, SparseHLLTest, ShardRoutingTest, SpatialFilterTest, BlockCacheTest, FastVectorHighlighterTest, TestDocBasedVersionConstraints, TestFieldResource, CustomCollectionTest, TestSystemIdResolver, TestSchemaVersionResource, TestDocumentBuilder, TestManagedSchema, TestLeaderInitiatedRecoveryThread, TestBlobHandler, DistributedQueryComponentCustomSortTest, TestDynamicFieldCollectionResource, IndexBasedSpellCheckerTest, OutOfBoxZkACLAndCredentialsProvidersTest, TestCursorMarkWithoutUniqueKey, TestTolerantUpdateProcessorCloud, TestPerFieldSimilarityClassic, DistributedMLTComponentTest, TestPartialUpdateDeduplication, TestSmileRequest, AnalysisErrorHandlingTest, SpellingQueryConverterTest, ChaosMonkeySafeLeaderTest, TestManagedSynonymFilterFactory, LeaderInitiatedRecoveryOnShardRestartTest, TestFieldCacheWithThreads, TestQuerySenderNoQuery, SaslZkACLProviderTest, RecoveryAfterSoftCommitTest, HighlighterTest, TestCloudDeleteByQuery, OpenExchangeRatesOrgProviderTest, HdfsThreadLeakTest, SolrIndexSplitterTest, SolrInfoMBeanTest, TestLFUCache, TestReloadAndDeleteDocs, TestConfigSets, TestConfigOverlay, MBeansHandlerTest, TestReqParamsAPI, BlockJoinFacetDistribTest, ConvertedLegacyTest, IgnoreCommitOptimizeUpdateProcessorFactoryTest, ClassificationUpdateProcessorFactoryTest, ClusterStateUpdateTest, ChaosMonkeyNothingIsSafeTest, TestSSLRandomization, SuggesterFSTTest, CheckHdfsIndexTest, DistributedFacetPivotSmallAdvancedTest, VersionInfoTest, ZkControllerTest, SortByFunctionTest, TestManagedResourceStorage, SpellCheckComponentTest, SolrPluginUtilsTest, SolrXmlInZkTest, HdfsRecoveryZkTest, MinimalSchemaTest, SimplePostToolTest, TestCodecSupport, OpenCloseCoreStressTest, TestFastLRUCache, TestCustomDocTransformer, TestCollectionAPI, TestSurroundQueryParser, HdfsDirectoryTest, TestBinaryResponseWriter, SpatialRPTFieldTypeTest, TestDistributedGrouping, TestStressVersions, TestExactStatsCache, DateRangeFieldTest, TestPivotHelperCode, TestConfigSetsAPIZkFailure, TestRawResponseWriter, SolrIndexConfigTest, AliasIntegrationTest, TestSolrCLIRunExample, TestTrie, SoftAutoCommitTest, TestReplicationHandler, TestZkChroot, ShardRoutingCustomTest, TestHashPartitioner, TestReload, TestSolr4Spatial, SolrCmdDistributorTest, TestSort, TestIndexSearcher, TestCoreDiscovery, AnalysisAfterCoreReloadTest, SignatureUpdateProcessorFactoryTest, CoreAdminHandlerTest, SolrRequestParserTest, TestStressLucene, TestCSVLoader, PolyFieldTest, SchemaVersionSpecificBehaviorTest, SolrCoreCheckLockOnStartupTest, TestUpdate, FieldMutatingUpdateProcessorTest, TestAtomicUpdateErrorCases, TestWordDelimiterFilterFactory, DirectUpdateHandlerOptimizeTest, DefaultValueUpdateProcessorTest, TestRemoteStreaming, DistanceFunctionTest, XsltUpdateRequestHandlerTest, DisMaxRequestHandlerTest, TestWriterPerf, DocumentAnalysisRequestHandlerTest, TestOmitPositions, PathHierarchyTokenizerFactoryTest, MoreLikeThisHandlerTest, IndexSchemaRuntimeFieldTest, UpdateRequestProcessorFactoryTest, QueryParsingTest, JsonLoaderTest, TestQuerySenderListener, TestSolrDeletionPolicy2, TestBinaryField, NumericFieldsTest, TestFuzzyAnalyzedSuggestions, TestCharFilters, TestXIncludeConfig, TestLMJelinekMercerSimilarityFactory, TestFastWriter, ResourceLoaderTest, DateFieldTest, SliceStateTest, CircularListTest, TestEmbeddedSolrServerConstructors, AsyncCallRequestStatusResponseTest, BaseCdcrDistributedZkTest, CdcrReplicationHandlerTest, CdcrRequestHandlerTest, CleanupOldIndexTest, CollectionReloadTest, ConcurrentDeleteAndCreateCollectionTest, ConfigSetsAPITest, CreateCollectionCleanupTest, DeleteReplicaTest, DistribJoinFromCollectionTest, LeaderFailoverAfterPartitionTest, RemoteQueryErrorTest, SharedFSAutoReplicaFailoverTest, SharedFSAutoReplicaFailoverUtilsTest, TestAuthenticationFramework, TestMiniSolrCloudClusterBase, TestOnReconnectListenerSupport, TestRebalanceLeaders, BlobRepositoryCloudTest, CachingDirectoryFactoryTest, TestInfoStreamLogging, TestShardHandlerFactory, TestSolrConfigHandler, TestSQLHandler, CoreAdminRequestStatusTest, CoreMergeIndexesAdminHandlerTest, SecurityConfHandlerTest, DistributedDebugComponentTest, DistributedExpandComponentTest, DistributedFacetPivotLongTailTest, DistributedFacetPivotSmallTest, DistributedQueryComponentOptimizationTest, FacetPivotSmallTest, SpatialHeatmapFacetsTest, HighlighterMaxOffsetTest, SmileWriterTest, TestIntervalFaceting, TestGeoJSONResponseWriter, TestRawTransformer, TestSolrQueryResponse, TestSortingResponseWriter, TestChildDocTransformer, TestSubQueryTransformer, TestSubQueryTransformerCrossCore, TestSubQueryTransformerDistrib, TestManagedSchemaAPI]
    [junit4] 2> NOTE: reproduce with: ant test -Dtestcase=TestManagedSchemaAPI -Dtests.seed=7FC8E61B0B7E2ECC -Dtests.multiplier=3 -Dtests.slow=true -Dtests.locale=lv-LV -Dtests.timezone=America/Danmarkshavn -Dtests.asserts=true -Dtests.file.encoding=US-ASCII
    [junit4] ERROR 0.00s J1 | TestManagedSchemaAPI (suite) <<<
    [junit4] > Throwable #1: java.lang.AssertionError: ObjectTracker found 4 object(s) that were not released!!! [TransactionLog, MDCAwareThreadPoolExecutor, MockDirectoryWrapper, MockDirectoryWrapper]
    [junit4] > at __randomizedtesting.SeedInfo.seed([7FC8E61B0B7E2ECC]:0)
    [junit4] > at org.apache.solr.SolrTestCaseJ4.teardownTestCases(SolrTestCaseJ4.java:257)
    [junit4] > at java.lang.Thread.run(Thread.java:745)
    [junit4] Completed [551/614 (2!)] on J1 in 13.68s, 1 test, 1 failure <<< FAILURES!

[...truncated 236 lines...]
BUILD FAILED
/home/jenkins/workspace/Lucene-Solr-6.1-Linux/build.xml:740: The following error occurred while executing this line:
/home/jenkins/workspace/Lucene-Solr-6.1-Linux/build.xml:684: The following error occurred while executing this line:
/home/jenkins/workspace/Lucene-Solr-6.1-Linux/build.xml:59: The following error occurred while executing this line:
/home/jenkins/workspace/Lucene-Solr-6.1-Linux/solr/build.xml:233: The following error occurred while executing this line:
/home/jenkins/workspace/Lucene-Solr-6.1-Linux/solr/common-build.xml:531: The following error occurred while executing this line:
/home/jenkins/workspace/Lucene-Solr-6.1-Linux/lucene/common-build.xml:1427: The following error occurred while executing this line:
/home/jenkins/workspace/Lucene-Solr-6.1-Linux/lucene/common-build.xml:984: There were test failures: 614 suites (10 ignored), 2580 tests, 2 suite-level errors, 116 ignored (72 assumptions) [seed: 7FC8E61B0B7E2ECC]

Total time: 62 minutes 44 seconds
Build step 'Invoke Ant' marked build as failure
Archiving artifacts
[WARNINGS] Skipping publisher since build result is FAILURE
Recording test results
Email was triggered for: Failure - Any
Sending email for trigger: Failure - Any

Search Discussions

Discussion Posts

Previous

Related Discussions

Discussion Navigation
viewthread | post
posts ‹ prev | 2 of 2 | next ›
Discussion Overview
groupdev @
categorieslucene
postedJun 15, '16 at 6:34p
activeJun 15, '16 at 10:56p
posts2
users1
websitelucene.apache.org

1 user in discussion

Policeman Jenkins Server: 2 posts

People

Translate

site design / logo © 2017 Grokbase