Grokbase Groups Lucene dev June 2016
FAQ
Build: http://jenkins.thetaphi.de/job/Lucene-Solr-6.1-Linux/40/
Java: 64bit/jdk1.8.0_92 -XX:+UseCompressedOops -XX:+UseSerialGC

1 tests failed.
FAILED: org.apache.solr.handler.TestReplicationHandler.doTestStressReplication

Error Message:
timed out waiting for collection1 startAt time to exceed: Thu Jun 16 04:18:02 AEST 2016

Stack Trace:
java.lang.AssertionError: timed out waiting for collection1 startAt time to exceed: Thu Jun 16 04:18:02 AEST 2016
  at __randomizedtesting.SeedInfo.seed([4D182744B582250E:96B32782B0AA4CBD]:0)
  at org.junit.Assert.fail(Assert.java:93)
  at org.apache.solr.handler.TestReplicationHandler.watchCoreStartAt(TestReplicationHandler.java:1508)
  at org.apache.solr.handler.TestReplicationHandler.doTestStressReplication(TestReplicationHandler.java:858)
  at sun.reflect.NativeMethodAccessorImpl.invoke0(Native Method)
  at sun.reflect.NativeMethodAccessorImpl.invoke(NativeMethodAccessorImpl.java:62)
  at sun.reflect.DelegatingMethodAccessorImpl.invoke(DelegatingMethodAccessorImpl.java:43)
  at java.lang.reflect.Method.invoke(Method.java:498)
  at com.carrotsearch.randomizedtesting.RandomizedRunner.invoke(RandomizedRunner.java:1764)
  at com.carrotsearch.randomizedtesting.RandomizedRunner$8.evaluate(RandomizedRunner.java:871)
  at com.carrotsearch.randomizedtesting.RandomizedRunner$9.evaluate(RandomizedRunner.java:907)
  at com.carrotsearch.randomizedtesting.RandomizedRunner$10.evaluate(RandomizedRunner.java:921)
  at com.carrotsearch.randomizedtesting.rules.SystemPropertiesRestoreRule$1.evaluate(SystemPropertiesRestoreRule.java:57)
  at org.apache.lucene.util.TestRuleSetupTeardownChained$1.evaluate(TestRuleSetupTeardownChained.java:49)
  at org.apache.lucene.util.AbstractBeforeAfterRule$1.evaluate(AbstractBeforeAfterRule.java:45)
  at org.apache.lucene.util.TestRuleThreadAndTestName$1.evaluate(TestRuleThreadAndTestName.java:48)
  at org.apache.lucene.util.TestRuleIgnoreAfterMaxFailures$1.evaluate(TestRuleIgnoreAfterMaxFailures.java:64)
  at org.apache.lucene.util.TestRuleMarkFailure$1.evaluate(TestRuleMarkFailure.java:47)
  at com.carrotsearch.randomizedtesting.rules.StatementAdapter.evaluate(StatementAdapter.java:36)
  at com.carrotsearch.randomizedtesting.ThreadLeakControl$StatementRunner.run(ThreadLeakControl.java:367)
  at com.carrotsearch.randomizedtesting.ThreadLeakControl.forkTimeoutingTask(ThreadLeakControl.java:809)
  at com.carrotsearch.randomizedtesting.ThreadLeakControl$3.evaluate(ThreadLeakControl.java:460)
  at com.carrotsearch.randomizedtesting.RandomizedRunner.runSingleTest(RandomizedRunner.java:880)
  at com.carrotsearch.randomizedtesting.RandomizedRunner$5.evaluate(RandomizedRunner.java:781)
  at com.carrotsearch.randomizedtesting.RandomizedRunner$6.evaluate(RandomizedRunner.java:816)
  at com.carrotsearch.randomizedtesting.RandomizedRunner$7.evaluate(RandomizedRunner.java:827)
  at com.carrotsearch.randomizedtesting.rules.StatementAdapter.evaluate(StatementAdapter.java:36)
  at com.carrotsearch.randomizedtesting.rules.SystemPropertiesRestoreRule$1.evaluate(SystemPropertiesRestoreRule.java:57)
  at org.apache.lucene.util.AbstractBeforeAfterRule$1.evaluate(AbstractBeforeAfterRule.java:45)
  at com.carrotsearch.randomizedtesting.rules.StatementAdapter.evaluate(StatementAdapter.java:36)
  at org.apache.lucene.util.TestRuleStoreClassName$1.evaluate(TestRuleStoreClassName.java:41)
  at com.carrotsearch.randomizedtesting.rules.NoShadowingOrOverridesOnMethodsRule$1.evaluate(NoShadowingOrOverridesOnMethodsRule.java:40)
  at com.carrotsearch.randomizedtesting.rules.NoShadowingOrOverridesOnMethodsRule$1.evaluate(NoShadowingOrOverridesOnMethodsRule.java:40)
  at com.carrotsearch.randomizedtesting.rules.StatementAdapter.evaluate(StatementAdapter.java:36)
  at com.carrotsearch.randomizedtesting.rules.StatementAdapter.evaluate(StatementAdapter.java:36)
  at com.carrotsearch.randomizedtesting.rules.StatementAdapter.evaluate(StatementAdapter.java:36)
  at org.apache.lucene.util.TestRuleAssertionsRequired$1.evaluate(TestRuleAssertionsRequired.java:53)
  at org.apache.lucene.util.TestRuleMarkFailure$1.evaluate(TestRuleMarkFailure.java:47)
  at org.apache.lucene.util.TestRuleIgnoreAfterMaxFailures$1.evaluate(TestRuleIgnoreAfterMaxFailures.java:64)
  at org.apache.lucene.util.TestRuleIgnoreTestSuites$1.evaluate(TestRuleIgnoreTestSuites.java:54)
  at com.carrotsearch.randomizedtesting.rules.StatementAdapter.evaluate(StatementAdapter.java:36)
  at com.carrotsearch.randomizedtesting.ThreadLeakControl$StatementRunner.run(ThreadLeakControl.java:367)
  at java.lang.Thread.run(Thread.java:745)




Build Log:
[...truncated 11565 lines...]
    [junit4] Suite: org.apache.solr.handler.TestReplicationHandler
    [junit4] 2> Creating dataDir: /home/jenkins/workspace/Lucene-Solr-6.1-Linux/solr/build/solr-core/test/J1/temp/solr.handler.TestReplicationHandler_4D182744B582250E-001/init-core-data-001
    [junit4] 2> 974291 INFO (SUITE-TestReplicationHandler-seed#[4D182744B582250E]-worker) [ ] o.a.s.SolrTestCaseJ4 Randomized ssl (false) and clientAuth (false) via: @org.apache.solr.SolrTestCaseJ4$SuppressSSL(bugUrl=None)
    [junit4] 2> 974292 INFO (TEST-TestReplicationHandler.doTestDetails-seed#[4D182744B582250E]) [ ] o.a.s.SolrTestCaseJ4 ###Starting doTestDetails
    [junit4] 2> 974293 INFO (TEST-TestReplicationHandler.doTestDetails-seed#[4D182744B582250E]) [ ] o.a.s.SolrTestCaseJ4 Writing core.properties file to /home/jenkins/workspace/Lucene-Solr-6.1-Linux/solr/build/solr-core/test/J1/temp/solr.handler.TestReplicationHandler_4D182744B582250E-001/solr-instance-001/collection1
    [junit4] 2> 974295 INFO (TEST-TestReplicationHandler.doTestDetails-seed#[4D182744B582250E]) [ ] o.e.j.s.Server jetty-9.3.8.v20160314
    [junit4] 2> 974296 INFO (TEST-TestReplicationHandler.doTestDetails-seed#[4D182744B582250E]) [ ] o.e.j.s.h.ContextHandler Started o.e.j.s.ServletContextHandler@272fc427{/solr,null,AVAILABLE}
    [junit4] 2> 974297 INFO (TEST-TestReplicationHandler.doTestDetails-seed#[4D182744B582250E]) [ ] o.e.j.s.ServerConnector Started ServerConnector@5c037b03{HTTP/1.1,[http/1.1]}{127.0.0.1:35150}
    [junit4] 2> 974297 INFO (TEST-TestReplicationHandler.doTestDetails-seed#[4D182744B582250E]) [ ] o.e.j.s.Server Started @976032ms
    [junit4] 2> 974297 INFO (TEST-TestReplicationHandler.doTestDetails-seed#[4D182744B582250E]) [ ] o.a.s.c.s.e.JettySolrRunner Jetty properties: {solr.data.dir=/home/jenkins/workspace/Lucene-Solr-6.1-Linux/solr/build/solr-core/test/J1/temp/solr.handler.TestReplicationHandler_4D182744B582250E-001/solr-instance-001/collection1/data, hostContext=/solr, hostPort=35150}
    [junit4] 2> 974297 INFO (TEST-TestReplicationHandler.doTestDetails-seed#[4D182744B582250E]) [ ] o.a.s.s.SolrDispatchFilter SolrDispatchFilter.init(): sun.misc.Launcher$AppClassLoader@73d16e93
    [junit4] 2> 974297 INFO (TEST-TestReplicationHandler.doTestDetails-seed#[4D182744B582250E]) [ ] o.a.s.c.SolrResourceLoader new SolrResourceLoader for directory: '/home/jenkins/workspace/Lucene-Solr-6.1-Linux/solr/build/solr-core/test/J1/temp/solr.handler.TestReplicationHandler_4D182744B582250E-001/solr-instance-001'
    [junit4] 2> 974297 INFO (TEST-TestReplicationHandler.doTestDetails-seed#[4D182744B582250E]) [ ] o.a.s.c.SolrResourceLoader JNDI not configured for solr (NoInitialContextEx)
    [junit4] 2> 974297 INFO (TEST-TestReplicationHandler.doTestDetails-seed#[4D182744B582250E]) [ ] o.a.s.c.SolrResourceLoader solr home defaulted to 'solr/' (could not find system property or JNDI)
    [junit4] 2> 974298 INFO (TEST-TestReplicationHandler.doTestDetails-seed#[4D182744B582250E]) [ ] o.a.s.c.SolrXmlConfig Loading container configuration from /home/jenkins/workspace/Lucene-Solr-6.1-Linux/solr/build/solr-core/test/J1/temp/solr.handler.TestReplicationHandler_4D182744B582250E-001/solr-instance-001/solr.xml
    [junit4] 2> 974301 INFO (TEST-TestReplicationHandler.doTestDetails-seed#[4D182744B582250E]) [ ] o.a.s.c.CorePropertiesLocator Config-defined core root directory: /home/jenkins/workspace/Lucene-Solr-6.1-Linux/solr/build/solr-core/test/J1/temp/solr.handler.TestReplicationHandler_4D182744B582250E-001/solr-instance-001/.
    [junit4] 2> 974301 INFO (TEST-TestReplicationHandler.doTestDetails-seed#[4D182744B582250E]) [ ] o.a.s.c.CoreContainer New CoreContainer 1099888402
    [junit4] 2> 974301 INFO (TEST-TestReplicationHandler.doTestDetails-seed#[4D182744B582250E]) [ ] o.a.s.c.CoreContainer Loading cores into CoreContainer [instanceDir=/home/jenkins/workspace/Lucene-Solr-6.1-Linux/solr/build/solr-core/test/J1/temp/solr.handler.TestReplicationHandler_4D182744B582250E-001/solr-instance-001]
    [junit4] 2> 974301 WARN (TEST-TestReplicationHandler.doTestDetails-seed#[4D182744B582250E]) [ ] o.a.s.c.CoreContainer Couldn't add files from /home/jenkins/workspace/Lucene-Solr-6.1-Linux/solr/build/solr-core/test/J1/temp/solr.handler.TestReplicationHandler_4D182744B582250E-001/solr-instance-001/lib to classpath: /home/jenkins/workspace/Lucene-Solr-6.1-Linux/solr/build/solr-core/test/J1/temp/solr.handler.TestReplicationHandler_4D182744B582250E-001/solr-instance-001/lib
    [junit4] 2> 974301 INFO (TEST-TestReplicationHandler.doTestDetails-seed#[4D182744B582250E]) [ ] o.a.s.h.c.HttpShardHandlerFactory created with socketTimeout : 90000,urlScheme : ,connTimeout : 15000,maxConnectionsPerHost : 20,maxConnections : 10000,corePoolSize : 0,maximumPoolSize : 2147483647,maxThreadIdleTime : 5,sizeOfQueue : -1,fairnessPolicy : false,useRetries : false,
    [junit4] 2> 974302 INFO (TEST-TestReplicationHandler.doTestDetails-seed#[4D182744B582250E]) [ ] o.a.s.u.UpdateShardHandler Creating UpdateShardHandler HTTP client with params: socketTimeout=340000&connTimeout=45000&retry=true
    [junit4] 2> 974302 INFO (TEST-TestReplicationHandler.doTestDetails-seed#[4D182744B582250E]) [ ] o.a.s.l.LogWatcher SLF4J impl is org.slf4j.impl.Log4jLoggerFactory
    [junit4] 2> 974302 INFO (TEST-TestReplicationHandler.doTestDetails-seed#[4D182744B582250E]) [ ] o.a.s.l.LogWatcher Registering Log Listener [Log4j (org.slf4j.impl.Log4jLoggerFactory)]
    [junit4] 2> 974302 INFO (TEST-TestReplicationHandler.doTestDetails-seed#[4D182744B582250E]) [ ] o.a.s.c.CoreContainer Security conf doesn't exist. Skipping setup for authorization module.
    [junit4] 2> 974302 INFO (TEST-TestReplicationHandler.doTestDetails-seed#[4D182744B582250E]) [ ] o.a.s.c.CoreContainer No authentication plugin used.
    [junit4] 2> 974302 INFO (TEST-TestReplicationHandler.doTestDetails-seed#[4D182744B582250E]) [ ] o.a.s.c.CorePropertiesLocator Looking for core definitions underneath /home/jenkins/workspace/Lucene-Solr-6.1-Linux/solr/build/solr-core/test/J1/temp/solr.handler.TestReplicationHandler_4D182744B582250E-001/solr-instance-001/.
    [junit4] 2> 974303 INFO (TEST-TestReplicationHandler.doTestDetails-seed#[4D182744B582250E]) [ ] o.a.s.c.CoreDescriptor Created CoreDescriptor: {name=collection1, config=solrconfig.xml, loadOnStartup=true, schema=schema.xml, configSetProperties=configsetprops.json, transient=false, dataDir=data/}
    [junit4] 2> 974303 INFO (TEST-TestReplicationHandler.doTestDetails-seed#[4D182744B582250E]) [ ] o.a.s.c.CorePropertiesLocator Found core collection1 in /home/jenkins/workspace/Lucene-Solr-6.1-Linux/solr/build/solr-core/test/J1/temp/solr.handler.TestReplicationHandler_4D182744B582250E-001/solr-instance-001/./collection1
    [junit4] 2> 974303 INFO (TEST-TestReplicationHandler.doTestDetails-seed#[4D182744B582250E]) [ ] o.a.s.c.CorePropertiesLocator Found 1 core definitions
    [junit4] 2> 974303 INFO (coreLoadExecutor-4203-thread-1) [ ] o.a.s.c.SolrResourceLoader new SolrResourceLoader for directory: '/home/jenkins/workspace/Lucene-Solr-6.1-Linux/solr/build/solr-core/test/J1/temp/solr.handler.TestReplicationHandler_4D182744B582250E-001/solr-instance-001/collection1'
    [junit4] 2> 974303 INFO (coreLoadExecutor-4203-thread-1) [ ] o.a.s.c.SolrResourceLoader JNDI not configured for solr (NoInitialContextEx)
    [junit4] 2> 974303 INFO (coreLoadExecutor-4203-thread-1) [ ] o.a.s.c.SolrResourceLoader solr home defaulted to 'solr/' (could not find system property or JNDI)
    [junit4] 2> 974304 INFO (TEST-TestReplicationHandler.doTestDetails-seed#[4D182744B582250E]) [ ] o.a.s.s.SolrDispatchFilter user.dir=/home/jenkins/workspace/Lucene-Solr-6.1-Linux/solr/build/solr-core/test/J1
    [junit4] 2> 974305 INFO (TEST-TestReplicationHandler.doTestDetails-seed#[4D182744B582250E]) [ ] o.a.s.s.SolrDispatchFilter SolrDispatchFilter.init() done
    [junit4] 2> 974307 INFO (coreLoadExecutor-4203-thread-1) [ ] o.a.s.c.SolrConfig current version of requestparams : -1
    [junit4] 2> 974309 WARN (coreLoadExecutor-4203-thread-1) [ ] o.a.s.c.Config Beginning with Solr 5.5, <mergePolicy> is deprecated, use <mergePolicyFactory> instead.
    [junit4] 2> 974309 INFO (coreLoadExecutor-4203-thread-1) [ ] o.a.s.c.SolrConfig Using Lucene MatchVersion: 6.1.0
    [junit4] 2> 974313 INFO (coreLoadExecutor-4203-thread-1) [ ] o.a.s.c.SolrConfig Loaded SolrConfig: solrconfig.xml
    [junit4] 2> 974315 INFO (coreLoadExecutor-4203-thread-1) [ ] o.a.s.s.IndexSchema [collection1] Schema name=test
    [junit4] 2> 974316 INFO (coreLoadExecutor-4203-thread-1) [ ] o.a.s.s.IndexSchema unique key field: id
    [junit4] 2> 974317 INFO (coreLoadExecutor-4203-thread-1) [ ] o.a.s.c.ConfigSetProperties Did not find ConfigSet properties, assuming default properties: Can't find resource 'configsetprops.json' in classpath or '/home/jenkins/workspace/Lucene-Solr-6.1-Linux/solr/build/solr-core/test/J1/temp/solr.handler.TestReplicationHandler_4D182744B582250E-001/solr-instance-001/collection1'
    [junit4] 2> 974317 INFO (coreLoadExecutor-4203-thread-1) [ ] o.a.s.c.CoreContainer Creating SolrCore 'collection1' using configuration from instancedir /home/jenkins/workspace/Lucene-Solr-6.1-Linux/solr/build/solr-core/test/J1/temp/solr.handler.TestReplicationHandler_4D182744B582250E-001/solr-instance-001/./collection1
    [junit4] 2> 974317 INFO (coreLoadExecutor-4203-thread-1) [ x:collection1] o.a.s.c.SolrCore org.apache.solr.core.MockDirectoryFactory
    [junit4] 2> 974317 INFO (coreLoadExecutor-4203-thread-1) [ x:collection1] o.a.s.c.SolrCore [[collection1] ] Opening new SolrCore at [/home/jenkins/workspace/Lucene-Solr-6.1-Linux/solr/build/solr-core/test/J1/temp/solr.handler.TestReplicationHandler_4D182744B582250E-001/solr-instance-001/collection1], dataDir=[/home/jenkins/workspace/Lucene-Solr-6.1-Linux/solr/build/solr-core/test/J1/temp/solr.handler.TestReplicationHandler_4D182744B582250E-001/solr-instance-001/./collection1/data/]
    [junit4] 2> 974317 INFO (coreLoadExecutor-4203-thread-1) [ x:collection1] o.a.s.c.SolrCore JMX monitoring not detected for core: collection1
    [junit4] 2> 974318 INFO (coreLoadExecutor-4203-thread-1) [ x:collection1] o.a.s.c.CachingDirectoryFactory return new directory for /home/jenkins/workspace/Lucene-Solr-6.1-Linux/solr/build/solr-core/test/J1/temp/solr.handler.TestReplicationHandler_4D182744B582250E-001/solr-instance-001/./collection1/data
    [junit4] 2> 974318 INFO (coreLoadExecutor-4203-thread-1) [ x:collection1] o.a.s.c.SolrCore New index directory detected: old=null new=/home/jenkins/workspace/Lucene-Solr-6.1-Linux/solr/build/solr-core/test/J1/temp/solr.handler.TestReplicationHandler_4D182744B582250E-001/solr-instance-001/./collection1/data/index/
    [junit4] 2> 974318 WARN (coreLoadExecutor-4203-thread-1) [ x:collection1] o.a.s.c.SolrCore [collection1] Solr index directory '/home/jenkins/workspace/Lucene-Solr-6.1-Linux/solr/build/solr-core/test/J1/temp/solr.handler.TestReplicationHandler_4D182744B582250E-001/solr-instance-001/./collection1/data/index' doesn't exist. Creating new index...
    [junit4] 2> 974318 INFO (coreLoadExecutor-4203-thread-1) [ x:collection1] o.a.s.c.CachingDirectoryFactory return new directory for /home/jenkins/workspace/Lucene-Solr-6.1-Linux/solr/build/solr-core/test/J1/temp/solr.handler.TestReplicationHandler_4D182744B582250E-001/solr-instance-001/./collection1/data/index
    [junit4] 2> 974318 INFO (coreLoadExecutor-4203-thread-1) [ x:collection1] o.a.s.u.RandomMergePolicy RandomMergePolicy wrapping class org.apache.lucene.index.LogByteSizeMergePolicy: [LogByteSizeMergePolicy: minMergeSize=1677721, mergeFactor=31, maxMergeSize=2147483648, maxMergeSizeForForcedMerge=9223372036854775807, calibrateSizeByDeletes=true, maxMergeDocs=2147483647, maxCFSSegmentSizeMB=8.796093022207999E12, noCFSRatio=0.44318497733250684]
    [junit4] 2> 974318 INFO (coreLoadExecutor-4203-thread-1) [ x:collection1] o.a.s.c.SolrDeletionPolicy SolrDeletionPolicy.onCommit: commits: num=1
    [junit4] 2> commit{dir=MockDirectoryWrapper(RAMDirectory@7125223e lockFactory=org.apache.lucene.store.SingleInstanceLockFactory@1d4f393e),segFN=segments_1,generation=1}
    [junit4] 2> 974318 INFO (coreLoadExecutor-4203-thread-1) [ x:collection1] o.a.s.c.SolrDeletionPolicy newest commit generation = 1
    [junit4] 2> 974318 INFO (OldIndexDirectoryCleanupThreadForCore-collection1) [ x:collection1] o.a.s.c.SolrCore Looking for old index directories to cleanup for core collection1 in /home/jenkins/workspace/Lucene-Solr-6.1-Linux/solr/build/solr-core/test/J1/temp/solr.handler.TestReplicationHandler_4D182744B582250E-001/solr-instance-001/./collection1/data/
    [junit4] 2> 974319 INFO (coreLoadExecutor-4203-thread-1) [ x:collection1] o.a.s.c.SolrCore no updateRequestProcessorChain defined as default, creating implicit default
    [junit4] 2> 974320 INFO (coreLoadExecutor-4203-thread-1) [ x:collection1] o.a.s.h.l.XMLLoader xsltCacheLifetimeSeconds=60
    [junit4] 2> 974321 INFO (coreLoadExecutor-4203-thread-1) [ x:collection1] o.a.s.h.l.XMLLoader xsltCacheLifetimeSeconds=60
    [junit4] 2> 974321 INFO (coreLoadExecutor-4203-thread-1) [ x:collection1] o.a.s.h.l.XMLLoader xsltCacheLifetimeSeconds=60
    [junit4] 2> 974322 INFO (coreLoadExecutor-4203-thread-1) [ x:collection1] o.a.s.h.l.XMLLoader xsltCacheLifetimeSeconds=60
    [junit4] 2> 974322 INFO (coreLoadExecutor-4203-thread-1) [ x:collection1] o.a.s.c.PluginBag requestHandler : 'lazy' created with startup=lazy
    [junit4] 2> 974322 INFO (coreLoadExecutor-4203-thread-1) [ x:collection1] o.a.s.c.RequestHandlers Registered paths: /admin/mbeans,standard,lazy,/update/json/docs,/admin/luke,/export,/get,/admin/properties,/update/json,/admin/threads,/update/csv,/sql,/graph,/admin/segments,/admin/system,/replication,defaults,/config,/stream,/schema,/admin/plugins,/admin/logging,/admin/ping,/update,/admin/file
    [junit4] 2> 974322 INFO (coreLoadExecutor-4203-thread-1) [ x:collection1] o.a.s.c.SolrCore Using default statsCache cache: org.apache.solr.search.stats.LocalStatsCache
    [junit4] 2> 974322 INFO (coreLoadExecutor-4203-thread-1) [ x:collection1] o.a.s.u.CommitTracker Hard AutoCommit: disabled
    [junit4] 2> 974322 INFO (coreLoadExecutor-4203-thread-1) [ x:collection1] o.a.s.u.CommitTracker Soft AutoCommit: disabled
    [junit4] 2> 974322 INFO (coreLoadExecutor-4203-thread-1) [ x:collection1] o.a.s.u.RandomMergePolicy RandomMergePolicy wrapping class org.apache.lucene.index.TieredMergePolicy: [TieredMergePolicy: maxMergeAtOnce=45, maxMergeAtOnceExplicit=16, maxMergedSegmentMB=50.490234375, floorSegmentMB=0.8076171875, forceMergeDeletesPctAllowed=25.97303430775478, segmentsPerTier=12.0, maxCFSSegmentSizeMB=8.796093022207999E12, noCFSRatio=0.5861128307594922
    [junit4] 2> 974323 INFO (coreLoadExecutor-4203-thread-1) [ x:collection1] o.a.s.c.SolrDeletionPolicy SolrDeletionPolicy.onInit: commits: num=1
    [junit4] 2> commit{dir=MockDirectoryWrapper(RAMDirectory@7125223e lockFactory=org.apache.lucene.store.SingleInstanceLockFactory@1d4f393e),segFN=segments_1,generation=1}
    [junit4] 2> 974323 INFO (coreLoadExecutor-4203-thread-1) [ x:collection1] o.a.s.c.SolrDeletionPolicy newest commit generation = 1
    [junit4] 2> 974323 INFO (coreLoadExecutor-4203-thread-1) [ x:collection1] o.a.s.s.SolrIndexSearcher Opening [Searcher@4d627b48[collection1] main]
    [junit4] 2> 974323 INFO (coreLoadExecutor-4203-thread-1) [ x:collection1] o.a.s.r.ManagedResourceStorage File-based storage initialized to use dir: /home/jenkins/workspace/Lucene-Solr-6.1-Linux/solr/build/solr-core/test/J1/temp/solr.handler.TestReplicationHandler_4D182744B582250E-001/solr-instance-001/collection1/conf
    [junit4] 2> 974323 INFO (coreLoadExecutor-4203-thread-1) [ x:collection1] o.a.s.r.RestManager Initializing RestManager with initArgs: {storageDir=/home/jenkins/workspace/Lucene-Solr-6.1-Linux/solr/build/solr-core/test/J1/temp/solr.handler.TestReplicationHandler_4D182744B582250E-001/solr-instance-001/collection1/conf}
    [junit4] 2> 974323 INFO (coreLoadExecutor-4203-thread-1) [ x:collection1] o.a.s.r.ManagedResourceStorage Reading _rest_managed.json using file:dir=/home/jenkins/workspace/Lucene-Solr-6.1-Linux/solr/build/solr-core/test/J1/temp/solr.handler.TestReplicationHandler_4D182744B582250E-001/solr-instance-001/collection1/conf
    [junit4] 2> 974323 INFO (coreLoadExecutor-4203-thread-1) [ x:collection1] o.a.s.r.RestManager Initializing 0 registered ManagedResources
    [junit4] 2> 974323 INFO (coreLoadExecutor-4203-thread-1) [ x:collection1] o.a.s.h.ReplicationHandler Replication enabled for following config files: schema.xml,xslt/dummy.xsl
    [junit4] 2> 974323 INFO (coreLoadExecutor-4203-thread-1) [ x:collection1] o.a.s.h.ReplicationHandler Commits will be reserved for 10000
    [junit4] 2> 974323 INFO (searcherExecutor-4204-thread-1-processing-x:collection1) [ x:collection1] o.a.s.c.SolrCore [collection1] Registered new searcher Searcher@4d627b48[collection1] main{ExitableDirectoryReader(UninvertingDirectoryReader())}
    [junit4] 2> 974323 INFO (coreLoadExecutor-4203-thread-1) [ x:collection1] o.a.s.c.CoreContainer registering core: collection1
    [junit4] 2> 974805 INFO (TEST-TestReplicationHandler.doTestDetails-seed#[4D182744B582250E]) [ ] o.a.s.SolrTestCaseJ4 Writing core.properties file to /home/jenkins/workspace/Lucene-Solr-6.1-Linux/solr/build/solr-core/test/J1/temp/solr.handler.TestReplicationHandler_4D182744B582250E-001/solr-instance-002/collection1
    [junit4] 2> 974807 INFO (TEST-TestReplicationHandler.doTestDetails-seed#[4D182744B582250E]) [ ] o.e.j.s.Server jetty-9.3.8.v20160314
    [junit4] 2> 974808 INFO (TEST-TestReplicationHandler.doTestDetails-seed#[4D182744B582250E]) [ ] o.e.j.s.h.ContextHandler Started o.e.j.s.ServletContextHandler@21fc05bc{/solr,null,AVAILABLE}
    [junit4] 2> 974808 INFO (TEST-TestReplicationHandler.doTestDetails-seed#[4D182744B582250E]) [ ] o.e.j.s.ServerConnector Started ServerConnector@299f8718{HTTP/1.1,[http/1.1]}{127.0.0.1:40904}
    [junit4] 2> 974809 INFO (TEST-TestReplicationHandler.doTestDetails-seed#[4D182744B582250E]) [ ] o.e.j.s.Server Started @976544ms
    [junit4] 2> 974809 INFO (TEST-TestReplicationHandler.doTestDetails-seed#[4D182744B582250E]) [ ] o.a.s.c.s.e.JettySolrRunner Jetty properties: {solr.data.dir=/home/jenkins/workspace/Lucene-Solr-6.1-Linux/solr/build/solr-core/test/J1/temp/solr.handler.TestReplicationHandler_4D182744B582250E-001/solr-instance-002/collection1/data, hostContext=/solr, hostPort=40904}
    [junit4] 2> 974809 INFO (TEST-TestReplicationHandler.doTestDetails-seed#[4D182744B582250E]) [ ] o.a.s.s.SolrDispatchFilter SolrDispatchFilter.init(): sun.misc.Launcher$AppClassLoader@73d16e93
    [junit4] 2> 974809 INFO (TEST-TestReplicationHandler.doTestDetails-seed#[4D182744B582250E]) [ ] o.a.s.c.SolrResourceLoader new SolrResourceLoader for directory: '/home/jenkins/workspace/Lucene-Solr-6.1-Linux/solr/build/solr-core/test/J1/temp/solr.handler.TestReplicationHandler_4D182744B582250E-001/solr-instance-002'
    [junit4] 2> 974809 INFO (TEST-TestReplicationHandler.doTestDetails-seed#[4D182744B582250E]) [ ] o.a.s.c.SolrResourceLoader JNDI not configured for solr (NoInitialContextEx)
    [junit4] 2> 974809 INFO (TEST-TestReplicationHandler.doTestDetails-seed#[4D182744B582250E]) [ ] o.a.s.c.SolrResourceLoader solr home defaulted to 'solr/' (could not find system property or JNDI)
    [junit4] 2> 974809 INFO (TEST-TestReplicationHandler.doTestDetails-seed#[4D182744B582250E]) [ ] o.a.s.c.SolrXmlConfig Loading container configuration from /home/jenkins/workspace/Lucene-Solr-6.1-Linux/solr/build/solr-core/test/J1/temp/solr.handler.TestReplicationHandler_4D182744B582250E-001/solr-instance-002/solr.xml
    [junit4] 2> 974812 INFO (TEST-TestReplicationHandler.doTestDetails-seed#[4D182744B582250E]) [ ] o.a.s.c.CorePropertiesLocator Config-defined core root directory: /home/jenkins/workspace/Lucene-Solr-6.1-Linux/solr/build/solr-core/test/J1/temp/solr.handler.TestReplicationHandler_4D182744B582250E-001/solr-instance-002/.
    [junit4] 2> 974812 INFO (TEST-TestReplicationHandler.doTestDetails-seed#[4D182744B582250E]) [ ] o.a.s.c.CoreContainer New CoreContainer 2037545070
    [junit4] 2> 974812 INFO (TEST-TestReplicationHandler.doTestDetails-seed#[4D182744B582250E]) [ ] o.a.s.c.CoreContainer Loading cores into CoreContainer [instanceDir=/home/jenkins/workspace/Lucene-Solr-6.1-Linux/solr/build/solr-core/test/J1/temp/solr.handler.TestReplicationHandler_4D182744B582250E-001/solr-instance-002]
    [junit4] 2> 974812 WARN (TEST-TestReplicationHandler.doTestDetails-seed#[4D182744B582250E]) [ ] o.a.s.c.CoreContainer Couldn't add files from /home/jenkins/workspace/Lucene-Solr-6.1-Linux/solr/build/solr-core/test/J1/temp/solr.handler.TestReplicationHandler_4D182744B582250E-001/solr-instance-002/lib to classpath: /home/jenkins/workspace/Lucene-Solr-6.1-Linux/solr/build/solr-core/test/J1/temp/solr.handler.TestReplicationHandler_4D182744B582250E-001/solr-instance-002/lib
    [junit4] 2> 974812 INFO (TEST-TestReplicationHandler.doTestDetails-seed#[4D182744B582250E]) [ ] o.a.s.h.c.HttpShardHandlerFactory created with socketTimeout : 90000,urlScheme : ,connTimeout : 15000,maxConnectionsPerHost : 20,maxConnections : 10000,corePoolSize : 0,maximumPoolSize : 2147483647,maxThreadIdleTime : 5,sizeOfQueue : -1,fairnessPolicy : false,useRetries : false,
    [junit4] 2> 974812 INFO (TEST-TestReplicationHandler.doTestDetails-seed#[4D182744B582250E]) [ ] o.a.s.u.UpdateShardHandler Creating UpdateShardHandler HTTP client with params: socketTimeout=340000&connTimeout=45000&retry=true
    [junit4] 2> 974813 INFO (TEST-TestReplicationHandler.doTestDetails-seed#[4D182744B582250E]) [ ] o.a.s.l.LogWatcher SLF4J impl is org.slf4j.impl.Log4jLoggerFactory
    [junit4] 2> 974813 INFO (TEST-TestReplicationHandler.doTestDetails-seed#[4D182744B582250E]) [ ] o.a.s.l.LogWatcher Registering Log Listener [Log4j (org.slf4j.impl.Log4jLoggerFactory)]
    [junit4] 2> 974813 INFO (TEST-TestReplicationHandler.doTestDetails-seed#[4D182744B582250E]) [ ] o.a.s.c.CoreContainer Security conf doesn't exist. Skipping setup for authorization module.
    [junit4] 2> 974813 INFO (TEST-TestReplicationHandler.doTestDetails-seed#[4D182744B582250E]) [ ] o.a.s.c.CoreContainer No authentication plugin used.
    [junit4] 2> 974813 INFO (TEST-TestReplicationHandler.doTestDetails-seed#[4D182744B582250E]) [ ] o.a.s.c.CorePropertiesLocator Looking for core definitions underneath /home/jenkins/workspace/Lucene-Solr-6.1-Linux/solr/build/solr-core/test/J1/temp/solr.handler.TestReplicationHandler_4D182744B582250E-001/solr-instance-002/.
    [junit4] 2> 974814 INFO (TEST-TestReplicationHandler.doTestDetails-seed#[4D182744B582250E]) [ ] o.a.s.c.CoreDescriptor Created CoreDescriptor: {name=collection1, config=solrconfig.xml, loadOnStartup=true, schema=schema.xml, configSetProperties=configsetprops.json, transient=false, dataDir=data/}
    [junit4] 2> 974814 INFO (TEST-TestReplicationHandler.doTestDetails-seed#[4D182744B582250E]) [ ] o.a.s.c.CorePropertiesLocator Found core collection1 in /home/jenkins/workspace/Lucene-Solr-6.1-Linux/solr/build/solr-core/test/J1/temp/solr.handler.TestReplicationHandler_4D182744B582250E-001/solr-instance-002/./collection1
    [junit4] 2> 974814 INFO (TEST-TestReplicationHandler.doTestDetails-seed#[4D182744B582250E]) [ ] o.a.s.c.CorePropertiesLocator Found 1 core definitions
    [junit4] 2> 974814 INFO (coreLoadExecutor-4213-thread-1) [ ] o.a.s.c.SolrResourceLoader new SolrResourceLoader for directory: '/home/jenkins/workspace/Lucene-Solr-6.1-Linux/solr/build/solr-core/test/J1/temp/solr.handler.TestReplicationHandler_4D182744B582250E-001/solr-instance-002/collection1'
    [junit4] 2> 974814 INFO (TEST-TestReplicationHandler.doTestDetails-seed#[4D182744B582250E]) [ ] o.a.s.s.SolrDispatchFilter user.dir=/home/jenkins/workspace/Lucene-Solr-6.1-Linux/solr/build/solr-core/test/J1
    [junit4] 2> 974814 INFO (TEST-TestReplicationHandler.doTestDetails-seed#[4D182744B582250E]) [ ] o.a.s.s.SolrDispatchFilter SolrDispatchFilter.init() done
    [junit4] 2> 974814 INFO (coreLoadExecutor-4213-thread-1) [ ] o.a.s.c.SolrResourceLoader JNDI not configured for solr (NoInitialContextEx)
    [junit4] 2> 974814 INFO (coreLoadExecutor-4213-thread-1) [ ] o.a.s.c.SolrResourceLoader solr home defaulted to 'solr/' (could not find system property or JNDI)
    [junit4] 2> 974818 INFO (coreLoadExecutor-4213-thread-1) [ ] o.a.s.c.SolrConfig current version of requestparams : -1
    [junit4] 2> 974819 WARN (coreLoadExecutor-4213-thread-1) [ ] o.a.s.c.Config Beginning with Solr 5.5, <mergePolicy> is deprecated, use <mergePolicyFactory> instead.
    [junit4] 2> 974819 INFO (coreLoadExecutor-4213-thread-1) [ ] o.a.s.c.SolrConfig Using Lucene MatchVersion: 6.1.0
    [junit4] 2> 974823 INFO (coreLoadExecutor-4213-thread-1) [ ] o.a.s.c.SolrConfig Loaded SolrConfig: solrconfig.xml
    [junit4] 2> 974824 INFO (coreLoadExecutor-4213-thread-1) [ ] o.a.s.s.IndexSchema [collection1] Schema name=test
    [junit4] 2> 974826 INFO (coreLoadExecutor-4213-thread-1) [ ] o.a.s.s.IndexSchema unique key field: id
    [junit4] 2> 974826 INFO (coreLoadExecutor-4213-thread-1) [ ] o.a.s.c.ConfigSetProperties Did not find ConfigSet properties, assuming default properties: Can't find resource 'configsetprops.json' in classpath or '/home/jenkins/workspace/Lucene-Solr-6.1-Linux/solr/build/solr-core/test/J1/temp/solr.handler.TestReplicationHandler_4D182744B582250E-001/solr-instance-002/collection1'
    [junit4] 2> 974826 INFO (coreLoadExecutor-4213-thread-1) [ ] o.a.s.c.CoreContainer Creating SolrCore 'collection1' using configuration from instancedir /home/jenkins/workspace/Lucene-Solr-6.1-Linux/solr/build/solr-core/test/J1/temp/solr.handler.TestReplicationHandler_4D182744B582250E-001/solr-instance-002/./collection1
    [junit4] 2> 974826 INFO (coreLoadExecutor-4213-thread-1) [ x:collection1] o.a.s.c.SolrCore org.apache.solr.core.MockDirectoryFactory
    [junit4] 2> 974826 INFO (coreLoadExecutor-4213-thread-1) [ x:collection1] o.a.s.c.SolrCore [[collection1] ] Opening new SolrCore at [/home/jenkins/workspace/Lucene-Solr-6.1-Linux/solr/build/solr-core/test/J1/temp/solr.handler.TestReplicationHandler_4D182744B582250E-001/solr-instance-002/collection1], dataDir=[/home/jenkins/workspace/Lucene-Solr-6.1-Linux/solr/build/solr-core/test/J1/temp/solr.handler.TestReplicationHandler_4D182744B582250E-001/solr-instance-002/./collection1/data/]
    [junit4] 2> 974826 INFO (coreLoadExecutor-4213-thread-1) [ x:collection1] o.a.s.c.SolrCore JMX monitoring not detected for core: collection1
    [junit4] 2> 974827 INFO (coreLoadExecutor-4213-thread-1) [ x:collection1] o.a.s.c.CachingDirectoryFactory return new directory for /home/jenkins/workspace/Lucene-Solr-6.1-Linux/solr/build/solr-core/test/J1/temp/solr.handler.TestReplicationHandler_4D182744B582250E-001/solr-instance-002/./collection1/data
    [junit4] 2> 974827 INFO (coreLoadExecutor-4213-thread-1) [ x:collection1] o.a.s.c.SolrCore New index directory detected: old=null new=/home/jenkins/workspace/Lucene-Solr-6.1-Linux/solr/build/solr-core/test/J1/temp/solr.handler.TestReplicationHandler_4D182744B582250E-001/solr-instance-002/./collection1/data/index/
    [junit4] 2> 974827 WARN (coreLoadExecutor-4213-thread-1) [ x:collection1] o.a.s.c.SolrCore [collection1] Solr index directory '/home/jenkins/workspace/Lucene-Solr-6.1-Linux/solr/build/solr-core/test/J1/temp/solr.handler.TestReplicationHandler_4D182744B582250E-001/solr-instance-002/./collection1/data/index' doesn't exist. Creating new index...
    [junit4] 2> 974827 INFO (coreLoadExecutor-4213-thread-1) [ x:collection1] o.a.s.c.CachingDirectoryFactory return new directory for /home/jenkins/workspace/Lucene-Solr-6.1-Linux/solr/build/solr-core/test/J1/temp/solr.handler.TestReplicationHandler_4D182744B582250E-001/solr-instance-002/./collection1/data/index
    [junit4] 2> 974827 INFO (coreLoadExecutor-4213-thread-1) [ x:collection1] o.a.s.u.RandomMergePolicy RandomMergePolicy wrapping class org.apache.lucene.index.LogByteSizeMergePolicy: [LogByteSizeMergePolicy: minMergeSize=1677721, mergeFactor=31, maxMergeSize=2147483648, maxMergeSizeForForcedMerge=9223372036854775807, calibrateSizeByDeletes=true, maxMergeDocs=2147483647, maxCFSSegmentSizeMB=8.796093022207999E12, noCFSRatio=0.44318497733250684]
    [junit4] 2> 974827 INFO (coreLoadExecutor-4213-thread-1) [ x:collection1] o.a.s.c.SolrDeletionPolicy SolrDeletionPolicy.onCommit: commits: num=1
    [junit4] 2> commit{dir=MockDirectoryWrapper(RAMDirectory@25a07e52 lockFactory=org.apache.lucene.store.SingleInstanceLockFactory@1677c3ea),segFN=segments_1,generation=1}
    [junit4] 2> 974827 INFO (coreLoadExecutor-4213-thread-1) [ x:collection1] o.a.s.c.SolrDeletionPolicy newest commit generation = 1
    [junit4] 2> 974827 INFO (OldIndexDirectoryCleanupThreadForCore-collection1) [ x:collection1] o.a.s.c.SolrCore Looking for old index directories to cleanup for core collection1 in /home/jenkins/workspace/Lucene-Solr-6.1-Linux/solr/build/solr-core/test/J1/temp/solr.handler.TestReplicationHandler_4D182744B582250E-001/solr-instance-002/./collection1/data/
    [junit4] 2> 974828 INFO (coreLoadExecutor-4213-thread-1) [ x:collection1] o.a.s.c.SolrCore no updateRequestProcessorChain defined as default, creating implicit default
    [junit4] 2> 974829 INFO (coreLoadExecutor-4213-thread-1) [ x:collection1] o.a.s.h.l.XMLLoader xsltCacheLifetimeSeconds=60
    [junit4] 2> 974829 INFO (coreLoadExecutor-4213-thread-1) [ x:collection1] o.a.s.h.l.XMLLoader xsltCacheLifetimeSeconds=60
    [junit4] 2> 974830 INFO (coreLoadExecutor-4213-thread-1) [ x:collection1] o.a.s.h.l.XMLLoader xsltCacheLifetimeSeconds=60
    [junit4] 2> 974830 INFO (coreLoadExecutor-4213-thread-1) [ x:collection1] o.a.s.h.l.XMLLoader xsltCacheLifetimeSeconds=60
    [junit4] 2> 974831 INFO (coreLoadExecutor-4213-thread-1) [ x:collection1] o.a.s.c.PluginBag requestHandler : 'lazy' created with startup=lazy
    [junit4] 2> 974831 INFO (coreLoadExecutor-4213-thread-1) [ x:collection1] o.a.s.c.RequestHandlers Registered paths: /admin/mbeans,standard,lazy,/update/json/docs,/admin/luke,/export,/get,/admin/properties,/update/json,/admin/threads,/update/csv,/sql,/graph,/admin/segments,/admin/system,/replication,defaults,/config,/stream,/schema,/admin/plugins,/admin/logging,/admin/ping,/update,/admin/file
    [junit4] 2> 974831 INFO (coreLoadExecutor-4213-thread-1) [ x:collection1] o.a.s.c.SolrCore Using default statsCache cache: org.apache.solr.search.stats.LocalStatsCache
    [junit4] 2> 974831 INFO (coreLoadExecutor-4213-thread-1) [ x:collection1] o.a.s.u.CommitTracker Hard AutoCommit: disabled
    [junit4] 2> 974831 INFO (coreLoadExecutor-4213-thread-1) [ x:collection1] o.a.s.u.CommitTracker Soft AutoCommit: disabled
    [junit4] 2> 974831 INFO (coreLoadExecutor-4213-thread-1) [ x:collection1] o.a.s.u.RandomMergePolicy RandomMergePolicy wrapping class org.apache.lucene.index.TieredMergePolicy: [TieredMergePolicy: maxMergeAtOnce=45, maxMergeAtOnceExplicit=16, maxMergedSegmentMB=50.490234375, floorSegmentMB=0.8076171875, forceMergeDeletesPctAllowed=25.97303430775478, segmentsPerTier=12.0, maxCFSSegmentSizeMB=8.796093022207999E12, noCFSRatio=0.5861128307594922
    [junit4] 2> 974831 INFO (coreLoadExecutor-4213-thread-1) [ x:collection1] o.a.s.c.SolrDeletionPolicy SolrDeletionPolicy.onInit: commits: num=1
    [junit4] 2> commit{dir=MockDirectoryWrapper(RAMDirectory@25a07e52 lockFactory=org.apache.lucene.store.SingleInstanceLockFactory@1677c3ea),segFN=segments_1,generation=1}
    [junit4] 2> 974831 INFO (coreLoadExecutor-4213-thread-1) [ x:collection1] o.a.s.c.SolrDeletionPolicy newest commit generation = 1
    [junit4] 2> 974831 INFO (coreLoadExecutor-4213-thread-1) [ x:collection1] o.a.s.s.SolrIndexSearcher Opening [Searcher@515a0953[collection1] main]
    [junit4] 2> 974831 INFO (coreLoadExecutor-4213-thread-1) [ x:collection1] o.a.s.r.ManagedResourceStorage File-based storage initialized to use dir: /home/jenkins/workspace/Lucene-Solr-6.1-Linux/solr/build/solr-core/test/J1/temp/solr.handler.TestReplicationHandler_4D182744B582250E-001/solr-instance-002/collection1/conf
    [junit4] 2> 974831 INFO (coreLoadExecutor-4213-thread-1) [ x:collection1] o.a.s.r.RestManager Initializing RestManager with initArgs: {storageDir=/home/jenkins/workspace/Lucene-Solr-6.1-Linux/solr/build/solr-core/test/J1/temp/solr.handler.TestReplicationHandler_4D182744B582250E-001/solr-instance-002/collection1/conf}
    [junit4] 2> 974831 INFO (coreLoadExecutor-4213-thread-1) [ x:collection1] o.a.s.r.ManagedResourceStorage Reading _rest_managed.json using file:dir=/home/jenkins/workspace/Lucene-Solr-6.1-Linux/solr/build/solr-core/test/J1/temp/solr.handler.TestReplicationHandler_4D182744B582250E-001/solr-instance-002/collection1/conf
    [junit4] 2> 974832 INFO (coreLoadExecutor-4213-thread-1) [ x:collection1] o.a.s.r.RestManager Initializing 0 registered ManagedResources
    [junit4] 2> 974833 INFO (coreLoadExecutor-4213-thread-1) [ x:collection1] o.a.s.h.ReplicationHandler Poll scheduled at an interval of 1000ms
    [junit4] 2> 974833 INFO (searcherExecutor-4214-thread-1-processing-x:collection1) [ x:collection1] o.a.s.c.SolrCore [collection1] Registered new searcher Searcher@515a0953[collection1] main{ExitableDirectoryReader(UninvertingDirectoryReader())}
    [junit4] 2> 974833 INFO (coreLoadExecutor-4213-thread-1) [ x:collection1] o.a.s.c.CoreContainer registering core: collection1
    [junit4] 2> 974913 INFO (qtp1623701569-8214) [ x:collection1] o.a.s.c.S.Request [collection1] webapp=/solr path=/replication params={qt=/replication&wt=javabin&version=2&command=indexversion} status=0 QTime=0
    [junit4] 2> 975315 INFO (qtp1623701569-8216) [ x:collection1] o.a.s.c.S.Request [collection1] webapp=/solr path=/select params={q=*:*&sort=id+desc&wt=javabin&version=2} hits=0 status=0 QTime=0
    [junit4] 2> 975317 INFO (qtp1623701569-8209) [ x:collection1] o.a.s.c.S.Request [collection1] webapp=/solr path=/replication params={_trace=getDetails&qt=/replication&wt=javabin&version=2&command=details} status=0 QTime=0
    [junit4] 2> 975319 INFO (qtp1623701569-8215) [ x:collection1] o.a.s.c.S.Request [collection1] webapp=/solr path=/replication params={slave=false&qt=/replication&wt=javabin&version=2&command=details} status=0 QTime=0
    [junit4] 2> 975320 INFO (qtp247166387-8231) [ x:collection1] o.a.s.c.S.Request [collection1] webapp=/solr path=/replication params={_trace=getDetails&qt=/replication&wt=javabin&version=2&command=details} status=0 QTime=1
    [junit4] 2> 975322 INFO (qtp1623701569-8214) [ x:collection1] o.a.s.u.p.LogUpdateProcessorFactory [collection1] webapp=/solr path=/update params={wt=javabin&version=2}{add=[0]} 0 0
    [junit4] 2> 975323 INFO (qtp1623701569-8216) [ x:collection1] o.a.s.u.DirectUpdateHandler2 start commit{,optimize=false,openSearcher=true,waitSearcher=true,expungeDeletes=false,softCommit=false,prepareCommit=false}
    [junit4] 2> 975324 INFO (qtp1623701569-8216) [ x:collection1] o.a.s.c.SolrDeletionPolicy SolrDeletionPolicy.onCommit: commits: num=2
    [junit4] 2> commit{dir=MockDirectoryWrapper(RAMDirectory@7125223e lockFactory=org.apache.lucene.store.SingleInstanceLockFactory@1d4f393e),segFN=segments_1,generation=1}
    [junit4] 2> commit{dir=MockDirectoryWrapper(RAMDirectory@7125223e lockFactory=org.apache.lucene.store.SingleInstanceLockFactory@1d4f393e),segFN=segments_2,generation=2}
    [junit4] 2> 975324 INFO (qtp1623701569-8216) [ x:collection1] o.a.s.c.SolrDeletionPolicy newest commit generation = 2
    [junit4] 2> 975325 INFO (qtp1623701569-8216) [ x:collection1] o.a.s.s.SolrIndexSearcher Opening [Searcher@651638bf[collection1] main]
    [junit4] 2> 975325 INFO (qtp1623701569-8216) [ x:collection1] o.a.s.u.DirectUpdateHandler2 end_commit_flush
    [junit4] 2> 975325 INFO (searcherExecutor-4204-thread-1-processing-x:collection1) [ x:collection1] o.a.s.c.SolrCore [collection1] Registered new searcher Searcher@651638bf[collection1] main{ExitableDirectoryReader(UninvertingDirectoryReader(Uninverting(_0(6.1.0):C1)))}
    [junit4] 2> 975325 INFO (qtp1623701569-8216) [ x:collection1] o.a.s.u.p.LogUpdateProcessorFactory [collection1] webapp=/solr path=/update params={waitSearcher=true&commit=true&softCommit=false&wt=javabin&version=2}{commit=} 0 2
    [junit4] 2> 975327 WARN (explicit-fetchindex-cmd) [ x:collection1] o.a.s.h.IndexFetcher 'masterUrl' must be specified without the /replication suffix
    [junit4] 2> 975330 INFO (qtp1623701569-8210) [ x:collection1] o.a.s.c.S.Request [collection1] webapp=/solr path=/replication params={qt=/replication&wt=javabin&version=2&command=indexversion} status=0 QTime=0
    [junit4] 2> 975330 INFO (explicit-fetchindex-cmd) [ x:collection1] o.a.s.h.IndexFetcher Master's generation: 2
    [junit4] 2> 975330 INFO (explicit-fetchindex-cmd) [ x:collection1] o.a.s.h.IndexFetcher Slave's generation: 1
    [junit4] 2> 975330 INFO (explicit-fetchindex-cmd) [ x:collection1] o.a.s.h.IndexFetcher Starting replication process
    [junit4] 2> 975332 WARN (qtp1623701569-8215) [ x:collection1] o.a.s.h.ReplicationHandler Could not read checksum from index file: _0_MockRandom_0.sd
    [junit4] 2> org.apache.lucene.index.CorruptIndexException: misplaced codec footer (file truncated?): length=8 but footerLength==16 (resource=MockIndexInputWrapper(RAMInputStream(name=_0_MockRandom_0.sd)))
    [junit4] 2> at org.apache.lucene.codecs.CodecUtil.retrieveChecksum(CodecUtil.java:430)
    [junit4] 2> at org.apache.solr.handler.ReplicationHandler.getFileList(ReplicationHandler.java:565)
    [junit4] 2> at org.apache.solr.handler.ReplicationHandler.handleRequestBody(ReplicationHandler.java:253)
    [junit4] 2> at org.apache.solr.handler.RequestHandlerBase.handleRequest(RequestHandlerBase.java:156)
    [junit4] 2> at org.apache.solr.core.SolrCore.execute(SolrCore.java:2036)
    [junit4] 2> at org.apache.solr.servlet.HttpSolrCall.execute(HttpSolrCall.java:657)
    [junit4] 2> at org.apache.solr.servlet.HttpSolrCall.call(HttpSolrCall.java:464)
    [junit4] 2> at org.apache.solr.servlet.SolrDispatchFilter.doFilter(SolrDispatchFilter.java:257)
    [junit4] 2> at org.apache.solr.servlet.SolrDispatchFilter.doFilter(SolrDispatchFilter.java:208)
    [junit4] 2> at org.eclipse.jetty.servlet.ServletHandler$CachedChain.doFilter(ServletHandler.java:1676)
    [junit4] 2> at org.apache.solr.client.solrj.embedded.JettySolrRunner$DebugFilter.doFilter(JettySolrRunner.java:109)
    [junit4] 2> at org.eclipse.jetty.servlet.ServletHandler$CachedChain.doFilter(ServletHandler.java:1676)
    [junit4] 2> at org.eclipse.jetty.servlet.ServletHandler.doHandle(ServletHandler.java:581)
    [junit4] 2> at org.eclipse.jetty.server.session.SessionHandler.doHandle(SessionHandler.java:224)
    [junit4] 2> at org.eclipse.jetty.server.handler.ContextHandler.doHandle(ContextHandler.java:1160)
    [junit4] 2> at org.eclipse.jetty.servlet.ServletHandler.doScope(ServletHandler.java:511)
    [junit4] 2> at org.eclipse.jetty.server.session.SessionHandler.doScope(SessionHandler.java:185)
    [junit4] 2> at org.eclipse.jetty.server.handler.ContextHandler.doScope(ContextHandler.java:1092)
    [junit4] 2> at org.eclipse.jetty.server.handler.ScopedHandler.handle(ScopedHandler.java:141)
    [junit4] 2> at org.eclipse.jetty.server.handler.gzip.GzipHandler.handle(GzipHandler.java:462)
    [junit4] 2> at org.eclipse.jetty.server.handler.HandlerWrapper.handle(HandlerWrapper.java:134)
    [junit4] 2> at org.eclipse.jetty.server.Server.handle(Server.java:518)
    [junit4] 2> at org.eclipse.jetty.server.HttpChannel.handle(HttpChannel.java:308)
    [junit4] 2> at org.eclipse.jetty.server.HttpConnection.onFillable(HttpConnection.java:244)
    [junit4] 2> at org.eclipse.jetty.io.AbstractConnection$ReadCallback.succeeded(AbstractConnection.java:273)
    [junit4] 2> at org.eclipse.jetty.io.FillInterest.fillable(FillInterest.java:95)
    [junit4] 2> at org.eclipse.jetty.io.SelectChannelEndPoint$2.run(SelectChannelEndPoint.java:93)
    [junit4] 2> at org.eclipse.jetty.util.thread.strategy.ExecuteProduceConsume.produceAndRun(ExecuteProduceConsume.java:246)
    [junit4] 2> at org.eclipse.jetty.util.thread.strategy.ExecuteProduceConsume.run(ExecuteProduceConsume.java:156)
    [junit4] 2> at org.eclipse.jetty.util.thread.QueuedThreadPool.runJob(QueuedThreadPool.java:654)
    [junit4] 2> at org.eclipse.jetty.util.thread.QueuedThreadPool$3.run(QueuedThreadPool.java:572)
    [junit4] 2> at java.lang.Thread.run(Thread.java:745)
    [junit4] 2> 975333 INFO (qtp1623701569-8215) [ x:collection1] o.a.s.c.S.Request [collection1] webapp=/solr path=/replication params={generation=2&qt=/replication&wt=javabin&version=2&command=filelist} status=0 QTime=2
    [junit4] 2> 975334 INFO (explicit-fetchindex-cmd) [ x:collection1] o.a.s.h.IndexFetcher Number of files in latest index in master: 11
    [junit4] 2> 975334 INFO (explicit-fetchindex-cmd) [ x:collection1] o.a.s.c.CachingDirectoryFactory return new directory for /home/jenkins/workspace/Lucene-Solr-6.1-Linux/solr/build/solr-core/test/J1/temp/solr.handler.TestReplicationHandler_4D182744B582250E-001/solr-instance-002/./collection1/data/index.20160616041702750
    [junit4] 2> 975334 INFO (explicit-fetchindex-cmd) [ x:collection1] o.a.s.u.DefaultSolrCoreState Rollback old IndexWriter... core=collection1
    [junit4] 2> 975334 INFO (explicit-fetchindex-cmd) [ x:collection1] o.a.s.u.RandomMergePolicy RandomMergePolicy wrapping class org.apache.lucene.index.TieredMergePolicy: [TieredMergePolicy: maxMergeAtOnce=25, maxMergeAtOnceExplicit=32, maxMergedSegmentMB=88.09375, floorSegmentMB=1.50390625, forceMergeDeletesPctAllowed=3.1627083234095545, segmentsPerTier=25.0, maxCFSSegmentSizeMB=8.796093022207999E12, noCFSRatio=0.0
    [junit4] 2> 975334 INFO (explicit-fetchindex-cmd) [ x:collection1] o.a.s.c.SolrDeletionPolicy SolrDeletionPolicy.onInit: commits: num=1
    [junit4] 2> commit{dir=MockDirectoryWrapper(RAMDirectory@25a07e52 lockFactory=org.apache.lucene.store.SingleInstanceLockFactory@1677c3ea),segFN=segments_1,generation=1}
    [junit4] 2> 975334 INFO (explicit-fetchindex-cmd) [ x:collection1] o.a.s.c.SolrDeletionPolicy newest commit generation = 1
    [junit4] 2> 975334 INFO (explicit-fetchindex-cmd) [ x:collection1] o.a.s.u.DefaultSolrCoreState New IndexWriter is ready to be used.
    [junit4] 2> 975335 INFO (explicit-fetchindex-cmd) [ x:collection1] o.a.s.c.SolrDeletionPolicy SolrDeletionPolicy.onCommit: commits: num=1
    [junit4] 2> commit{dir=MockDirectoryWrapper(RAMDirectory@25a07e52 lockFactory=org.apache.lucene.store.SingleInstanceLockFactory@1677c3ea),segFN=segments_1,generation=1}
    [junit4] 2> 975335 INFO (explicit-fetchindex-cmd) [ x:collection1] o.a.s.c.SolrDeletionPolicy newest commit generation = 1
    [junit4] 2> 975335 INFO (explicit-fetchindex-cmd) [ x:collection1] o.a.s.u.DefaultSolrCoreState Rollback old IndexWriter... core=collection1
    [junit4] 2> 975335 INFO (explicit-fetchindex-cmd) [ x:collection1] o.a.s.h.IndexFetcher Starting download (fullCopy=false) to MockDirectoryWrapper(RAMDirectory@18e79242 lockFactory=org.apache.lucene.store.SingleInstanceLockFactory@7e044c31)
    [junit4] 2> 975336 INFO (qtp1623701569-8214) [ x:collection1] o.a.s.c.S.Request [collection1] webapp=/solr path=/replication params={generation=2&qt=/replication&file=_0.si&checksum=true&wt=filestream&command=filecontent} status=0 QTime=0
    [junit4] 2> 975338 INFO (qtp1623701569-8216) [ x:collection1] o.a.s.c.S.Request [collection1] webapp=/solr path=/replication params={generation=2&qt=/replication&file=_0_MockRandom_0.tix&checksum=true&wt=filestream&command=filecontent} status=0 QTime=0
    [junit4] 2> 975340 INFO (qtp1623701569-8210) [ x:collection1] o.a.s.c.S.Request [collection1] webapp=/solr path=/replication params={generation=2&qt=/replication&file=_0_MockRandom_0.doc&checksum=true&wt=filestream&command=filecontent} status=0 QTime=0
    [junit4] 2> 975342 INFO (qtp1623701569-8215) [ x:collection1] o.a.s.c.S.Request [collection1] webapp=/solr path=/replication params={generation=2&qt=/replication&file=_0.nvd&checksum=true&wt=filestream&command=filecontent} status=0 QTime=0
    [junit4] 2> 975344 INFO (qtp1623701569-8214) [ x:collection1] o.a.s.c.S.Request [collection1] webapp=/solr path=/replication params={generation=2&qt=/replication&file=_0_MockRandom_0.tbk&checksum=true&wt=filestream&command=filecontent} status=0 QTime=0
    [junit4] 2> 975346 INFO (qtp1623701569-8216) [ x:collection1] o.a.s.c.S.Request [collection1] webapp=/solr path=/replication params={generation=2&qt=/replication&file=_0_MockRandom_0.sd&checksum=true&wt=filestream&command=filecontent} status=0 QTime=0
    [junit4] 2> 975348 INFO (qtp1623701569-8210) [ x:collection1] o.a.s.c.S.Request [collection1] webapp=/solr path=/replication params={generation=2&qt=/replication&file=_0.fdx&checksum=true&wt=filestream&command=filecontent} status=0 QTime=0
    [junit4] 2> 975349 INFO (qtp1623701569-8215) [ x:collection1] o.a.s.c.S.Request [collection1] webapp=/solr path=/replication params={generation=2&qt=/replication&file=_0.fdt&checksum=true&wt=filestream&command=filecontent} status=0 QTime=0
    [junit4] 2> 975351 INFO (qtp1623701569-8214) [ x:collection1] o.a.s.c.S.Request [collection1] webapp=/solr path=/replication params={generation=2&qt=/replication&file=_0.fnm&checksum=true&wt=filestream&command=filecontent} status=0 QTime=0
    [junit4] 2> 975354 INFO (qtp1623701569-8216) [ x:collection1] o.a.s.c.S.Request [collection1] webapp=/solr path=/replication params={generation=2&qt=/replication&file=_0.nvm&checksum=true&wt=filestream&command=filecontent} status=0 QTime=0
    [junit4] 2> 975355 INFO (qtp1623701569-8210) [ x:collection1] o.a.s.c.S.Request [collection1] webapp=/solr path=/replication params={generation=2&qt=/replication&file=segments_2&checksum=true&wt=filestream&command=filecontent} status=0 QTime=0
    [junit4] 2> 975356 INFO (explicit-fetchindex-cmd) [ x:collection1] o.a.s.h.IndexFetcher Total time taken for download (fullCopy=false,bytesDownloaded=1612) : 0 secs (null bytes/sec) to MockDirectoryWrapper(RAMDirectory@18e79242 lockFactory=org.apache.lucene.store.SingleInstanceLockFactory@7e044c31)
    [junit4] 2> 975357 INFO (explicit-fetchindex-cmd) [ x:collection1] o.a.s.u.RandomMergePolicy RandomMergePolicy wrapping class org.apache.lucene.index.TieredMergePolicy: [TieredMergePolicy: maxMergeAtOnce=19, maxMergeAtOnceExplicit=43, maxMergedSegmentMB=86.576171875, floorSegmentMB=1.673828125, forceMergeDeletesPctAllowed=16.554318491060005, segmentsPerTier=23.0, maxCFSSegmentSizeMB=8.796093022207999E12, noCFSRatio=0.0
    [junit4] 2> 975357 INFO (explicit-fetchindex-cmd) [ x:collection1] o.a.s.c.SolrDeletionPolicy SolrDeletionPolicy.onInit: commits: num=2
    [junit4] 2> commit{dir=MockDirectoryWrapper(RAMDirectory@25a07e52 lockFactory=org.apache.lucene.store.SingleInstanceLockFactory@1677c3ea),segFN=segments_1,generation=1}
    [junit4] 2> commit{dir=MockDirectoryWrapper(RAMDirectory@25a07e52 lockFactory=org.apache.lucene.store.SingleInstanceLockFactory@1677c3ea),segFN=segments_2,generation=2}
    [junit4] 2> 975357 INFO (explicit-fetchindex-cmd) [ x:collection1] o.a.s.c.SolrDeletionPolicy newest commit generation = 2
    [junit4] 2> 975357 INFO (explicit-fetchindex-cmd) [ x:collection1] o.a.s.u.DefaultSolrCoreState New IndexWriter is ready to be used.
    [junit4] 2> 975357 INFO (explicit-fetchindex-cmd) [ x:collection1] o.a.s.s.SolrIndexSearcher Opening [Searcher@6945857b[collection1] main]
    [junit4] 2> 975357 INFO (searcherExecutor-4214-thread-1-processing-x:collection1) [ x:collection1] o.a.s.c.SolrCore [collection1] Registered new searcher Searcher@6945857b[collection1] main{ExitableDirectoryReader(UninvertingDirectoryReader(Uninverting(_0(6.1.0):C1)))}
    [junit4] 2> 975358 INFO (explicit-fetchindex-cmd) [ x:collection1] o.a.s.c.CachingDirectoryFactory looking to close /home/jenkins/workspace/Lucene-Solr-6.1-Linux/solr/build/solr-core/test/J1/temp/solr.handler.TestReplicationHandler_4D182744B582250E-001/solr-instance-002/./collection1/data/index.20160616041702750 [CachedDir<<refCount=0;path=/home/jenkins/workspace/Lucene-Solr-6.1-Linux/solr/build/solr-core/test/J1/temp/solr.handler.TestReplicationHandler_4D182744B582250E-001/solr-instance-002/./collection1/data/index.20160616041702750;done=true>>]
    [junit4] 2> 975358 INFO (explicit-fetchindex-cmd) [ x:collection1] o.a.s.c.CachingDirectoryFactory Closing directory, CoreContainer#isShutdown=false
    [junit4] 2> 975358 INFO (explicit-fetchindex-cmd) [ x:collection1] o.a.s.c.CachingDirectoryFactory Closing directory: /home/jenkins/workspace/Lucene-Solr-6.1-Linux/solr/build/solr-core/test/J1/temp/solr.handler.TestReplicationHandler_4D182744B582250E-001/solr-instance-002/./collection1/data/index.20160616041702750
    [junit4] 2> 975358 INFO (qtp247166387-8233) [ x:collection1] o.a.s.c.S.Request [collection1] webapp=/solr path=/replication params={wait=true&masterUrl=http://127.0.0.1:35150/solr/collection1/replication&command=fetchindex} status=0 QTime=30
    [junit4] 2> 975368 INFO (qtp1623701569-8215) [ x:collection1] o.a.s.c.S.Request [collection1] webapp=/solr path=/replication params={slave=false&qt=/replication&wt=javabin&version=2&command=details} status=0 QTime=0
    [junit4] 2> 975368 INFO (qtp247166387-8232) [ x:collection1] o.a.s.c.S.Request [collection1] webapp=/solr path=/replication params={_trace=getDetails&qt=/replication&wt=javabin&version=2&command=details} status=0 QTime=2
    [junit4] 2> 975371 INFO (qtp1623701569-8209) [ x:collection1] o.a.s.u.p.LogUpdateProcessorFactory [collection1] webapp=/solr path=/update params={wt=javabin&version=2}{add=[1]} 0 0
    [junit4] 2> 975372 INFO (qtp1623701569-8216) [ x:collection1] o.a.s.u.DirectUpdateHandler2 start commit{,optimize=false,openSearcher=true,waitSearcher=true,expungeDeletes=false,softCommit=false,prepareCommit=false}
    [junit4] 2> 975373 INFO (qtp1623701569-8216) [ x:collection1] o.a.s.c.SolrDeletionPolicy SolrDeletionPolicy.onCommit: commits: num=3
    [junit4] 2> commit{dir=MockDirectoryWrapper(RAMDirectory@7125223e lockFactory=org.apache.lucene.store.SingleInstanceLockFactory@1d4f393e),segFN=segments_1,generation=1}
    [junit4] 2> commit{dir=MockDirectoryWrapper(RAMDirectory@7125223e lockFactory=org.apache.lucene.store.SingleInstanceLockFactory@1d4f393e),segFN=segments_2,generation=2}
    [junit4] 2> commit{dir=MockDirectoryWrapper(RAMDirectory@7125223e lockFactory=org.apache.lucene.store.SingleInstanceLockFactory@1d4f393e),segFN=segments_3,generation=3}
    [junit4] 2> 975373 INFO (qtp1623701569-8216) [ x:collection1] o.a.s.c.SolrDeletionPolicy newest commit generation = 3
    [junit4] 2> 975374 INFO (qtp1623701569-8216) [ x:collection1] o.a.s.s.SolrIndexSearcher Opening [Searcher@32267ed0[collection1] main]
    [junit4] 2> 975374 INFO (qtp1623701569-8216) [ x:collection1] o.a.s.u.DirectUpdateHandler2 end_commit_flush
    [junit4] 2> 975374 INFO (searcherExecutor-4204-thread-1-processing-x:collection1) [ x:collection1] o.a.s.c.SolrCore [collection1] Registered new searcher Searcher@32267ed0[collection1] main{ExitableDirectoryReader(UninvertingDirectoryReader(Uninverting(_0(6.1.0):C1) Uninverting(_1(6.1.0):C1)))}
    [junit4] 2> 975374 INFO (qtp1623701569-8216) [ x:collection1] o.a.s.u.p.LogUpdateProcessorFactory [collection1] webapp=/solr path=/update params={waitSearcher=true&commit=true&softCommit=false&wt=javabin&version=2}{commit=} 0 1
    [junit4] 2> 975375 WARN (explicit-fetchindex-cmd) [ x:collection1] o.a.s.h.IndexFetcher 'masterUrl' must be specified without the /replication suffix
    [junit4] 2> 975377 INFO (qtp1623701569-8214) [ x:collection1] o.a.s.c.S.Request [collection1] webapp=/solr path=/replication params={qt=/replication&wt=javabin&version=2&command=indexversion} status=0 QTime=0
    [junit4] 2> 975377 INFO (explicit-fetchindex-cmd) [ x:collection1] o.a.s.h.IndexFetcher Master's generation: 3
    [junit4] 2> 975377 INFO (explicit-fetchindex-cmd) [ x:collection1] o.a.s.h.IndexFetcher Slave's generation: 2
    [junit4] 2> 975377 INFO (explicit-fetchindex-cmd) [ x:collection1] o.a.s.h.IndexFetcher Starting replication process
    [junit4] 2> 975378 WARN (qtp1623701569-8215) [ x:collection1] o.a.s.h.ReplicationHandler Could not read checksum from index file: _0_MockRandom_0.sd
    [junit4] 2> org.apache.lucene.index.CorruptIndexException: misplaced codec footer (file truncated?): length=8 but footerLength==16 (resource=MockIndexInputWrapper(RAMInputStream(name=_0_MockRandom_0.sd)))
    [junit4] 2> at org.apache.lucene.codecs.CodecUtil.retrieveChecksum(CodecUtil.java:430)
    [junit4] 2> at org.apache.solr.handler.ReplicationHandler.getFileList(ReplicationHandler.java:565)
    [junit4] 2> at org.apache.solr.handler.ReplicationHandler.handleRequestBody(ReplicationHandler.java:253)
    [junit4] 2> at org.apache.solr.handler.RequestHandlerBase.handleRequest(RequestHandlerBase.java:156)
    [junit4] 2> at org.apache.solr.core.SolrCore.execute(SolrCore.java:2036)
    [junit4] 2> at org.apache.solr.servlet.HttpSolrCall.execute(HttpSolrCall.java:657)
    [junit4] 2> at org.apache.solr.servlet.HttpSolrCall.call(HttpSolrCall.java:464)
    [junit4] 2> at org.apache.solr.servlet.SolrDispatchFilter.doFilter(SolrDispatchFilter.java:257)
    [junit4] 2> at org.apache.solr.servlet.SolrDispatchFilter.doFilter(SolrDispatchFilter.java:208)
    [junit4] 2> at org.eclipse.jetty.servlet.ServletHandler$CachedChain.doFilter(ServletHandler.java:1676)
    [junit4] 2> at org.apache.solr.client.solrj.embedded.JettySolrRunner$DebugFilter.doFilter(JettySolrRunner.java:109)
    [junit4] 2> at org.eclipse.jetty.servlet.ServletHandler$CachedChain.doFilter(ServletHandler.java:1676)
    [junit4] 2> at org.eclipse.jetty.servlet.ServletHandler.doHandle(ServletHandler.java:581)
    [junit4] 2> at org.eclipse.jetty.server.session.SessionHandler.doHandle(SessionHandler.java:224)
    [junit4] 2> at org.eclipse.jetty.server.handler.ContextHandler.doHandle(ContextHandler.java:1160)
    [junit4] 2> at org.eclipse.jetty.servlet.ServletHandler.doScope(ServletHandler.java:511)
    [junit4] 2> at org.eclipse.jetty.server.session.SessionHandler.doScope(SessionHandler.java:185)
    [junit4] 2> at org.eclipse.jetty.server.handler.ContextHandler.doScope(ContextHandler.java:1092)
    [junit4] 2> at org.eclipse.jetty.server.handler.ScopedHandler.handle(ScopedHandler.java:141)
    [junit4] 2> at org.eclipse.jetty.server.handler.gzip.GzipHandler.handle(GzipHandler.java:462)
    [junit4] 2> at org.eclipse.jetty.server.handler.HandlerWrapper.handle(HandlerWrapper.java:134)
    [junit4] 2> at org.eclipse.jetty.server.Server.handle(Server.java:518)
    [junit4] 2> at org.eclipse.jetty.server.HttpChannel.handle(HttpChannel.java:308)
    [junit4] 2> at org.eclipse.jetty.server.HttpConnection.onFillable(HttpConnection.java:244)
    [junit4] 2> at org.eclipse.jetty.io.AbstractConnection$ReadCallback.succeeded(AbstractConnection.java:273)
    [junit4] 2> at org.eclipse.jetty.io.FillInterest.fillable(FillInterest.java:95)
    [junit4] 2> at org.eclipse.jetty.io.SelectChannelEndPoint$2.run(SelectChannelEndPoint.java:93)
    [junit4] 2> at org.eclipse.jetty.util.thread.strategy.ExecuteProduceConsume.produceAndRun(ExecuteProduceConsume.java:246)
    [junit4] 2> at org.eclipse.jetty.util.thread.strategy.ExecuteProduceConsume.run(ExecuteProduceConsume.java:156)
    [junit4] 2> at org.eclipse.jetty.util.thread.QueuedThreadPool.runJob(QueuedThreadPool.java:654)
    [junit4] 2> at org.eclipse.jetty.util.thread.QueuedThreadPool$3.run(QueuedThreadPool.java:572)
    [junit4] 2> at java.lang.Thread.run(Thread.java:745)
    [junit4] 2> 975379 WARN (qtp1623701569-8215) [ x:collection1] o.a.s.h.ReplicationHandler Could not read checksum from index file: _1_MockRandom_0.sd
    [junit4] 2> org.apache.lucene.index.CorruptIndexException: misplaced codec footer (file truncated?): length=8 but footerLength==16 (resource=MockIndexInputWrapper(RAMInputStream(name=_1_MockRandom_0.sd)))
    [junit4] 2> at org.apache.lucene.codecs.CodecUtil.retrieveChecksum(CodecUtil.java:430)
    [junit4] 2> at org.apache.solr.handler.ReplicationHandler.getFileList(ReplicationHandler.java:565)
    [junit4] 2> at org.apache.solr.handler.ReplicationHandler.handleRequestBody(ReplicationHandler.java:253)
    [junit4] 2> at org.apache.solr.handler.RequestHandlerBase.handleRequest(RequestHandlerBase.java:156)
    [junit4] 2> at org.apache.solr.core.SolrCore.execute(SolrCore.java:2036)
    [junit4] 2> at org.apache.solr.servlet.HttpSolrCall.execute(HttpSolrCall.java:657)
    [junit4] 2> at org.apache.solr.servlet.HttpSolrCall.call(HttpSolrCall.java:464)
    [junit4] 2> at org.apache.solr.servlet.SolrDispatchFilter.doFilter(SolrDispatchFilter.java:257)
    [junit4] 2> at org.apache.solr.servlet.SolrDispatchFilter.doFilter(SolrDispatchFilter.java:208)
    [junit4] 2> at org.eclipse.jetty.servlet.ServletHandler$CachedChain.doFilter(ServletHandler.java:1676)
    [junit4] 2> at org.apache.solr.client.solrj.embedded.JettySolrRunner$DebugFilter.doFilter(JettySolrRunner.java:109)
    [junit4] 2> at org.eclipse.jetty.servlet.ServletHandler$CachedChain.doFilter(ServletHandler.java:1676)
    [junit4] 2> at org.eclipse.jetty.servlet.ServletHandler.doHandle(ServletHandler.java:581)
    [junit4] 2> at org.eclipse.jetty.server.session.SessionHandler.doHandle(SessionHandler.java:224)
    [junit4] 2> at org.eclipse.jetty.server.handler.ContextHandler.doHandle(ContextHandler.java:1160)
    [junit4] 2> at org.eclipse.jetty.servlet.ServletHandler.doScope(ServletHandler.java:511)
    [junit4] 2> at org.eclipse.jetty.server.session.SessionHandler.doScope(SessionHandler.java:185)
    [junit4] 2> at org.eclipse.jetty.server.handler.ContextHandler.doScope(ContextHandler.java:1092)
    [junit4] 2> at org.eclipse.jetty.server.handler.ScopedHandler.handle(ScopedHandler.java:141)
    [junit4] 2> at org.eclipse.jetty.server.handler.gzip.GzipHandler.handle(GzipHandler.java:462)
    [junit4] 2> at org.eclipse.jetty.server.handler.HandlerWrapper.handle(HandlerWrapper.java:134)
    [junit4] 2> at org.eclipse.jetty.server.Server.handle(Server.java:518)
    [junit4] 2> at org.eclipse.jetty.server.HttpChannel.handle(HttpChannel.java:308)
    [junit4] 2> at org.eclipse.jetty.server.HttpConnection.onFillable(HttpConnection.java:244)
    [junit4] 2> at org.eclipse.jetty.io.AbstractConnection$ReadCallback.succeeded(AbstractConnection.java:273)
    [junit4] 2> at org.eclipse.jetty.io.FillInterest.fillable(FillInterest.java:95)
    [junit4] 2> at org.eclipse.jetty.io.SelectChannelEndPoint$2.run(SelectChannelEndPoint.java:93)
    [junit4] 2> at org.eclipse.jetty.util.thread.strategy.ExecuteProduceConsume.produceAndRun(ExecuteProduceConsume.java:246)
    [junit4] 2> at org.eclipse.jetty.util.thread.strategy.ExecuteProduceConsume.run(ExecuteProduceConsume.java:156)
    [junit4] 2> at org.eclipse.jetty.util.thread.QueuedThreadPool.runJob(QueuedThreadPool.java:654)
    [junit4] 2> at org.eclipse.jetty.util.thread.QueuedThreadPool$3.run(QueuedThreadPool.java:572)
    [junit4] 2> at java.lang.Thread.run(Thread.java:745)
    [junit4] 2> 975379 INFO (qtp1623701569-8215) [ x:collection1] o.a.s.c.S.Request [collection1] webapp=/solr path=/replication params={generation=3&qt=/replication&wt=javabin&version=2&command=filelist} status=0 QTime=1
    [junit4] 2> 975379 INFO (explicit-fetchindex-cmd) [ x:collection1] o.a.s.h.IndexFetcher Number of files in latest index in master: 21
    [junit4] 2> 975380 INFO (explicit-fetchindex-cmd) [ x:collection1] o.a.s.c.CachingDirectoryFactory return new directory for /home/jenkins/workspace/Lucene-Solr-6.1-Linux/solr/build/solr-core/test/J1/temp/solr.handler.TestReplicationHandler_4D182744B582250E-001/solr-instance-002/./collection1/data/index.20160616041702795
    [junit4] 2> 975380 INFO (explicit-fetchindex-cmd) [ x:collection1] o.a.s.u.DefaultSolrCoreState Rollback old IndexWriter... core=collection1
    [junit4] 2> 975380 INFO (explicit-fetchindex-cmd) [ x:collection1] o.a.s.u.RandomMergePolicy RandomMergePolicy wrapping class org.apache.lucene.index.TieredMergePolicy: [TieredMergePolicy: maxMergeAtOnce=25, maxMergeAtOnceExplicit=32, maxMergedSegmentMB=88.09375, floorSegmentMB=1.50390625, forceMergeDeletesPctAllowed=3.1627083234095545, segmentsPerTier=25.0, maxCFSSegmentSizeMB=8.796093022207999E12, noCFSRatio=0.0
    [junit4] 2> 975380 INFO (explicit-fetchindex-cmd) [ x:collection1] o.a.s.c.SolrDeletionPolicy SolrDeletionPolicy.onInit: commits: num=1
    [junit4] 2> commit{dir=MockDirectoryWrapper(RAMDirectory@25a07e52 lockFactory=org.apache.lucene.store.SingleInstanceLockFactory@1677c3ea),segFN=segments_2,generation=2}
    [junit4] 2> 975380 INFO (explicit-fetchindex-cmd) [ x:collection1] o.a.s.c.SolrDeletionPolicy newest commit generation = 2
    [junit4] 2> 975381 INFO (explicit-fetchindex-cmd) [ x:collection1] o.a.s.u.DefaultSolrCoreState New IndexWriter is ready to be used.
    [junit4] 2> 975381 INFO (explicit-fetchindex-cmd) [ x:collection1] o.a.s.c.SolrDeletionPolicy SolrDeletionPolicy.onCommit: commits: num=1
    [junit4] 2> commit{dir=MockDirectoryWrapper(RAMDirectory@25a07e52 lockFactory=org.apache.lucene.store.SingleInstanceLockFactory@1677c3ea),segFN=segments_2,generation=2}
    [junit4] 2> 975381 INFO (explicit-fetchindex-cmd) [ x:collection1] o.a.s.c.SolrDeletionPolicy newest commit generation = 2
    [junit4] 2> 975381 INFO (explicit-fetchindex-cmd) [ x:collection1] o.a.s.u.DefaultSolrCoreState Rollback old IndexWriter... core=collection1
    [junit4] 2> 975381 INFO (explicit-fetchindex-cmd) [ x:collection1] o.a.s.h.IndexFetcher Starting download (fullCopy=false) to MockDirectoryWrapper(RAMDirectory@4aa7b663 lockFactory=org.apache.lucene.store.SingleInstanceLockFactory@1339c16d)
    [junit4] 2> 975381 INFO (explicit-fetchindex-cmd) [ x:collection1] o.a.s.h.IndexFetcher Skipping download for _0.si because it already exists
    [junit4] 2> 975381 INFO (explicit-fetchindex-cmd) [ x:collection1] o.a.s.h.IndexFetcher Skipping download for _0_MockRandom_0.tix because it already exists
    [junit4] 2> 975381 INFO (explicit-fetchindex-cmd) [ x:collection1] o.a.s.h.IndexFetcher Skipping download for _0_MockRandom_0.doc because it already exists
    [junit4] 2> 975381 INFO (explicit-fetchindex-cmd) [ x:collection1] o.a.s.h.IndexFetcher Skipping download for _0.nvd because it already exists
    [junit4] 2> 975381 INFO (explicit-fetchindex-cmd) [ x:collection1] o.a.s.h.IndexFetcher Skipping download for _0_MockRandom_0.tbk because it already exists
    [junit4] 2> 975382 INFO (qtp1623701569-8209) [ x:collection1] o.a.s.c.S.Request [collection1] webapp=/solr path=/replication params={generation=3&qt=/replication&file=_0_MockRandom_0.sd&checksum=true&wt=filestream&command=filecontent} status=0 QTime=0
    [junit4] 2> 975383 INFO (explicit-fetchindex-cmd) [ x:collection1] o.a.s.h.IndexFetcher Skipping download for _0.fdx because it already exists
    [junit4] 2> 975383 INFO (explicit-fetchindex-cmd) [ x:collection1] o.a.s.h.IndexFetcher Skipping download for _0.fdt because it already exists
    [junit4] 2> 975383 INFO (explicit-fetchindex-cmd) [ x:collection1] o.a.s.h.IndexFetcher Skipping download for _0.fnm because it already exists
    [junit4] 2> 975383 INFO (explicit-fetchindex-cmd) [ x:collection1] o.a.s.h.IndexFetcher Skipping download for _0.nvm because it already exists
    [junit4] 2> 975384 INFO (qtp1623701569-8216) [ x:collection1] o.a.s.c.S.Request [collection1] webapp=/solr path=/replication params={generation=3&qt=/replication&file=_1_MockRandom_0.doc&checksum=true&wt=filestream&command=filecontent} status=0 QTime=0
    [junit4] 2> 975386 INFO (qtp1623701569-8214) [ x:collection1] o.a.s.c.S.Request [collection1] webapp=/solr path=/replication params={generation=3&qt=/replication&file=_1_MockRandom_0.sd&checksum=true&wt=filestream&command=filecontent} status=0 QTime=0
    [junit4] 2> 975388 INFO (qtp1623701569-8215) [ x:collection1] o.a.s.c.S.Request [collection1] webapp=/solr path=/replication params={generation=3&qt=/replication&file=_1_MockRandom_0.tio&checksum=true&wt=filestream&command=filecontent} status=0 QTime=0
    [junit4] 2> 975390 INFO (qtp1623701569-8209) [ x:collection1] o.a.s.c.S.Request [collection1] webapp=/solr path=/replication params={generation=3&qt=/replication&file=_1.si&checksum=true&wt=filestream&command=filecontent} status=0 QTime=0
    [junit4] 2> 975392 INFO (qtp1623701569-8216) [ x:collection1] o.a.s.c.S.Request [collection1] webapp=/solr path=/replication params={generation=3&qt=/replication&file=_1.nvd&checksum=true&wt=filestream&command=filecontent} status=0 QTime=0
    [junit4] 2> 975405 INFO (qtp1623701569-8214) [ x:collection1] o.a.s.c.S.Request [collection1] webapp=/solr path=/replication params={generation=3&qt=/replication&file=_1_MockRandom_0.tipo&checksum=true&wt=filestream&command=filecontent} status=0 QTime=0
    [junit4] 2> 975407 INFO (qtp1623701569-8215) [ x:collection1] o.a.s.c.S.Request [collection1] webapp=/solr path=/replication params={generation=3&qt=/replication&file=_1.fdx&checksum=true&wt=filestream&command=filecontent} status=0 QTime=0
    [junit4] 2> 975409 INFO (qtp1623701569-8209) [ x:collection1] o.a.s.c.S.Request [collection1] webapp=/solr path=/replication params={generation=3&qt=/replication&file=_1.fnm&checksum=true&wt=filestream&command=filecontent} status=0 QTime=0
    [junit4] 2> 975410 INFO (qtp1623701569-8216) [ x:collection1] o.a.s.c.S.Request [collection1] webapp=/solr path=/replication params={generation=3&qt=/replication&file=_1.nvm&checksum=true&wt=filestream&command=filecontent} status=0 QTime=0
    [junit4] 2> 975412 INFO (qtp1623701569-8214) [ x:collection1] o.a.s.c.S.Request [collection1] webapp=/solr path=/replication params={generation=3&qt=/replication&file=_1.fdt&checksum=true&wt=filestream&command=filecontent} status=0 QTime=0
    [junit4] 2> 975414 INFO (qtp1623701569-8215) [ x:collection1] o.a.s.c.S.Request [collection1] webapp=/solr path=/replication params={generation=3&qt=/replication&file=segments_3&checksum=true&wt=filestream&command=filecontent} status=0 QTime=0
    [junit4] 2> 975414 INFO (explicit-fetchindex-cmd) [ x:collection1] o.a.s.h.IndexFetcher Total time taken for download (fullCopy=false,bytesDownloaded=1762) : 0 secs (null bytes/sec) to MockDirectoryWrapper(RAMDirectory@4aa7b663 lockFactory=org.apache.lucene.store.SingleInstanceLockFactory@1339c16d)
    [junit4] 2> 975415 WARN (explicit-fetchindex-cmd) [ x:collection1] o.a.s.h.IndexFetcher Cannot complete replication attempt because file already exists:_0_MockRandom_0.sd
    [junit4] 2> 975415 INFO (explicit-fetchindex-cmd) [ x:collection1] o.a.s.u.RandomMergePolicy RandomMergePolicy wrapping class org.apache.lucene.index.TieredMergePolicy: [TieredMergePolicy: maxMergeAtOnce=19, maxMergeAtOnceExplicit=43, maxMergedSegmentMB=86.576171875, floorSegmentMB=1.673828125, forceMergeDeletesPctAllowed=16.554318491060005, segmentsPerTier=23.0, maxCFSSegmentSizeMB=8.796093022207999E12, noCFSRatio=0.0
    [junit4] 2> 975415 INFO (explicit-fetchindex-cmd) [ x:collection1] o.a.s.c.SolrDeletionPolicy SolrDeletionPolicy.onInit: commits: num=1
    [junit4] 2> commit{dir=MockDirectoryWrapper(RAMDirectory@25a07e52 lockFactory=org.apache.lucene.store.SingleInstanceLockFactory@1677c3ea),segFN=segments_2,generation=2}
    [junit4] 2> 975415 INFO (explicit-fetchindex-cmd) [ x:collection1] o.a.s.c.SolrDeletionPolicy newest commit generation = 2
    [junit4] 2> 975415 INFO (explicit-fetchindex-cmd) [ x:collection1] o.a.s.u.DefaultSolrCoreState New IndexWriter is ready to be used.
    [junit4] 2> 975416 INFO (explicit-fetchindex-cmd) [ x:collection1] o.a.s.c.CachingDirectoryFactory looking to close /home/jenkins/workspace/Lucene-Solr-6.1-Linux/solr/build/solr-core/test/J1/temp/solr.handler.TestReplicationHandler_4D182744B582250E-001/solr-instance-002/./collection1/data/index.20160616041702795 [CachedDir<<refCount=0;path=/home/jenkins/workspace/Lucene-Solr-6.1-Linux/solr/build/solr-core/test/J1/temp/solr.handler.TestReplicationHandler_4D182744B582250E-001/solr-instance-002/./collection1/data/index.20160616041702795;done=true>>]
    [junit4] 2> 975416 INFO (explicit-fetchindex-cmd) [ x:collection1] o.a.s.c.CachingDirectoryFactory Closing directory, CoreContainer#isShutdown=false
    [junit4] 2> 975416 INFO (explicit-fetchindex-cmd) [ x:collection1] o.a.s.c.CachingDirectoryFactory Closing directory: /home/jenkins/workspace/Lucene-Solr-6.1-Linux/solr/build/solr-core/test/J1/temp/solr.handler.TestReplicationHandler_4D182744B582250E-001/solr-instance-002/./collection1/data/index.20160616041702795
    [junit4] 2> 975416 WARN (explicit-fetchindex-cmd) [ x:collection1] o.a.s.h.IndexFetcher Replication attempt was not successful - trying a full index replication reloadCore=false
    [junit4] 2> 975417 INFO (qtp1623701569-8209) [ x:collection1] o.a.s.c.S.Request [collection1] webapp=/solr path=/replication params={qt=/replication&wt=javabin&version=2&command=indexversion} status=0 QTime=0
    [junit4] 2> 975417 INFO (explicit-fetchindex-cmd) [ x:collection1] o.a.s.h.IndexFetcher Master's generation: 3
    [junit4] 2> 975417 INFO (explicit-fetchindex-cmd) [ x:collection1] o.a.s.h.IndexFetcher Slave's generation: 2
    [junit4] 2> 975418 INFO (explicit-fetchindex-cmd) [ x:collection1] o.a.s.h.IndexFetcher Starting replication process
    [junit4] 2> 975419 WARN (qtp1623701569-8216) [ x:collection1] o.a.s.h.ReplicationHandler Could not read checksum from index file: _0_MockRandom_0.sd
    [junit4] 2> org.apache.lucene.index.CorruptIndexException: misplaced codec footer (file truncated?): length=8 but footerLength==16 (resource=MockIndexInputWrapper(RAMInputStream(name=_0_MockRandom_0.sd)))
    [junit4] 2> at org.apache.lucene.codecs.CodecUtil.retrieveChecksum(CodecUtil.java:430)
    [junit4] 2> at org.apache.solr.handler.ReplicationHandler.getFileList(ReplicationHandler.java:565)
    [junit4] 2> at org.apache.solr.handler.ReplicationHandler.handleRequestBody(ReplicationHandler.java:253)
    [junit4] 2> at org.apache.solr.handler.RequestHandlerBase.handleRequest(RequestHandlerBase.java:156)
    [junit4] 2> at org.apache.solr.core.SolrCore.execute(SolrCore.java:2036)
    [junit4] 2> at org.apache.solr.servlet.HttpSolrCall.execute(HttpSolrCall.java:657)
    [junit4] 2> at org.apache.solr.servlet.HttpSolrCall.call(HttpSolrCall.java:464)
    [junit4] 2> at org.apache.solr.servlet.SolrDispatchFilter.doFilter(SolrDispatchFilter.java:257)
    [junit4] 2> at org.apache.solr.servlet.SolrDispatchFilter.doFilter(SolrDispatchFilter.java:208)
    [junit4] 2> at org.eclipse.jetty.servlet.ServletHandler$CachedChain.doFilter(ServletHandler.java:1676)
    [junit4] 2> at org.apache.solr.client.solrj.embedded.JettySolrRunner$DebugFilter.doFilter(JettySolrRunner.java:109)
    [junit4] 2> at org.eclipse.jetty.servlet.ServletHandler$CachedChain.doFilter(ServletHandler.java:1676)
    [junit4] 2> at org.eclipse.jetty.servlet.ServletHandler.doHandle(ServletHandler.java:581)
    [junit4] 2> at org.eclipse.jetty.server.session.SessionHandler.doHandle(SessionHandler.java:224)
    [junit4] 2> at org.eclipse.jetty.server.handler.ContextHandler.doHandle(ContextHandler.java:1160)
    [junit4] 2> at org.eclipse.jetty.servlet.ServletHandler.doScope(ServletHandler.java:511)
    [junit4] 2> at org.eclipse.jetty.server.session.SessionHandler.doScope(SessionHandler.java:185)
    [junit4] 2> at org.eclipse.jetty.server.handler.ContextHandler.doScope(ContextHandler.java:1092)
    [junit4] 2> at org.eclipse.jetty.server.handler.ScopedHandler.handle(ScopedHandler.java:141)
    [junit4] 2> at org.eclipse.jetty.server.handler.gzip.GzipHandler.handle(GzipHandler.java:462)
    [junit4] 2> at org.eclipse.jetty.server.handler.HandlerWrapper.handle(HandlerWrapper.java:134)
    [junit4] 2> at org.eclipse.jetty.server.Server.handle(Server.java:518)
    [junit4] 2> at org.eclipse.jetty.server.HttpChannel.handle(HttpChannel.java:308)
    [junit4] 2> at org.eclipse.jetty.server.HttpConnection.onFillable(HttpConnection.java:244)
    [junit4] 2> at org.eclipse.jetty.io.AbstractConnection$ReadCallback.succeeded(AbstractConnection.java:273)
    [junit4] 2> at org.eclipse.jetty.io.FillInterest.fillable(FillInterest.java:95)
    [junit4] 2> at org.eclipse.jetty.io.SelectChannelEndPoint$2.run(SelectChannelEndPoint.java:93)
    [junit4] 2> at org.eclipse.jetty.util.thread.strategy.ExecuteProduceConsume.produceAndRun(ExecuteProduceConsume.java:246)
    [junit4] 2> at org.eclipse.jetty.util.thread.strategy.ExecuteProduceConsume.run(ExecuteProduceConsume.java:156)
    [junit4] 2> at org.eclipse.jetty.util.thread.QueuedThreadPool.runJob(QueuedThreadPool.java:654)
    [junit4] 2> at org.eclipse.jetty.util.thread.QueuedThreadPool$3.run(QueuedThreadPool.java:572)
    [junit4] 2> at java.lang.Thread.run(Thread.java:745)
    [junit4] 2> 975419 WARN (qtp1623701569-8216) [ x:collection1] o.a.s.h.ReplicationHandler Could not read checksum from index file: _1_MockRandom_0.sd
    [junit4] 2> org.apache.lucene.index.CorruptIndexException: misplaced codec footer (file truncated?): length=8 but footerLength==16 (resource=MockIndexInputWrapper(RAMInputStream(name=_1_MockRandom_0.sd)))
    [junit4] 2> at org.apache.lucene.codecs.CodecUtil.retrieveChecksum(CodecUtil.java:430)
    [junit4] 2> at org.apache.solr.handler.ReplicationHandler.getFileList(ReplicationHandler.java:565)
    [junit4] 2> at org.apache.solr.handler.ReplicationHandler.handleRequestBody(ReplicationHandler.java:253)
    [junit4] 2> at org.apache.solr.handler.RequestHandlerBase.handleRequest(RequestHandlerBase.java:156)
    [junit4] 2> at org.apache.solr.core.SolrCore.execute(SolrCore.java:2036)
    [junit4] 2> at org.apache.solr.servlet.HttpSolrCall.execute(HttpSolrCall.java:657)
    [junit4] 2> at org.apache.solr.servlet.HttpSolrCall.call(HttpSolrCall.java:464)
    [junit4] 2> at org.apache.solr.servlet.SolrDispatchFilter.doFilter(SolrDispatchFilter.java:257)
    [junit4] 2> at org.apache.solr.servlet.SolrDispatchFilter.doFilter(SolrDispatchFilter.java:208)
    [junit4] 2> at org.eclipse.jetty.servlet.ServletHandler$CachedChain.doFilter(ServletHandler.java:1676)
    [junit4] 2> at org.apache.solr.client.solrj.embedded.JettySolrRunner$DebugFilter.doFilter(JettySolrRunner.java:109)
    [junit4] 2> at org.eclipse.jetty.servlet.ServletHandler$CachedChain.doFilter(ServletHandler.java:1676)
    [junit4] 2> at org.eclipse.jetty.servlet.ServletHandler.doHandle(ServletHandler.java:581)
    [junit4] 2> at org.eclipse.jetty.server.session.SessionHandler.doHandle(SessionHandler.java:224)
    [junit4] 2> at org.eclipse.jetty.server.handler.ContextHandler.doHandle(ContextHandler.java:1160)
    [junit4] 2> at org.eclipse.jetty.servlet.ServletHandler.doScope(ServletHandler.java:511)
    [junit4] 2> at org.eclipse.jetty.server.session.SessionHandler.doScope(SessionHandler.java:185)
    [junit4] 2> at org.eclipse.jetty.server.handler.ContextHandler.doScope(ContextHandler.java:1092)
    [junit4] 2> at org.eclipse.jetty.server.handler.ScopedHandler.handle(ScopedHandler.java:141)
    [junit4] 2> at org.eclipse.jetty.server.handler.gzip.GzipHandler.handle(GzipHandler.java:462)
    [junit4] 2> at org.eclipse.jetty.server.handler.HandlerWrapper.handle(HandlerWrapper.java:134)
    [junit4] 2> at org.eclipse.jetty.server.Server.handle(Server.java:518)
    [junit4] 2> at org.eclipse.jetty.server.HttpChannel.handle(HttpChannel.java:308)
    [junit4] 2> at org.eclipse.jetty.server.HttpConnection.onFillable(HttpConnection.java:244)
    [junit4] 2> at org.eclipse.jetty.io.AbstractConnection$ReadCallback.succeeded(AbstractConnection.java:273)
    [junit4] 2> at org.eclipse.jetty.io.FillInterest.fillable(FillInterest.java:95)
    [junit4] 2> at org.eclipse.jetty.io.SelectChannelEndPoint$2.run(SelectChannelEndPoint.java:93)
    [junit4] 2> at org.eclipse.jetty.util.thread.strategy.ExecuteProduceConsume.produceAndRun(ExecuteProduceConsume.java:246)
    [junit4] 2> at org.eclipse.jetty.util.thread.strategy.ExecuteProduceConsume.run(ExecuteProduceConsume.java:156)
    [junit4] 2> at org.eclipse.jetty.util.thread.QueuedThreadPool.runJob(QueuedThreadPool.java:654)
    [junit4] 2> at org.eclipse.jetty.util.thread.QueuedThreadPool$3.run(QueuedThreadPool.java:572)
    [junit4] 2> at java.lang.Thread.run(Thread.java:745)
    [junit4] 2> 975420 INFO (qtp1623701569-8216) [ x:collection1] o.a.s.c.S.Request [collection1] webapp=/solr path=/replication params={generation=3&qt=/replication&wt=javabin&version=2&command=filelist} status=0 QTime=1
    [junit4] 2> 975420 INFO (explicit-fetchindex-cmd) [ x:collection1] o.a.s.h.IndexFetcher Number of files in latest index in master: 21
    [junit4] 2> 975421 INFO (explicit-fetchindex-cmd) [ x:collection1] o.a.s.c.CachingDirectoryFactory return new directory for /home/jenkins/workspace/Lucene-Solr-6.1-Linux/solr/build/solr-core/test/J1/temp/solr.handler.TestReplicationHandler_4D182744B582250E-001/solr-instance-002/./collection1/data/index.20160616041702837
    [junit4] 2> 975421 INFO (explicit-fetchindex-cmd) [ x:collection1] o.a.s.h.IndexFetcher Starting download (fullCopy=true) to MockDirectoryWrapper(RAMDirectory@4151189b lockFactory=org.apache.lucene.store.SingleInstanceLockFactory@553f5d34)
    [junit4] 2> 975422 INFO (qtp1623701569-8214) [ x:collection1] o.a.s.c.S.Request [collection1] webapp=/solr path=/replication params={generation=3&qt=/replication&file=_0.si&checksum=true&wt=filestream&command=filecontent} status=0 QTime=0
    [junit4] 2> 975424 INFO (qtp1623701569-8215) [ x:collection1] o.a.s.c.S.Request [collection1] webapp=/solr path=/replication params={generation=3&qt=/replication&file=_0_MockRandom_0.tix&checksum=true&wt=filestream&command=filecontent} status=0 QTime=0
    [junit4] 2> 975426 INFO (qtp1623701569-8209) [ x:collection1] o.a.s.c.S.Request [collection1] webapp=/solr path=/replication params={generation=3&qt=/replication&file=_0_MockRandom_0.doc&checksum=true&wt=filestream&command=filecontent} status=0 QTime=0
    [junit4] 2> 975428 INFO (qtp1623701569-8216) [ x:collection1] o.a.s.c.S.Request [collection1] webapp=/solr path=/replication params={generation=3&qt=/replication&file=_0.nvd&checksum=true&wt=filestream&command=filecontent} status=0 QTime=0
    [junit4] 2> 975430 INFO (qtp1623701569-8214) [ x:collection1] o.a.s.c.S.Request [collection1] webapp=/solr path=/replication params={generation=3&qt=/replication&file=_0_MockRandom_0.tbk&checksum=true&wt=filestream&command=filecontent} status=0 QTime=0
    [junit4] 2> 975432 INFO (qtp1623701569-8215) [ x:collection1] o.a.s.c.S.Request [collection1] webapp=/solr path=/replication params={generation=3&qt=/replication&file=_0_MockRandom_0.sd&checksum=true&wt=filestream&command=filecontent} status=0 QTime=0
    [junit4] 2> 975434 INFO (qtp1623701569-8209) [ x:collection1] o.a.s.c.S.Request [collection1] webapp=/solr path=/replication params={generation=3&qt=/replication&file=_0.fdx&checksum=true&wt=filestream&command=filecontent} status=0 QTime=0
    [junit4] 2> 975435 INFO (qtp1623701569-8216) [ x:collection1] o.a.s.c.S.Request [collection1] webapp=/solr path=/replication params={generation=3&qt=/replication&file=_0.fdt&checksum=true&wt=filestream&command=filecontent} status=0 QTime=0
    [junit4] 2> 975438 INFO (qtp1623701569-8214) [ x:collection1] o.a.s.c.S.Request [collection1] webapp=/solr path=/replication params={generation=3&qt=/replication&file=_0.fnm&checksum=true&wt=filestream&command=filecontent} status=0 QTime=0
    [junit4] 2> 975439 INFO (qtp1623701569-8215) [ x:collection1] o.a.s.c.S.Request [collection1] webapp=/solr path=/replication params={generation=3&qt=/replication&file=_0.nvm&checksum=true&wt=filestream&command=filecontent} status=0 QTime=0
    [junit4] 2> 975441 INFO (qtp1623701569-8209) [ x:collection1] o.a.s.c.S.Request [collection1] webapp=/solr path=/replication params={generation=3&qt=/replication&file=_1_MockRandom_0.doc&checksum=true&wt=filestream&command=filecontent} status=0 QTime=0
    [junit4] 2> 975443 INFO (qtp1623701569-8216) [ x:collection1] o.a.s.c.S.Request [collection1] webapp=/solr path=/replication params={generation=3&qt=/replication&file=_1_MockRandom_0.sd&checksum=true&wt=filestream&command=filecontent} status=0 QTime=0
    [junit4] 2> 975445 INFO (qtp1623701569-8214) [ x:collection1] o.a.s.c.S.Request [collection1] webapp=/solr path=/replication params={generation=3&qt=/replication&file=_1_MockRandom_0.tio&checksum=true&wt=filestream&command=filecontent} status=0 QTime=0
    [junit4] 2> 975447 INFO (qtp1623701569-8215) [ x:collection1] o.a.s.c.S.Request [collection1] webapp=/solr path=/replication params={generation=3&qt=/replication&file=_1.si&checksum=true&wt=filestream&command=filecontent} status=0 QTime=0
    [junit4] 2> 975449 INFO (qtp1623701569-8209) [ x:collection1] o.a.s.c.S.Request [collection1] webapp=/solr path=/replication params={generation=3&qt=/replication&file=_1.nvd&checksum=true&wt=filestream&command=filecontent} status=0 QTime=0
    [junit4] 2> 975450 INFO (qtp1623701569-8216) [ x:collection1] o.a.s.c.S.Request [collection1] webapp=/solr path=/replication params={generation=3&qt=/replication&file=_1_MockRandom_0.tipo&checksum=true&wt=filestream&command=filecontent} status=0 QTime=0
    [junit4] 2> 975452 INFO (qtp1623701569-8214) [ x:collection1] o.a.s.c.S.Request [collection1] webapp=/solr path=/replication params={generation=3&qt=/replication&file=_1.fdx&checksum=true&wt=filestream&command=filecontent} status=0 QTime=0
    [junit4] 2> 975454 INFO (qtp1623701569-8215) [ x:collection1] o.a.s.c.S.Request [collection1] webapp=/solr path=/replication params={generation=3&qt=/replication&file=_1.fnm&checksum=true&wt=filestream&command=filecontent} status=0 QTime=0
    [junit4] 2> 975455 INFO (qtp1623701569-8209) [ x:collection1] o.a.s.c.S.Request [collection1] webapp=/solr path=/replication params={generation=3&qt=/replication&file=_1.nvm&checksum=true&wt=filestream&command=filecontent} status=0 QTime=0
    [junit4] 2> 975457 INFO (qtp1623701569-8216) [ x:collection1] o.a.s.c.S.Request [collection1] webapp=/solr path=/replication params={generation=3&qt=/replication&file=_1.fdt&checksum=true&wt=filestream&command=filecontent} status=0 QTime=0
    [junit4] 2> 975459 INFO (qtp1623701569-8214) [ x:collection1] o.a.s.c.S.Request [collection1] webapp=/solr path=/replication params={generation=3&qt=/replication&file=segments_3&checksum=true&wt=filestream&command=filecontent} status=0 QTime=0
    [junit4] 2> 975459 INFO (explicit-fetchindex-cmd) [ x:collection1] o.a.s.h.IndexFetcher Total time taken for download (fullCopy=true,bytesDownloaded=3200) : 0 secs (null bytes/sec) to MockDirectoryWrapper(RAMDirectory@4151189b lockFactory=org.apache.lucene.store.SingleInstanceLockFactory@553f5d34)
    [junit4] 2> 975460 INFO (explicit-fetchindex-cmd) [ x:collection1] o.a.s.h.IndexFetcher New index installed. Updating index properties... index=index.20160616041702837
    [junit4] 2> 975461 INFO (explicit-fetchindex-cmd) [ x:collection1] o.a.s.h.IndexFetcher removing old index directory MockDirectoryWrapper(RAMDirectory@25a07e52 lockFactory=org.apache.lucene.store.SingleInstanceLockFactory@1677c3ea)
    [junit4] 2> 975461 INFO (explicit-fetchindex-cmd) [ x:collection1] o.a.s.u.DefaultSolrCoreState Rollback old IndexWriter... core=collection1
    [junit4] 2> 975461 INFO (explicit-fetch

[...truncated too long message...]

onHandler_4D182744B582250E-001/solr-instance-029/./collection1/data/index
    [junit4] 2> 1068477 INFO (coreCloseExecutor-4856-thread-1) [ x:collection1] o.a.s.c.CachingDirectoryFactory looking to close /home/jenkins/workspace/Lucene-Solr-6.1-Linux/solr/build/solr-core/test/J1/temp/solr.handler.TestReplicationHandler_4D182744B582250E-001/solr-instance-029/./collection1/data [CachedDir<<refCount=0;path=/home/jenkins/workspace/Lucene-Solr-6.1-Linux/solr/build/solr-core/test/J1/temp/solr.handler.TestReplicationHandler_4D182744B582250E-001/solr-instance-029/./collection1/data;done=false>>]
    [junit4] 2> 1068477 INFO (coreCloseExecutor-4856-thread-1) [ x:collection1] o.a.s.c.CachingDirectoryFactory Closing directory, CoreContainer#isShutdown=true
    [junit4] 2> 1068477 INFO (coreCloseExecutor-4856-thread-1) [ x:collection1] o.a.s.c.CachingDirectoryFactory Closing directory: /home/jenkins/workspace/Lucene-Solr-6.1-Linux/solr/build/solr-core/test/J1/temp/solr.handler.TestReplicationHandler_4D182744B582250E-001/solr-instance-029/./collection1/data
    [junit4] 2> 1068477 INFO (TEST-TestReplicationHandler.testEmptyCommits-seed#[4D182744B582250E]) [ ] o.e.j.s.h.ContextHandler Stopped o.e.j.s.ServletContextHandler@5440ea1f{/solr,null,UNAVAILABLE}
    [junit4] 2> 1068478 INFO (TEST-TestReplicationHandler.testEmptyCommits-seed#[4D182744B582250E]) [ ] o.e.j.s.ServerConnector Stopped ServerConnector@4cb5c680{HTTP/1.1,[http/1.1]}{127.0.0.1:0}
    [junit4] 2> 1068478 INFO (TEST-TestReplicationHandler.testEmptyCommits-seed#[4D182744B582250E]) [ ] o.a.s.c.CoreContainer Shutting down CoreContainer instance=915382199
    [junit4] 2> 1068478 INFO (coreCloseExecutor-4858-thread-1) [ x:collection1] o.a.s.c.SolrCore [collection1] CLOSING SolrCore org.apache.solr.core.SolrCore@2563f004
    [junit4] 2> 1068478 INFO (coreCloseExecutor-4858-thread-1) [ x:collection1] o.a.s.u.DirectUpdateHandler2 closing DirectUpdateHandler2{commits=0,autocommits=0,soft autocommits=0,optimizes=0,rollbacks=0,expungeDeletes=0,docsPending=0,adds=0,deletesById=0,deletesByQuery=0,errors=0,cumulative_adds=0,cumulative_deletesById=0,cumulative_deletesByQuery=0,cumulative_errors=0}
    [junit4] 2> 1068478 INFO (coreCloseExecutor-4858-thread-1) [ x:collection1] o.a.s.u.SolrCoreState Closing SolrCoreState
    [junit4] 2> 1068478 INFO (coreCloseExecutor-4858-thread-1) [ x:collection1] o.a.s.u.DefaultSolrCoreState SolrCoreState ref count has reached 0 - closing IndexWriter
    [junit4] 2> 1068478 INFO (coreCloseExecutor-4858-thread-1) [ x:collection1] o.a.s.u.DefaultSolrCoreState closing IndexWriter with IndexWriterCloser
    [junit4] 2> 1068479 INFO (coreCloseExecutor-4858-thread-1) [ x:collection1] o.a.s.c.SolrCore [collection1] Closing main searcher on request.
    [junit4] 2> 1068479 INFO (coreCloseExecutor-4858-thread-1) [ x:collection1] o.a.s.c.CachingDirectoryFactory Closing MockDirectoryFactory - 2 directories currently being tracked
    [junit4] 2> 1068479 INFO (coreCloseExecutor-4858-thread-1) [ x:collection1] o.a.s.c.CachingDirectoryFactory looking to close /home/jenkins/workspace/Lucene-Solr-6.1-Linux/solr/build/solr-core/test/J1/temp/solr.handler.TestReplicationHandler_4D182744B582250E-001/solr-instance-030/./collection1/data/index.20160616041835783 [CachedDir<<refCount=0;path=/home/jenkins/workspace/Lucene-Solr-6.1-Linux/solr/build/solr-core/test/J1/temp/solr.handler.TestReplicationHandler_4D182744B582250E-001/solr-instance-030/./collection1/data/index.20160616041835783;done=false>>]
    [junit4] 2> 1068479 INFO (coreCloseExecutor-4858-thread-1) [ x:collection1] o.a.s.c.CachingDirectoryFactory Closing directory, CoreContainer#isShutdown=true
    [junit4] 2> 1068479 INFO (coreCloseExecutor-4858-thread-1) [ x:collection1] o.a.s.c.CachingDirectoryFactory Closing directory: /home/jenkins/workspace/Lucene-Solr-6.1-Linux/solr/build/solr-core/test/J1/temp/solr.handler.TestReplicationHandler_4D182744B582250E-001/solr-instance-030/./collection1/data/index.20160616041835783
    [junit4] 2> 1068479 INFO (coreCloseExecutor-4858-thread-1) [ x:collection1] o.a.s.c.CachingDirectoryFactory looking to close /home/jenkins/workspace/Lucene-Solr-6.1-Linux/solr/build/solr-core/test/J1/temp/solr.handler.TestReplicationHandler_4D182744B582250E-001/solr-instance-030/./collection1/data [CachedDir<<refCount=0;path=/home/jenkins/workspace/Lucene-Solr-6.1-Linux/solr/build/solr-core/test/J1/temp/solr.handler.TestReplicationHandler_4D182744B582250E-001/solr-instance-030/./collection1/data;done=false>>]
    [junit4] 2> 1068479 INFO (coreCloseExecutor-4858-thread-1) [ x:collection1] o.a.s.c.CachingDirectoryFactory Closing directory, CoreContainer#isShutdown=true
    [junit4] 2> 1068479 INFO (coreCloseExecutor-4858-thread-1) [ x:collection1] o.a.s.c.CachingDirectoryFactory Closing directory: /home/jenkins/workspace/Lucene-Solr-6.1-Linux/solr/build/solr-core/test/J1/temp/solr.handler.TestReplicationHandler_4D182744B582250E-001/solr-instance-030/./collection1/data
    [junit4] 2> 1068479 INFO (TEST-TestReplicationHandler.testEmptyCommits-seed#[4D182744B582250E]) [ ] o.e.j.s.h.ContextHandler Stopped o.e.j.s.ServletContextHandler@4711bef4{/solr,null,UNAVAILABLE}
    [junit4] 2> 1068480 INFO (SUITE-TestReplicationHandler-seed#[4D182744B582250E]-worker) [ ] o.a.s.SolrTestCaseJ4 ###deleteCore
    [junit4] 2> NOTE: leaving temporary files on disk at: /home/jenkins/workspace/Lucene-Solr-6.1-Linux/solr/build/solr-core/test/J1/temp/solr.handler.TestReplicationHandler_4D182744B582250E-001
    [junit4] 2> NOTE: test params are: codec=Asserting(Lucene60): {name=PostingsFormat(name=MockRandom), id=PostingsFormat(name=MockRandom), newname=PostingsFormat(name=MockRandom)}, docValues:{}, maxPointsInLeafNode=1979, maxMBSortInHeap=6.956443588460678, sim=RandomSimilarity(queryNorm=true,coord=crazy): {}, locale=ca-ES, timezone=Australia/Brisbane
    [junit4] 2> NOTE: Linux 4.4.0-24-generic amd64/Oracle Corporation 1.8.0_92 (64-bit)/cpus=12,threads=1,free=205070880,total=518979584
    [junit4] 2> NOTE: All tests run in this JVM: [TestSurroundQueryParser, ZkStateReaderTest, ClusterStateUpdateTest, TestSolrDeletionPolicy2, TestSolrCLIRunExample, BlockCacheTest, ZkSolrClientTest, TestConfigSets, NotRequiredUniqueKeyTest, TestNamedUpdateProcessors, TestCoreContainer, TestClassicSimilarityFactory, TestSubQueryTransformerCrossCore, TestFieldCache, SaslZkACLProviderTest, TestExactStatsCache, SimplePostToolTest, TestWordDelimiterFilterFactory, TestInfoStreamLogging, FileUtilsTest, AnalyticsQueryTest, TestSchemaNameResource, FastVectorHighlighterTest, AsyncMigrateRouteKeyTest, IgnoreCommitOptimizeUpdateProcessorFactoryTest, OutOfBoxZkACLAndCredentialsProvidersTest, TestQueryUtils, WordBreakSolrSpellCheckerTest, ConjunctionSolrSpellCheckerTest, HdfsCollectionsAPIDistributedZkTest, ChaosMonkeyNothingIsSafeTest, TestSolrCoreProperties, BlockJoinFacetDistribTest, HighlighterTest, SolrIndexSplitterTest, ChaosMonkeySafeLeaderTest, TestFastLRUCache, DOMUtilTest, TermVectorComponentTest, TestCloudDeleteByQuery, SolrCmdDistributorTest, SharedFSAutoReplicaFailoverUtilsTest, ConfigSetsAPITest, TestSolrConfigHandlerCloud, SpellPossibilityIteratorTest, TestCustomDocTransformer, CoreAdminRequestStatusTest, TestMaxScoreQueryParser, TestDynamicFieldCollectionResource, UniqFieldsUpdateProcessorFactoryTest, ConvertedLegacyTest, DistributedIntervalFacetingTest, TestHashPartitioner, SchemaVersionSpecificBehaviorTest, TestTrie, TestXmlQParser, TestFieldResource, DistributedQueryComponentCustomSortTest, PKIAuthenticationIntegrationTest, TestSolrQueryParserResource, CollectionsAPIDistributedZkTest, TestPartialUpdateDeduplication, TestQueryTypes, CSVRequestHandlerTest, SpatialFilterTest, SpatialRPTFieldTypeTest, TestManagedSynonymFilterFactory, AnalysisErrorHandlingTest, TestReqParamsAPI, TestPerFieldSimilarityClassic, SpellCheckComponentTest, ShardRoutingTest, TestSolrDynamicMBean, OpenCloseCoreStressTest, TimeZoneUtilsTest, TestOverriddenPrefixQueryForCustomFieldType, TestBlobHandler, TestSortingResponseWriter, DistributedFacetPivotSmallAdvancedTest, HdfsDirectoryTest, RestartWhileUpdatingTest, TestCodecSupport, VersionInfoTest, SoftAutoCommitTest, TestRawResponseWriter, CollectionReloadTest, BasicFunctionalityTest, BigEndianAscendingWordSerializerTest, SecurityConfHandlerTest, TestDistributedGrouping, TestSchemaVersionResource, ExitableDirectoryReaderTest, TermsComponentTest, CheckHdfsIndexTest, TestTolerantUpdateProcessorCloud, TestFileDictionaryLookup, LeaderElectionIntegrationTest, TestReplicationHandler]
    [junit4] Completed [313/614 (1!)] on J1 in 94.22s, 15 tests, 1 failure, 1 skipped <<< FAILURES!

[...truncated 982 lines...]
BUILD FAILED
/home/jenkins/workspace/Lucene-Solr-6.1-Linux/build.xml:740: The following error occurred while executing this line:
/home/jenkins/workspace/Lucene-Solr-6.1-Linux/build.xml:684: The following error occurred while executing this line:
/home/jenkins/workspace/Lucene-Solr-6.1-Linux/build.xml:59: The following error occurred while executing this line:
/home/jenkins/workspace/Lucene-Solr-6.1-Linux/solr/build.xml:233: The following error occurred while executing this line:
/home/jenkins/workspace/Lucene-Solr-6.1-Linux/solr/common-build.xml:531: The following error occurred while executing this line:
/home/jenkins/workspace/Lucene-Solr-6.1-Linux/lucene/common-build.xml:1427: The following error occurred while executing this line:
/home/jenkins/workspace/Lucene-Solr-6.1-Linux/lucene/common-build.xml:984: There were test failures: 614 suites (10 ignored), 2580 tests, 1 failure, 116 ignored (72 assumptions) [seed: 4D182744B582250E]

Total time: 57 minutes 27 seconds
Build step 'Invoke Ant' marked build as failure
Archiving artifacts
[WARNINGS] Skipping publisher since build result is FAILURE
Recording test results
Email was triggered for: Failure - Any
Sending email for trigger: Failure - Any

Search Discussions

Discussion Posts

Follow ups

Related Discussions

Discussion Navigation
viewthread | post
posts ‹ prev | 1 of 2 | next ›
Discussion Overview
groupdev @
categorieslucene
postedJun 15, '16 at 6:34p
activeJun 15, '16 at 10:56p
posts2
users1
websitelucene.apache.org

1 user in discussion

Policeman Jenkins Server: 2 posts

People

Translate

site design / logo © 2017 Grokbase