Grokbase Groups Lucene dev June 2016
FAQ
Build: http://jenkins.thetaphi.de/job/Lucene-Solr-master-Windows/5912/
Java: 32bit/jdk1.8.0_92 -server -XX:+UseSerialGC

1 tests failed.
FAILED: junit.framework.TestSuite.org.apache.lucene.codecs.lucene50.TestLucene50TermVectorsFormat

Error Message:
Could not remove the following files (in the order of attempts): C:\Users\jenkins\workspace\Lucene-Solr-master-Windows\lucene\build\core\test\J0\temp\lucene.codecs.lucene50.TestLucene50TermVectorsFormat_6636754741E1ABCD-001\justSoYouGetSomeChannelErrors-001: java.nio.file.AccessDeniedException: C:\Users\jenkins\workspace\Lucene-Solr-master-Windows\lucene\build\core\test\J0\temp\lucene.codecs.lucene50.TestLucene50TermVectorsFormat_6636754741E1ABCD-001\justSoYouGetSomeChannelErrors-001 C:\Users\jenkins\workspace\Lucene-Solr-master-Windows\lucene\build\core\test\J0\temp\lucene.codecs.lucene50.TestLucene50TermVectorsFormat_6636754741E1ABCD-001: java.nio.file.DirectoryNotEmptyException: C:\Users\jenkins\workspace\Lucene-Solr-master-Windows\lucene\build\core\test\J0\temp\lucene.codecs.lucene50.TestLucene50TermVectorsFormat_6636754741E1ABCD-001

Stack Trace:
java.io.IOException: Could not remove the following files (in the order of attempts):
    C:\Users\jenkins\workspace\Lucene-Solr-master-Windows\lucene\build\core\test\J0\temp\lucene.codecs.lucene50.TestLucene50TermVectorsFormat_6636754741E1ABCD-001\justSoYouGetSomeChannelErrors-001: java.nio.file.AccessDeniedException: C:\Users\jenkins\workspace\Lucene-Solr-master-Windows\lucene\build\core\test\J0\temp\lucene.codecs.lucene50.TestLucene50TermVectorsFormat_6636754741E1ABCD-001\justSoYouGetSomeChannelErrors-001
    C:\Users\jenkins\workspace\Lucene-Solr-master-Windows\lucene\build\core\test\J0\temp\lucene.codecs.lucene50.TestLucene50TermVectorsFormat_6636754741E1ABCD-001: java.nio.file.DirectoryNotEmptyException: C:\Users\jenkins\workspace\Lucene-Solr-master-Windows\lucene\build\core\test\J0\temp\lucene.codecs.lucene50.TestLucene50TermVectorsFormat_6636754741E1ABCD-001

  at __randomizedtesting.SeedInfo.seed([6636754741E1ABCD]:0)
  at org.apache.lucene.util.IOUtils.rm(IOUtils.java:323)
  at org.apache.lucene.util.TestRuleTemporaryFilesCleanup.afterAlways(TestRuleTemporaryFilesCleanup.java:216)
  at com.carrotsearch.randomizedtesting.rules.TestRuleAdapter$1.afterAlways(TestRuleAdapter.java:31)
  at com.carrotsearch.randomizedtesting.rules.StatementAdapter.evaluate(StatementAdapter.java:43)
  at com.carrotsearch.randomizedtesting.rules.StatementAdapter.evaluate(StatementAdapter.java:36)
  at org.apache.lucene.util.TestRuleAssertionsRequired$1.evaluate(TestRuleAssertionsRequired.java:53)
  at org.apache.lucene.util.TestRuleMarkFailure$1.evaluate(TestRuleMarkFailure.java:47)
  at org.apache.lucene.util.TestRuleIgnoreAfterMaxFailures$1.evaluate(TestRuleIgnoreAfterMaxFailures.java:64)
  at org.apache.lucene.util.TestRuleIgnoreTestSuites$1.evaluate(TestRuleIgnoreTestSuites.java:54)
  at com.carrotsearch.randomizedtesting.rules.StatementAdapter.evaluate(StatementAdapter.java:36)
  at com.carrotsearch.randomizedtesting.ThreadLeakControl$StatementRunner.run(ThreadLeakControl.java:367)
  at java.lang.Thread.run(Thread.java:745)




Build Log:
[...truncated 1373 lines...]
    [junit4] Suite: org.apache.lucene.codecs.lucene50.TestLucene50TermVectorsFormat
    [junit4] 2> NOTE: test params are: codec=Asserting(Lucene62): {}, docValues:{}, maxPointsInLeafNode=1018, maxMBSortInHeap=6.557135230091669, sim=ClassicSimilarity, locale=de-DE, timezone=Asia/Baku
    [junit4] 2> NOTE: Windows 10 10.0 x86/Oracle Corporation 1.8.0_92 (32-bit)/cpus=3,threads=1,free=119749040,total=298242048
    [junit4] 2> NOTE: All tests run in this JVM: [TestDirectPacked, TestLucene53NormsFormat, TestFieldType, TestSegmentTermDocs, TestFieldMaskingSpanQuery, TestDuelingCodecs, TestTryDelete, TestFixedBitSet, TestTimeLimitingCollector, TestTwoPhaseCommitTool, TestDocumentsWriterDeleteQueue, TestFilterDirectory, TestMutableValues, TestSortRescorer, TestCrash, TestFixedLengthBytesRefArray, TestConstantScoreQuery, TestAutomatonQueryUnicode, TestIntsRef, TestNRTCachingDirectory, TestPayloadsOnVectors, TestBufferedIndexInput, TestSloppyMath, TestOfflineSorter, TestSpanExplanations, TestLucene50FieldInfoFormat, TestIndexWriterMerging, TestIndexWriterWithThreads, TestMergeSchedulerExternal, TestDoc, TestRamUsageEstimator, TestTopDocsCollector, Test2BPagedBytes, TestSpanSearchEquivalence, Test2BBKDPoints, TestBytesRef, TestRegexpRandom2, TestFastDecompressionMode, TestNumericTokenStream, TestIndexSearcher, TestDocValuesIndexing, TestInPlaceMergeSorter, TestMinimize, TestLogMergePolicy, TestFieldCacheRewriteMethod, TestNamedSPILoader, TestDocValuesRewriteMethod, TestRegexpRandom, TestSmallFloat, TestTermdocPerf, TestPostingsOffsets, TestCharFilter, TestBytesRefAttImpl, TestMultiDocValues, TestTermScorer, TestPhrasePrefixQuery, TestParallelReaderEmptyIndex, TestNGramPhraseQuery, TestIndexSorting, TestPointValues, TestIntroSorter, TestStopFilter, TestIndexWriterOutOfFileDescriptors, TestSimpleFSLockFactory, TestSortedSetDocValues, TestBasics, TestSpanNearQuery, TestLiveFieldValues, TestAllFilesHaveCodecHeader, TestSearchAfter, TestEarlyTermination, TestMultiTermQueryRewrites, TestPositiveScoresOnlyCollector, TestNot, TestIndexableField, TestBlendedTermQuery, TestExitableDirectoryReader, TestFilterIterator, TestCodecHoldsOpenFiles, TestPolygon2D, TestForUtil, TestFastCompressionMode, TestField, TestSpanOrQuery, TestFuzzyQuery, TestMatchNoDocsQuery, TestFilterLeafReader, TestCustomSearcherSort, TestPointQueries, TestSearchForDuplicates, TestNearSpansOrdered, TestPrefixRandom, TestDateTools, TestArrayUtil, TestNIOFSDirectory, TestIndexWriterMaxDocs, TestBoolean2, TestNRTReaderWithThreads, TestSleepingLockWrapper, TestDocument, TestBooleanRewrites, TestIndexWriterCommit, TestSameTokenSamePosition, TestIndexFileDeleter, TestDirectoryReader, TestHighCompressionMode, TestIndexWriterForceMerge, TestBytesRefArray, TestSnapshotDeletionPolicy, TestTieredMergePolicy, TestByteSlices, TestTermsEnum, TestTermsEnum2, TestDeterminizeLexicon, TestSpans, TestStressIndexing2, TestMultiPhraseQuery, TestLazyProxSkipping, TestDocsAndPositions, TestCodecs, TestCharTermAttributeImpl, TestOmitPositions, TestBytesRefHash, TestSloppyPhraseQuery2, TestDisjunctionMaxQuery, TestMultiFields, TestTermRangeQuery, TestForTooMuchCloning, TestPayloads, TestExternalCodecs, TestSimpleExplanationsOfNonMatches, TestMultiValuedNumericRangeQuery, TestSegmentTermEnum, TestBooleanQuery, TestSortRandom, TestMaxTermFrequency, TestTopFieldCollector, TestSentinelIntSet, TestCheckIndex, TestCompiledAutomaton, TestParallelTermEnum, TestElevationComparator, TestSubScorerFreqs, TestRecyclingIntBlockAllocator, TestIndexWriterConfig, TestPositionIncrement, TestVirtualMethod, TestCachingTokenFilter, Test2BPostings, TestCachingCollector, TestTotalHitCountCollector, TestBooleanScorer, TestIndexWriterOnJRECrash, Test4GBStoredFields, Test2BPositions, TestTerm, Test2BTerms, Test2BNumericDocValues, TestCharArraySet, TestReusableStringReader, TestBlockPostingsFormat, TestBlockPostingsFormat2, TestBlockPostingsFormat3, TestLucene50StoredFieldsFormat, TestLucene50StoredFieldsFormatHighCompression, TestLucene50TermVectorsFormat]
    [junit4] 2> NOTE: reproduce with: ant test -Dtestcase=TestLucene50TermVectorsFormat -Dtests.seed=6636754741E1ABCD -Dtests.slow=true -Dtests.locale=de-DE -Dtests.timezone=Asia/Baku -Dtests.asserts=true -Dtests.file.encoding=UTF-8
    [junit4] ERROR 0.00s J0 | TestLucene50TermVectorsFormat (suite) <<<
    [junit4] > Throwable #1: java.io.IOException: Could not remove the following files (in the order of attempts):
    [junit4] > C:\Users\jenkins\workspace\Lucene-Solr-master-Windows\lucene\build\core\test\J0\temp\lucene.codecs.lucene50.TestLucene50TermVectorsFormat_6636754741E1ABCD-001\justSoYouGetSomeChannelErrors-001: java.nio.file.AccessDeniedException: C:\Users\jenkins\workspace\Lucene-Solr-master-Windows\lucene\build\core\test\J0\temp\lucene.codecs.lucene50.TestLucene50TermVectorsFormat_6636754741E1ABCD-001\justSoYouGetSomeChannelErrors-001
    [junit4] > C:\Users\jenkins\workspace\Lucene-Solr-master-Windows\lucene\build\core\test\J0\temp\lucene.codecs.lucene50.TestLucene50TermVectorsFormat_6636754741E1ABCD-001: java.nio.file.DirectoryNotEmptyException: C:\Users\jenkins\workspace\Lucene-Solr-master-Windows\lucene\build\core\test\J0\temp\lucene.codecs.lucene50.TestLucene50TermVectorsFormat_6636754741E1ABCD-001
    [junit4] > at __randomizedtesting.SeedInfo.seed([6636754741E1ABCD]:0)
    [junit4] > at org.apache.lucene.util.IOUtils.rm(IOUtils.java:323)
    [junit4] > at java.lang.Thread.run(Thread.java:745)
    [junit4] Completed [356/432 (1!)] on J0 in 8.50s, 17 tests, 1 error <<< FAILURES!

[...truncated 266 lines...]
BUILD FAILED
C:\Users\jenkins\workspace\Lucene-Solr-master-Windows\build.xml:740: The following error occurred while executing this line:
C:\Users\jenkins\workspace\Lucene-Solr-master-Windows\build.xml:684: The following error occurred while executing this line:
C:\Users\jenkins\workspace\Lucene-Solr-master-Windows\build.xml:59: The following error occurred while executing this line:
C:\Users\jenkins\workspace\Lucene-Solr-master-Windows\lucene\build.xml:50: The following error occurred while executing this line:
C:\Users\jenkins\workspace\Lucene-Solr-master-Windows\lucene\common-build.xml:1427: The following error occurred while executing this line:
C:\Users\jenkins\workspace\Lucene-Solr-master-Windows\lucene\common-build.xml:984: There were test failures: 432 suites (1 ignored), 3703 tests, 1 suite-level error, 72 ignored (68 assumptions) [seed: 6636754741E1ABCD]

Total time: 9 minutes 1 second
Build step 'Invoke Ant' marked build as failure
Archiving artifacts
[WARNINGS] Skipping publisher since build result is FAILURE
Recording test results
Email was triggered for: Failure - Any
Sending email for trigger: Failure - Any

Search Discussions

Related Discussions

Discussion Navigation
viewthread | post
posts ‹ prev | 1 of 1 | next ›
Discussion Overview
groupdev @
categorieslucene
postedJun 15, '16 at 2:19p
activeJun 15, '16 at 2:19p
posts1
users1
websitelucene.apache.org

1 user in discussion

Policeman Jenkins Server: 1 post

People

Translate

site design / logo © 2017 Grokbase