Grokbase Groups Lucene dev June 2016
FAQ
Build: http://jenkins.thetaphi.de/job/Lucene-Solr-6.1-Windows/13/
Java: 32bit/jdk1.8.0_92 -server -XX:+UseConcMarkSweepGC

1 tests failed.
FAILED: junit.framework.TestSuite.org.apache.solr.handler.TestSolrConfigHandlerCloud

Error Message:
2 threads leaked from SUITE scope at org.apache.solr.handler.TestSolrConfigHandlerCloud: 1) Thread[id=8563, name=Thread-2896, state=TIMED_WAITING, group=TGRP-TestSolrConfigHandlerCloud] at java.lang.Thread.sleep(Native Method) at org.apache.solr.cloud.ZkSolrResourceLoader.openResource(ZkSolrResourceLoader.java:101) at org.apache.solr.core.SolrResourceLoader.openSchema(SolrResourceLoader.java:333) at org.apache.solr.schema.IndexSchemaFactory.create(IndexSchemaFactory.java:48) at org.apache.solr.schema.IndexSchemaFactory.buildIndexSchema(IndexSchemaFactory.java:75) at org.apache.solr.core.ConfigSetService.createIndexSchema(ConfigSetService.java:108) at org.apache.solr.core.ConfigSetService.getConfig(ConfigSetService.java:79) at org.apache.solr.core.CoreContainer.reload(CoreContainer.java:912) at org.apache.solr.core.SolrCore.lambda$getConfListener$6(SolrCore.java:2510) at org.apache.solr.core.SolrCore$$Lambda$62/5403071.run(Unknown Source) at org.apache.solr.cloud.ZkController$4.run(ZkController.java:2408) 2) Thread[id=7744, name=Thread-2747, state=TIMED_WAITING, group=TGRP-TestSolrConfigHandlerCloud] at java.lang.Thread.sleep(Native Method) at org.apache.solr.cloud.ZkSolrResourceLoader.openResource(ZkSolrResourceLoader.java:101) at org.apache.solr.core.SolrResourceLoader.openSchema(SolrResourceLoader.java:333) at org.apache.solr.schema.IndexSchemaFactory.create(IndexSchemaFactory.java:48) at org.apache.solr.schema.IndexSchemaFactory.buildIndexSchema(IndexSchemaFactory.java:75) at org.apache.solr.core.ConfigSetService.createIndexSchema(ConfigSetService.java:108) at org.apache.solr.core.ConfigSetService.getConfig(ConfigSetService.java:79) at org.apache.solr.core.CoreContainer.reload(CoreContainer.java:912) at org.apache.solr.core.SolrCore.lambda$getConfListener$6(SolrCore.java:2510) at org.apache.solr.core.SolrCore$$Lambda$62/5403071.run(Unknown Source) at org.apache.solr.cloud.ZkController$4.run(ZkController.java:2408)

Stack Trace:
com.carrotsearch.randomizedtesting.ThreadLeakError: 2 threads leaked from SUITE scope at org.apache.solr.handler.TestSolrConfigHandlerCloud:
    1) Thread[id=8563, name=Thread-2896, state=TIMED_WAITING, group=TGRP-TestSolrConfigHandlerCloud]
         at java.lang.Thread.sleep(Native Method)
         at org.apache.solr.cloud.ZkSolrResourceLoader.openResource(ZkSolrResourceLoader.java:101)
         at org.apache.solr.core.SolrResourceLoader.openSchema(SolrResourceLoader.java:333)
         at org.apache.solr.schema.IndexSchemaFactory.create(IndexSchemaFactory.java:48)
         at org.apache.solr.schema.IndexSchemaFactory.buildIndexSchema(IndexSchemaFactory.java:75)
         at org.apache.solr.core.ConfigSetService.createIndexSchema(ConfigSetService.java:108)
         at org.apache.solr.core.ConfigSetService.getConfig(ConfigSetService.java:79)
         at org.apache.solr.core.CoreContainer.reload(CoreContainer.java:912)
         at org.apache.solr.core.SolrCore.lambda$getConfListener$6(SolrCore.java:2510)
         at org.apache.solr.core.SolrCore$$Lambda$62/5403071.run(Unknown Source)
         at org.apache.solr.cloud.ZkController$4.run(ZkController.java:2408)
    2) Thread[id=7744, name=Thread-2747, state=TIMED_WAITING, group=TGRP-TestSolrConfigHandlerCloud]
         at java.lang.Thread.sleep(Native Method)
         at org.apache.solr.cloud.ZkSolrResourceLoader.openResource(ZkSolrResourceLoader.java:101)
         at org.apache.solr.core.SolrResourceLoader.openSchema(SolrResourceLoader.java:333)
         at org.apache.solr.schema.IndexSchemaFactory.create(IndexSchemaFactory.java:48)
         at org.apache.solr.schema.IndexSchemaFactory.buildIndexSchema(IndexSchemaFactory.java:75)
         at org.apache.solr.core.ConfigSetService.createIndexSchema(ConfigSetService.java:108)
         at org.apache.solr.core.ConfigSetService.getConfig(ConfigSetService.java:79)
         at org.apache.solr.core.CoreContainer.reload(CoreContainer.java:912)
         at org.apache.solr.core.SolrCore.lambda$getConfListener$6(SolrCore.java:2510)
         at org.apache.solr.core.SolrCore$$Lambda$62/5403071.run(Unknown Source)
         at org.apache.solr.cloud.ZkController$4.run(ZkController.java:2408)
  at __randomizedtesting.SeedInfo.seed([8BA9A25AF74EB84D]:0)




Build Log:
[...truncated 11458 lines...]
    [junit4] Suite: org.apache.solr.handler.TestSolrConfigHandlerCloud
    [junit4] 2> Creating dataDir: C:\Users\jenkins\workspace\Lucene-Solr-6.1-Windows\solr\build\solr-core\test\J1\temp\solr.handler.TestSolrConfigHandlerCloud_8BA9A25AF74EB84D-001\init-core-data-001
    [junit4] 2> 1015177 INFO (SUITE-TestSolrConfigHandlerCloud-seed#[8BA9A25AF74EB84D]-worker) [ ] o.a.s.SolrTestCaseJ4 Randomized ssl (false) and clientAuth (false) via: @org.apache.solr.util.RandomizeSSL(reason=, value=NaN, ssl=NaN, clientAuth=NaN)
    [junit4] 2> 1015178 INFO (SUITE-TestSolrConfigHandlerCloud-seed#[8BA9A25AF74EB84D]-worker) [ ] o.a.s.BaseDistributedSearchTestCase Setting hostContext system property: /_/od
    [junit4] 2> 1015181 INFO (TEST-TestSolrConfigHandlerCloud.test-seed#[8BA9A25AF74EB84D]) [ ] o.a.s.c.ZkTestServer STARTING ZK TEST SERVER
    [junit4] 2> 1015181 INFO (Thread-2567) [ ] o.a.s.c.ZkTestServer client port:0.0.0.0/0.0.0.0:0
    [junit4] 2> 1015181 INFO (Thread-2567) [ ] o.a.s.c.ZkTestServer Starting server
    [junit4] 2> 1015282 INFO (TEST-TestSolrConfigHandlerCloud.test-seed#[8BA9A25AF74EB84D]) [ ] o.a.s.c.ZkTestServer start zk server on port:57725
    [junit4] 2> 1015282 INFO (TEST-TestSolrConfigHandlerCloud.test-seed#[8BA9A25AF74EB84D]) [ ] o.a.s.c.c.SolrZkClient Using default ZkCredentialsProvider
    [junit4] 2> 1015283 INFO (TEST-TestSolrConfigHandlerCloud.test-seed#[8BA9A25AF74EB84D]) [ ] o.a.s.c.c.ConnectionManager Waiting for client to connect to ZooKeeper
    [junit4] 2> 1015287 INFO (zkCallback-1173-thread-1) [ ] o.a.s.c.c.ConnectionManager Watcher org.apache.solr.common.cloud.ConnectionManager@74df7c name:ZooKeeperConnection Watcher:127.0.0.1:57725 got event WatchedEvent state:SyncConnected type:None path:null path:null type:None
    [junit4] 2> 1015287 INFO (TEST-TestSolrConfigHandlerCloud.test-seed#[8BA9A25AF74EB84D]) [ ] o.a.s.c.c.ConnectionManager Client is connected to ZooKeeper
    [junit4] 2> 1015288 INFO (TEST-TestSolrConfigHandlerCloud.test-seed#[8BA9A25AF74EB84D]) [ ] o.a.s.c.c.SolrZkClient Using default ZkACLProvider
    [junit4] 2> 1015288 INFO (TEST-TestSolrConfigHandlerCloud.test-seed#[8BA9A25AF74EB84D]) [ ] o.a.s.c.c.SolrZkClient makePath: /solr
    [junit4] 2> 1015289 WARN (NIOServerCxn.Factory:0.0.0.0/0.0.0.0:0) [ ] o.a.z.s.NIOServerCnxn caught end of stream exception
    [junit4] 2> EndOfStreamException: Unable to read additional data from client sessionid 0x15554955c0c0000, likely client has closed socket
    [junit4] 2> at org.apache.zookeeper.server.NIOServerCnxn.doIO(NIOServerCnxn.java:228)
    [junit4] 2> at org.apache.zookeeper.server.NIOServerCnxnFactory.run(NIOServerCnxnFactory.java:208)
    [junit4] 2> at java.lang.Thread.run(Thread.java:745)
    [junit4] 2> 1015290 INFO (TEST-TestSolrConfigHandlerCloud.test-seed#[8BA9A25AF74EB84D]) [ ] o.a.s.c.c.SolrZkClient Using default ZkCredentialsProvider
    [junit4] 2> 1015295 INFO (TEST-TestSolrConfigHandlerCloud.test-seed#[8BA9A25AF74EB84D]) [ ] o.a.s.c.c.ConnectionManager Waiting for client to connect to ZooKeeper
    [junit4] 2> 1015296 INFO (zkCallback-1174-thread-1) [ ] o.a.s.c.c.ConnectionManager Watcher org.apache.solr.common.cloud.ConnectionManager@115fed5 name:ZooKeeperConnection Watcher:127.0.0.1:57725/solr got event WatchedEvent state:SyncConnected type:None path:null path:null type:None
    [junit4] 2> 1015296 INFO (TEST-TestSolrConfigHandlerCloud.test-seed#[8BA9A25AF74EB84D]) [ ] o.a.s.c.c.ConnectionManager Client is connected to ZooKeeper
    [junit4] 2> 1015296 INFO (TEST-TestSolrConfigHandlerCloud.test-seed#[8BA9A25AF74EB84D]) [ ] o.a.s.c.c.SolrZkClient Using default ZkACLProvider
    [junit4] 2> 1015296 INFO (TEST-TestSolrConfigHandlerCloud.test-seed#[8BA9A25AF74EB84D]) [ ] o.a.s.c.c.SolrZkClient makePath: /collections/collection1
    [junit4] 2> 1015298 INFO (TEST-TestSolrConfigHandlerCloud.test-seed#[8BA9A25AF74EB84D]) [ ] o.a.s.c.c.SolrZkClient makePath: /collections/collection1/shards
    [junit4] 2> 1015301 INFO (TEST-TestSolrConfigHandlerCloud.test-seed#[8BA9A25AF74EB84D]) [ ] o.a.s.c.c.SolrZkClient makePath: /collections/control_collection
    [junit4] 2> 1015302 INFO (TEST-TestSolrConfigHandlerCloud.test-seed#[8BA9A25AF74EB84D]) [ ] o.a.s.c.c.SolrZkClient makePath: /collections/control_collection/shards
    [junit4] 2> 1015305 INFO (TEST-TestSolrConfigHandlerCloud.test-seed#[8BA9A25AF74EB84D]) [ ] o.a.s.c.AbstractZkTestCase put C:\Users\jenkins\workspace\Lucene-Solr-6.1-Windows\solr\core\src\test-files\solr\collection1\conf\solrconfig-tlog.xml to /configs/conf1/solrconfig.xml
    [junit4] 2> 1015305 INFO (TEST-TestSolrConfigHandlerCloud.test-seed#[8BA9A25AF74EB84D]) [ ] o.a.s.c.c.SolrZkClient makePath: /configs/conf1/solrconfig.xml
    [junit4] 2> 1015310 INFO (TEST-TestSolrConfigHandlerCloud.test-seed#[8BA9A25AF74EB84D]) [ ] o.a.s.c.AbstractZkTestCase put C:\Users\jenkins\workspace\Lucene-Solr-6.1-Windows\solr\core\src\test-files\solr\collection1\conf\schema.xml to /configs/conf1/schema.xml
    [junit4] 2> 1015310 INFO (TEST-TestSolrConfigHandlerCloud.test-seed#[8BA9A25AF74EB84D]) [ ] o.a.s.c.c.SolrZkClient makePath: /configs/conf1/schema.xml
    [junit4] 2> 1015313 INFO (TEST-TestSolrConfigHandlerCloud.test-seed#[8BA9A25AF74EB84D]) [ ] o.a.s.c.AbstractZkTestCase put C:\Users\jenkins\workspace\Lucene-Solr-6.1-Windows\solr\core\src\test-files\solr\collection1\conf\solrconfig.snippet.randomindexconfig.xml to /configs/conf1/solrconfig.snippet.randomindexconfig.xml
    [junit4] 2> 1015313 INFO (TEST-TestSolrConfigHandlerCloud.test-seed#[8BA9A25AF74EB84D]) [ ] o.a.s.c.c.SolrZkClient makePath: /configs/conf1/solrconfig.snippet.randomindexconfig.xml
    [junit4] 2> 1015314 INFO (TEST-TestSolrConfigHandlerCloud.test-seed#[8BA9A25AF74EB84D]) [ ] o.a.s.c.AbstractZkTestCase put C:\Users\jenkins\workspace\Lucene-Solr-6.1-Windows\solr\core\src\test-files\solr\collection1\conf\stopwords.txt to /configs/conf1/stopwords.txt
    [junit4] 2> 1015314 INFO (TEST-TestSolrConfigHandlerCloud.test-seed#[8BA9A25AF74EB84D]) [ ] o.a.s.c.c.SolrZkClient makePath: /configs/conf1/stopwords.txt
    [junit4] 2> 1015315 INFO (TEST-TestSolrConfigHandlerCloud.test-seed#[8BA9A25AF74EB84D]) [ ] o.a.s.c.AbstractZkTestCase put C:\Users\jenkins\workspace\Lucene-Solr-6.1-Windows\solr\core\src\test-files\solr\collection1\conf\protwords.txt to /configs/conf1/protwords.txt
    [junit4] 2> 1015316 INFO (TEST-TestSolrConfigHandlerCloud.test-seed#[8BA9A25AF74EB84D]) [ ] o.a.s.c.c.SolrZkClient makePath: /configs/conf1/protwords.txt
    [junit4] 2> 1015319 INFO (TEST-TestSolrConfigHandlerCloud.test-seed#[8BA9A25AF74EB84D]) [ ] o.a.s.c.AbstractZkTestCase put C:\Users\jenkins\workspace\Lucene-Solr-6.1-Windows\solr\core\src\test-files\solr\collection1\conf\currency.xml to /configs/conf1/currency.xml
    [junit4] 2> 1015319 INFO (TEST-TestSolrConfigHandlerCloud.test-seed#[8BA9A25AF74EB84D]) [ ] o.a.s.c.c.SolrZkClient makePath: /configs/conf1/currency.xml
    [junit4] 2> 1015321 INFO (TEST-TestSolrConfigHandlerCloud.test-seed#[8BA9A25AF74EB84D]) [ ] o.a.s.c.AbstractZkTestCase put C:\Users\jenkins\workspace\Lucene-Solr-6.1-Windows\solr\core\src\test-files\solr\collection1\conf\enumsConfig.xml to /configs/conf1/enumsConfig.xml
    [junit4] 2> 1015321 INFO (TEST-TestSolrConfigHandlerCloud.test-seed#[8BA9A25AF74EB84D]) [ ] o.a.s.c.c.SolrZkClient makePath: /configs/conf1/enumsConfig.xml
    [junit4] 2> 1015324 INFO (TEST-TestSolrConfigHandlerCloud.test-seed#[8BA9A25AF74EB84D]) [ ] o.a.s.c.AbstractZkTestCase put C:\Users\jenkins\workspace\Lucene-Solr-6.1-Windows\solr\core\src\test-files\solr\collection1\conf\open-exchange-rates.json to /configs/conf1/open-exchange-rates.json
    [junit4] 2> 1015324 INFO (TEST-TestSolrConfigHandlerCloud.test-seed#[8BA9A25AF74EB84D]) [ ] o.a.s.c.c.SolrZkClient makePath: /configs/conf1/open-exchange-rates.json
    [junit4] 2> 1015325 INFO (TEST-TestSolrConfigHandlerCloud.test-seed#[8BA9A25AF74EB84D]) [ ] o.a.s.c.AbstractZkTestCase put C:\Users\jenkins\workspace\Lucene-Solr-6.1-Windows\solr\core\src\test-files\solr\collection1\conf\mapping-ISOLatin1Accent.txt to /configs/conf1/mapping-ISOLatin1Accent.txt
    [junit4] 2> 1015325 INFO (TEST-TestSolrConfigHandlerCloud.test-seed#[8BA9A25AF74EB84D]) [ ] o.a.s.c.c.SolrZkClient makePath: /configs/conf1/mapping-ISOLatin1Accent.txt
    [junit4] 2> 1015328 INFO (TEST-TestSolrConfigHandlerCloud.test-seed#[8BA9A25AF74EB84D]) [ ] o.a.s.c.AbstractZkTestCase put C:\Users\jenkins\workspace\Lucene-Solr-6.1-Windows\solr\core\src\test-files\solr\collection1\conf\old_synonyms.txt to /configs/conf1/old_synonyms.txt
    [junit4] 2> 1015328 INFO (TEST-TestSolrConfigHandlerCloud.test-seed#[8BA9A25AF74EB84D]) [ ] o.a.s.c.c.SolrZkClient makePath: /configs/conf1/old_synonyms.txt
    [junit4] 2> 1015336 INFO (TEST-TestSolrConfigHandlerCloud.test-seed#[8BA9A25AF74EB84D]) [ ] o.a.s.c.AbstractZkTestCase put C:\Users\jenkins\workspace\Lucene-Solr-6.1-Windows\solr\core\src\test-files\solr\collection1\conf\synonyms.txt to /configs/conf1/synonyms.txt
    [junit4] 2> 1015336 INFO (TEST-TestSolrConfigHandlerCloud.test-seed#[8BA9A25AF74EB84D]) [ ] o.a.s.c.c.SolrZkClient makePath: /configs/conf1/synonyms.txt
    [junit4] 2> 1015338 WARN (NIOServerCxn.Factory:0.0.0.0/0.0.0.0:0) [ ] o.a.z.s.NIOServerCnxn caught end of stream exception
    [junit4] 2> EndOfStreamException: Unable to read additional data from client sessionid 0x15554955c0c0001, likely client has closed socket
    [junit4] 2> at org.apache.zookeeper.server.NIOServerCnxn.doIO(NIOServerCnxn.java:228)
    [junit4] 2> at org.apache.zookeeper.server.NIOServerCnxnFactory.run(NIOServerCnxnFactory.java:208)
    [junit4] 2> at java.lang.Thread.run(Thread.java:745)
    [junit4] 2> 1015795 INFO (TEST-TestSolrConfigHandlerCloud.test-seed#[8BA9A25AF74EB84D]) [ ] o.a.s.SolrTestCaseJ4 Writing core.properties file to C:\Users\jenkins\workspace\Lucene-Solr-6.1-Windows\solr\build\solr-core\test\J1\temp\solr.handler.TestSolrConfigHandlerCloud_8BA9A25AF74EB84D-001\control-001\cores\collection1
    [junit4] 2> 1015799 INFO (TEST-TestSolrConfigHandlerCloud.test-seed#[8BA9A25AF74EB84D]) [ ] o.e.j.s.Server jetty-9.3.8.v20160314
    [junit4] 2> 1015800 INFO (TEST-TestSolrConfigHandlerCloud.test-seed#[8BA9A25AF74EB84D]) [ ] o.e.j.s.h.ContextHandler Started o.e.j.s.ServletContextHandler@7a0929{/_/od,null,AVAILABLE}
    [junit4] 2> 1015801 INFO (TEST-TestSolrConfigHandlerCloud.test-seed#[8BA9A25AF74EB84D]) [ ] o.e.j.s.ServerConnector Started ServerConnector@684a60{HTTP/1.1,[http/1.1]}{127.0.0.1:57732}
    [junit4] 2> 1015801 INFO (TEST-TestSolrConfigHandlerCloud.test-seed#[8BA9A25AF74EB84D]) [ ] o.e.j.s.Server Started @1020498ms
    [junit4] 2> 1015801 INFO (TEST-TestSolrConfigHandlerCloud.test-seed#[8BA9A25AF74EB84D]) [ ] o.a.s.c.s.e.JettySolrRunner Jetty properties: {solr.data.dir=C:\Users\jenkins\workspace\Lucene-Solr-6.1-Windows\solr\build\solr-core\test\J1\temp\solr.handler.TestSolrConfigHandlerCloud_8BA9A25AF74EB84D-001\tempDir-001/control/data, hostContext=/_/od, hostPort=57732, coreRootDirectory=C:\Users\jenkins\workspace\Lucene-Solr-6.1-Windows\solr\build\solr-core\test\J1\temp\solr.handler.TestSolrConfigHandlerCloud_8BA9A25AF74EB84D-001\control-001\cores}
    [junit4] 2> 1015801 INFO (TEST-TestSolrConfigHandlerCloud.test-seed#[8BA9A25AF74EB84D]) [ ] o.a.s.s.SolrDispatchFilter SolrDispatchFilter.init(): sun.misc.Launcher$AppClassLoader@1d16e93
    [junit4] 2> 1015801 INFO (TEST-TestSolrConfigHandlerCloud.test-seed#[8BA9A25AF74EB84D]) [ ] o.a.s.c.SolrResourceLoader new SolrResourceLoader for directory: 'C:\Users\jenkins\workspace\Lucene-Solr-6.1-Windows\solr\build\solr-core\test\J1\temp\solr.handler.TestSolrConfigHandlerCloud_8BA9A25AF74EB84D-001\control-001'
    [junit4] 2> 1015801 INFO (TEST-TestSolrConfigHandlerCloud.test-seed#[8BA9A25AF74EB84D]) [ ] o.a.s.c.SolrResourceLoader JNDI not configured for solr (NoInitialContextEx)
    [junit4] 2> 1015801 INFO (TEST-TestSolrConfigHandlerCloud.test-seed#[8BA9A25AF74EB84D]) [ ] o.a.s.c.SolrResourceLoader solr home defaulted to 'solr/' (could not find system property or JNDI)
    [junit4] 2> 1015802 INFO (TEST-TestSolrConfigHandlerCloud.test-seed#[8BA9A25AF74EB84D]) [ ] o.a.s.c.c.SolrZkClient Using default ZkCredentialsProvider
    [junit4] 2> 1015803 INFO (TEST-TestSolrConfigHandlerCloud.test-seed#[8BA9A25AF74EB84D]) [ ] o.a.s.c.c.ConnectionManager Waiting for client to connect to ZooKeeper
    [junit4] 2> 1015806 INFO (zkCallback-1175-thread-1) [ ] o.a.s.c.c.ConnectionManager Watcher org.apache.solr.common.cloud.ConnectionManager@13d3ffd name:ZooKeeperConnection Watcher:127.0.0.1:57725/solr got event WatchedEvent state:SyncConnected type:None path:null path:null type:None
    [junit4] 2> 1015807 INFO (TEST-TestSolrConfigHandlerCloud.test-seed#[8BA9A25AF74EB84D]) [ ] o.a.s.c.c.ConnectionManager Client is connected to ZooKeeper
    [junit4] 2> 1015807 INFO (TEST-TestSolrConfigHandlerCloud.test-seed#[8BA9A25AF74EB84D]) [ ] o.a.s.c.c.SolrZkClient Using default ZkACLProvider
    [junit4] 2> 1015811 INFO (TEST-TestSolrConfigHandlerCloud.test-seed#[8BA9A25AF74EB84D]) [ ] o.a.s.s.SolrDispatchFilter Loading solr.xml from SolrHome (not found in ZooKeeper)
    [junit4] 2> 1015811 INFO (TEST-TestSolrConfigHandlerCloud.test-seed#[8BA9A25AF74EB84D]) [ ] o.a.s.c.SolrXmlConfig Loading container configuration from C:\Users\jenkins\workspace\Lucene-Solr-6.1-Windows\solr\build\solr-core\test\J1\temp\solr.handler.TestSolrConfigHandlerCloud_8BA9A25AF74EB84D-001\control-001\solr.xml
    [junit4] 2> 1015820 INFO (TEST-TestSolrConfigHandlerCloud.test-seed#[8BA9A25AF74EB84D]) [ ] o.a.s.c.CorePropertiesLocator Config-defined core root directory: C:\Users\jenkins\workspace\Lucene-Solr-6.1-Windows\solr\build\solr-core\test\J1\temp\solr.handler.TestSolrConfigHandlerCloud_8BA9A25AF74EB84D-001\control-001\cores
    [junit4] 2> 1015820 INFO (TEST-TestSolrConfigHandlerCloud.test-seed#[8BA9A25AF74EB84D]) [ ] o.a.s.c.CoreContainer New CoreContainer 1312404
    [junit4] 2> 1015820 INFO (TEST-TestSolrConfigHandlerCloud.test-seed#[8BA9A25AF74EB84D]) [ ] o.a.s.c.CoreContainer Loading cores into CoreContainer [instanceDir=C:\Users\jenkins\workspace\Lucene-Solr-6.1-Windows\solr\build\solr-core\test\J1\temp\solr.handler.TestSolrConfigHandlerCloud_8BA9A25AF74EB84D-001\control-001]
    [junit4] 2> 1015820 WARN (TEST-TestSolrConfigHandlerCloud.test-seed#[8BA9A25AF74EB84D]) [ ] o.a.s.c.CoreContainer Couldn't add files from C:\Users\jenkins\workspace\Lucene-Solr-6.1-Windows\solr\build\solr-core\test\J1\temp\solr.handler.TestSolrConfigHandlerCloud_8BA9A25AF74EB84D-001\control-001\lib to classpath: C:\Users\jenkins\workspace\Lucene-Solr-6.1-Windows\solr\build\solr-core\test\J1\temp\solr.handler.TestSolrConfigHandlerCloud_8BA9A25AF74EB84D-001\control-001\lib
    [junit4] 2> 1015820 INFO (TEST-TestSolrConfigHandlerCloud.test-seed#[8BA9A25AF74EB84D]) [ ] o.a.s.h.c.HttpShardHandlerFactory created with socketTimeout : 90000,urlScheme : ,connTimeout : 15000,maxConnectionsPerHost : 20,maxConnections : 10000,corePoolSize : 0,maximumPoolSize : 2147483647,maxThreadIdleTime : 5,sizeOfQueue : -1,fairnessPolicy : false,useRetries : false,
    [junit4] 2> 1015824 INFO (TEST-TestSolrConfigHandlerCloud.test-seed#[8BA9A25AF74EB84D]) [ ] o.a.s.u.UpdateShardHandler Creating UpdateShardHandler HTTP client with params: socketTimeout=340000&connTimeout=45000&retry=true
    [junit4] 2> 1015824 INFO (TEST-TestSolrConfigHandlerCloud.test-seed#[8BA9A25AF74EB84D]) [ ] o.a.s.l.LogWatcher SLF4J impl is org.slf4j.impl.Log4jLoggerFactory
    [junit4] 2> 1015824 INFO (TEST-TestSolrConfigHandlerCloud.test-seed#[8BA9A25AF74EB84D]) [ ] o.a.s.l.LogWatcher Registering Log Listener [Log4j (org.slf4j.impl.Log4jLoggerFactory)]
    [junit4] 2> 1015824 INFO (TEST-TestSolrConfigHandlerCloud.test-seed#[8BA9A25AF74EB84D]) [ ] o.a.s.c.ZkContainer Zookeeper client=127.0.0.1:57725/solr
    [junit4] 2> 1015824 INFO (TEST-TestSolrConfigHandlerCloud.test-seed#[8BA9A25AF74EB84D]) [ ] o.a.s.c.ZkController zkHost includes chroot
    [junit4] 2> 1015824 INFO (TEST-TestSolrConfigHandlerCloud.test-seed#[8BA9A25AF74EB84D]) [ ] o.a.s.c.c.SolrZkClient Using default ZkCredentialsProvider
    [junit4] 2> 1015825 INFO (TEST-TestSolrConfigHandlerCloud.test-seed#[8BA9A25AF74EB84D]) [ ] o.a.s.c.c.ConnectionManager Waiting for client to connect to ZooKeeper
    [junit4] 2> 1015832 INFO (zkCallback-1178-thread-1) [ ] o.a.s.c.c.ConnectionManager Watcher org.apache.solr.common.cloud.ConnectionManager@14e94c8 name:ZooKeeperConnection Watcher:127.0.0.1:57725 got event WatchedEvent state:SyncConnected type:None path:null path:null type:None
    [junit4] 2> 1015833 INFO (TEST-TestSolrConfigHandlerCloud.test-seed#[8BA9A25AF74EB84D]) [ ] o.a.s.c.c.ConnectionManager Client is connected to ZooKeeper
    [junit4] 2> 1015833 INFO (TEST-TestSolrConfigHandlerCloud.test-seed#[8BA9A25AF74EB84D]) [ ] o.a.s.c.c.SolrZkClient Using default ZkACLProvider
    [junit4] 2> 1015838 INFO (TEST-TestSolrConfigHandlerCloud.test-seed#[8BA9A25AF74EB84D]) [n:127.0.0.1:57732__%2Fod ] o.a.s.c.ZkController Added new OnReconnect listener org.apache.solr.cloud.ZkController$$Lambda$52/21291569@1412d55
    [junit4] 2> 1015840 INFO (TEST-TestSolrConfigHandlerCloud.test-seed#[8BA9A25AF74EB84D]) [n:127.0.0.1:57732__%2Fod ] o.a.s.c.c.ConnectionManager Waiting for client to connect to ZooKeeper
    [junit4] 2> 1015842 INFO (zkCallback-1179-thread-1-processing-n:127.0.0.1:57732__%2Fod) [n:127.0.0.1:57732__%2Fod ] o.a.s.c.c.ConnectionManager Watcher org.apache.solr.common.cloud.ConnectionManager@c958f5 name:ZooKeeperConnection Watcher:127.0.0.1:57725/solr got event WatchedEvent state:SyncConnected type:None path:null path:null type:None
    [junit4] 2> 1015842 INFO (TEST-TestSolrConfigHandlerCloud.test-seed#[8BA9A25AF74EB84D]) [n:127.0.0.1:57732__%2Fod ] o.a.s.c.c.ConnectionManager Client is connected to ZooKeeper
    [junit4] 2> 1015844 INFO (TEST-TestSolrConfigHandlerCloud.test-seed#[8BA9A25AF74EB84D]) [n:127.0.0.1:57732__%2Fod ] o.a.s.c.c.SolrZkClient makePath: /overseer/queue
    [junit4] 2> 1015846 INFO (TEST-TestSolrConfigHandlerCloud.test-seed#[8BA9A25AF74EB84D]) [n:127.0.0.1:57732__%2Fod ] o.a.s.c.c.SolrZkClient makePath: /overseer/collection-queue-work
    [junit4] 2> 1015848 INFO (TEST-TestSolrConfigHandlerCloud.test-seed#[8BA9A25AF74EB84D]) [n:127.0.0.1:57732__%2Fod ] o.a.s.c.c.SolrZkClient makePath: /overseer/collection-map-running
    [junit4] 2> 1015849 INFO (TEST-TestSolrConfigHandlerCloud.test-seed#[8BA9A25AF74EB84D]) [n:127.0.0.1:57732__%2Fod ] o.a.s.c.c.SolrZkClient makePath: /overseer/collection-map-completed
    [junit4] 2> 1015852 INFO (TEST-TestSolrConfigHandlerCloud.test-seed#[8BA9A25AF74EB84D]) [n:127.0.0.1:57732__%2Fod ] o.a.s.c.c.SolrZkClient makePath: /overseer/collection-map-failure
    [junit4] 2> 1015854 INFO (TEST-TestSolrConfigHandlerCloud.test-seed#[8BA9A25AF74EB84D]) [n:127.0.0.1:57732__%2Fod ] o.a.s.c.c.SolrZkClient makePath: /live_nodes
    [junit4] 2> 1015856 INFO (TEST-TestSolrConfigHandlerCloud.test-seed#[8BA9A25AF74EB84D]) [n:127.0.0.1:57732__%2Fod ] o.a.s.c.c.SolrZkClient makePath: /aliases.json
    [junit4] 2> 1015857 INFO (TEST-TestSolrConfigHandlerCloud.test-seed#[8BA9A25AF74EB84D]) [n:127.0.0.1:57732__%2Fod ] o.a.s.c.c.SolrZkClient makePath: /clusterstate.json
    [junit4] 2> 1015859 INFO (TEST-TestSolrConfigHandlerCloud.test-seed#[8BA9A25AF74EB84D]) [n:127.0.0.1:57732__%2Fod ] o.a.s.c.c.SolrZkClient makePath: /security.json
    [junit4] 2> 1015859 INFO (TEST-TestSolrConfigHandlerCloud.test-seed#[8BA9A25AF74EB84D]) [n:127.0.0.1:57732__%2Fod ] o.a.s.c.c.ZkStateReader Updating cluster state from ZooKeeper...
    [junit4] 2> 1015860 INFO (TEST-TestSolrConfigHandlerCloud.test-seed#[8BA9A25AF74EB84D]) [n:127.0.0.1:57732__%2Fod ] o.a.s.c.c.ZkStateReader Loaded empty cluster properties
    [junit4] 2> 1015860 INFO (TEST-TestSolrConfigHandlerCloud.test-seed#[8BA9A25AF74EB84D]) [n:127.0.0.1:57732__%2Fod ] o.a.s.c.c.ZkStateReader Updated live nodes from ZooKeeper... (0) -> (0)
    [junit4] 2> 1015863 INFO (TEST-TestSolrConfigHandlerCloud.test-seed#[8BA9A25AF74EB84D]) [n:127.0.0.1:57732__%2Fod ] o.a.s.c.c.SolrZkClient makePath: /overseer_elect
    [junit4] 2> 1015865 INFO (TEST-TestSolrConfigHandlerCloud.test-seed#[8BA9A25AF74EB84D]) [n:127.0.0.1:57732__%2Fod ] o.a.s.c.c.SolrZkClient makePath: /overseer_elect/election
    [junit4] 2> 1015866 INFO (TEST-TestSolrConfigHandlerCloud.test-seed#[8BA9A25AF74EB84D]) [n:127.0.0.1:57732__%2Fod ] o.a.s.c.Overseer Overseer (id=null) closing
    [junit4] 2> 1015867 INFO (TEST-TestSolrConfigHandlerCloud.test-seed#[8BA9A25AF74EB84D]) [n:127.0.0.1:57732__%2Fod ] o.a.s.c.LeaderElector Joined leadership election with path: /overseer_elect/election/96075967529484292-127.0.0.1:57732__%2Fod-n_0000000000
    [junit4] 2> 1015867 INFO (TEST-TestSolrConfigHandlerCloud.test-seed#[8BA9A25AF74EB84D]) [n:127.0.0.1:57732__%2Fod ] o.a.s.c.OverseerElectionContext I am going to be the leader 127.0.0.1:57732__%2Fod
    [junit4] 2> 1015867 INFO (TEST-TestSolrConfigHandlerCloud.test-seed#[8BA9A25AF74EB84D]) [n:127.0.0.1:57732__%2Fod ] o.a.s.c.c.SolrZkClient makePath: /overseer_elect/leader
    [junit4] 2> 1015868 INFO (TEST-TestSolrConfigHandlerCloud.test-seed#[8BA9A25AF74EB84D]) [n:127.0.0.1:57732__%2Fod ] o.a.s.c.Overseer Overseer (id=96075967529484292-127.0.0.1:57732__%2Fod-n_0000000000) starting
    [junit4] 2> 1015871 INFO (TEST-TestSolrConfigHandlerCloud.test-seed#[8BA9A25AF74EB84D]) [n:127.0.0.1:57732__%2Fod ] o.a.s.c.c.SolrZkClient makePath: /overseer/queue-work
    [junit4] 2> 1015878 INFO (TEST-TestSolrConfigHandlerCloud.test-seed#[8BA9A25AF74EB84D]) [n:127.0.0.1:57732__%2Fod ] o.a.s.c.OverseerAutoReplicaFailoverThread Starting OverseerAutoReplicaFailoverThread autoReplicaFailoverWorkLoopDelay=10000 autoReplicaFailoverWaitAfterExpiration=30000 autoReplicaFailoverBadNodeExpiration=60000
    [junit4] 2> 1015879 INFO (OverseerCollectionConfigSetProcessor-96075967529484292-127.0.0.1:57732__%2Fod-n_0000000000) [n:127.0.0.1:57732__%2Fod ] o.a.s.c.OverseerTaskProcessor Process current queue of overseer operations
    [junit4] 2> 1015879 INFO (TEST-TestSolrConfigHandlerCloud.test-seed#[8BA9A25AF74EB84D]) [n:127.0.0.1:57732__%2Fod ] o.a.s.c.ZkController Register node as live in ZooKeeper:/live_nodes/127.0.0.1:57732__%2Fod
    [junit4] 2> 1015879 INFO (OverseerStateUpdate-96075967529484292-127.0.0.1:57732__%2Fod-n_0000000000) [n:127.0.0.1:57732__%2Fod ] o.a.s.c.Overseer Starting to work on the main queue
    [junit4] 2> 1015879 INFO (TEST-TestSolrConfigHandlerCloud.test-seed#[8BA9A25AF74EB84D]) [n:127.0.0.1:57732__%2Fod ] o.a.s.c.c.SolrZkClient makePath: /live_nodes/127.0.0.1:57732__%2Fod
    [junit4] 2> 1015881 INFO (zkCallback-1179-thread-1-processing-n:127.0.0.1:57732__%2Fod) [n:127.0.0.1:57732__%2Fod ] o.a.s.c.c.ZkStateReader A live node change: [WatchedEvent state:SyncConnected type:NodeChildrenChanged path:/live_nodes], has occurred - updating... (live nodes size: [0])
    [junit4] 2> 1015881 INFO (OverseerStateUpdate-96075967529484292-127.0.0.1:57732__%2Fod-n_0000000000) [n:127.0.0.1:57732__%2Fod ] o.a.s.c.c.ZkStateReader Updated live nodes from ZooKeeper... (0) -> (1)
    [junit4] 2> 1015881 INFO (zkCallback-1179-thread-1-processing-n:127.0.0.1:57732__%2Fod) [n:127.0.0.1:57732__%2Fod ] o.a.s.c.c.ZkStateReader Updated live nodes from ZooKeeper... (1) -> (1)
    [junit4] 2> 1015892 INFO (TEST-TestSolrConfigHandlerCloud.test-seed#[8BA9A25AF74EB84D]) [n:127.0.0.1:57732__%2Fod ] o.a.s.c.CoreContainer Security conf doesn't exist. Skipping setup for authorization module.
    [junit4] 2> 1015892 INFO (TEST-TestSolrConfigHandlerCloud.test-seed#[8BA9A25AF74EB84D]) [n:127.0.0.1:57732__%2Fod ] o.a.s.c.CoreContainer No authentication plugin used.
    [junit4] 2> 1015893 INFO (TEST-TestSolrConfigHandlerCloud.test-seed#[8BA9A25AF74EB84D]) [n:127.0.0.1:57732__%2Fod ] o.a.s.c.CorePropertiesLocator Looking for core definitions underneath C:\Users\jenkins\workspace\Lucene-Solr-6.1-Windows\solr\build\solr-core\test\J1\temp\solr.handler.TestSolrConfigHandlerCloud_8BA9A25AF74EB84D-001\control-001\cores
    [junit4] 2> 1015895 INFO (TEST-TestSolrConfigHandlerCloud.test-seed#[8BA9A25AF74EB84D]) [n:127.0.0.1:57732__%2Fod ] o.a.s.c.CoreDescriptor Created CoreDescriptor: {name=collection1, config=solrconfig.xml, transient=false, schema=schema.xml, loadOnStartup=true, configSetProperties=configsetprops.json, collection=control_collection, coreNodeName=, dataDir=data\, shard=}
    [junit4] 2> 1015895 INFO (TEST-TestSolrConfigHandlerCloud.test-seed#[8BA9A25AF74EB84D]) [n:127.0.0.1:57732__%2Fod ] o.a.s.c.CorePropertiesLocator Found core collection1 in C:\Users\jenkins\workspace\Lucene-Solr-6.1-Windows\solr\build\solr-core\test\J1\temp\solr.handler.TestSolrConfigHandlerCloud_8BA9A25AF74EB84D-001\control-001\cores\collection1
    [junit4] 2> 1015895 INFO (TEST-TestSolrConfigHandlerCloud.test-seed#[8BA9A25AF74EB84D]) [n:127.0.0.1:57732__%2Fod ] o.a.s.c.CorePropertiesLocator Found 1 core definitions
    [junit4] 2> 1015895 INFO (TEST-TestSolrConfigHandlerCloud.test-seed#[8BA9A25AF74EB84D]) [n:127.0.0.1:57732__%2Fod ] o.a.s.s.SolrDispatchFilter user.dir=C:\Users\jenkins\workspace\Lucene-Solr-6.1-Windows\solr\build\solr-core\test\J1
    [junit4] 2> 1015895 INFO (TEST-TestSolrConfigHandlerCloud.test-seed#[8BA9A25AF74EB84D]) [n:127.0.0.1:57732__%2Fod ] o.a.s.s.SolrDispatchFilter SolrDispatchFilter.init() done
    [junit4] 2> 1015896 INFO (coreLoadExecutor-3866-thread-1-processing-n:127.0.0.1:57732__%2Fod) [n:127.0.0.1:57732__%2Fod c:control_collection x:collection1] o.a.s.c.ZkController publishing state=down
    [junit4] 2> 1015896 INFO (coreLoadExecutor-3866-thread-1-processing-n:127.0.0.1:57732__%2Fod) [n:127.0.0.1:57732__%2Fod c:control_collection x:collection1] o.a.s.c.ZkController numShards not found on descriptor - reading it from system property
    [junit4] 2> 1015898 INFO (coreLoadExecutor-3866-thread-1-processing-n:127.0.0.1:57732__%2Fod) [n:127.0.0.1:57732__%2Fod c:control_collection x:collection1] o.a.s.c.ZkController Collection control_collection not visible yet, but flagging it so a watch is registered when it becomes visible
    [junit4] 2> 1015898 INFO (OverseerStateUpdate-96075967529484292-127.0.0.1:57732__%2Fod-n_0000000000) [n:127.0.0.1:57732__%2Fod ] o.a.s.c.Overseer processMessage: queueSize: 1, message = {
    [junit4] 2> "core":"collection1",
    [junit4] 2> "roles":null,
    [junit4] 2> "base_url":"http://127.0.0.1:57732/_/od",
    [junit4] 2> "node_name":"127.0.0.1:57732__%2Fod",
    [junit4] 2> "numShards":"1",
    [junit4] 2> "state":"down",
    [junit4] 2> "shard":null,
    [junit4] 2> "collection":"control_collection",
    [junit4] 2> "operation":"state"} current state version: 0
    [junit4] 2> 1015898 INFO (OverseerStateUpdate-96075967529484292-127.0.0.1:57732__%2Fod-n_0000000000) [n:127.0.0.1:57732__%2Fod ] o.a.s.c.o.ReplicaMutator Update state numShards=1 message={
    [junit4] 2> "core":"collection1",
    [junit4] 2> "roles":null,
    [junit4] 2> "base_url":"http://127.0.0.1:57732/_/od",
    [junit4] 2> "node_name":"127.0.0.1:57732__%2Fod",
    [junit4] 2> "numShards":"1",
    [junit4] 2> "state":"down",
    [junit4] 2> "shard":null,
    [junit4] 2> "collection":"control_collection",
    [junit4] 2> "operation":"state"}
    [junit4] 2> 1015899 INFO (coreLoadExecutor-3866-thread-1-processing-n:127.0.0.1:57732__%2Fod) [n:127.0.0.1:57732__%2Fod c:control_collection x:collection1] o.a.s.c.c.ZkStateReader Deleting data for [control_collection]
    [junit4] 2> 1015899 INFO (OverseerStateUpdate-96075967529484292-127.0.0.1:57732__%2Fod-n_0000000000) [n:127.0.0.1:57732__%2Fod ] o.a.s.c.o.ClusterStateMutator building a new cName: control_collection
    [junit4] 2> 1015899 INFO (OverseerStateUpdate-96075967529484292-127.0.0.1:57732__%2Fod-n_0000000000) [n:127.0.0.1:57732__%2Fod ] o.a.s.c.o.ReplicaMutator Assigning new node to shard shard=shard1
    [junit4] 2> 1015900 INFO (coreLoadExecutor-3866-thread-1-processing-n:127.0.0.1:57732__%2Fod) [n:127.0.0.1:57732__%2Fod c:control_collection x:collection1] o.a.s.c.ZkController look for our core node name
    [junit4] 2> 1015901 INFO (zkCallback-1179-thread-1-processing-n:127.0.0.1:57732__%2Fod) [n:127.0.0.1:57732__%2Fod ] o.a.s.c.c.ZkStateReader A cluster state change: [WatchedEvent state:SyncConnected type:NodeDataChanged path:/clusterstate.json], has occurred - updating... (live nodes size: [1])
    [junit4] 2> 1016902 INFO (coreLoadExecutor-3866-thread-1-processing-n:127.0.0.1:57732__%2Fod) [n:127.0.0.1:57732__%2Fod c:control_collection x:collection1] o.a.s.c.ZkController waiting to find shard id in clusterstate for collection1
    [junit4] 2> 1016902 INFO (coreLoadExecutor-3866-thread-1-processing-n:127.0.0.1:57732__%2Fod) [n:127.0.0.1:57732__%2Fod c:control_collection x:collection1] o.a.s.c.ZkController Check for collection zkNode:control_collection
    [junit4] 2> 1016903 INFO (coreLoadExecutor-3866-thread-1-processing-n:127.0.0.1:57732__%2Fod) [n:127.0.0.1:57732__%2Fod c:control_collection x:collection1] o.a.s.c.ZkController Collection zkNode exists
    [junit4] 2> 1016903 INFO (coreLoadExecutor-3866-thread-1-processing-n:127.0.0.1:57732__%2Fod) [n:127.0.0.1:57732__%2Fod c:control_collection x:collection1] o.a.s.c.c.ZkStateReader Load collection config from: [/collections/control_collection]
    [junit4] 2> 1016905 INFO (coreLoadExecutor-3866-thread-1-processing-n:127.0.0.1:57732__%2Fod) [n:127.0.0.1:57732__%2Fod c:control_collection x:collection1] o.a.s.c.c.ZkStateReader path=[/collections/control_collection] [configName]=[conf1] specified config exists in ZooKeeper
    [junit4] 2> 1016905 INFO (coreLoadExecutor-3866-thread-1-processing-n:127.0.0.1:57732__%2Fod) [n:127.0.0.1:57732__%2Fod c:control_collection x:collection1] o.a.s.c.SolrResourceLoader new SolrResourceLoader for directory: 'C:\Users\jenkins\workspace\Lucene-Solr-6.1-Windows\solr\build\solr-core\test\J1\temp\solr.handler.TestSolrConfigHandlerCloud_8BA9A25AF74EB84D-001\control-001\cores\collection1'
    [junit4] 2> 1016905 INFO (coreLoadExecutor-3866-thread-1-processing-n:127.0.0.1:57732__%2Fod) [n:127.0.0.1:57732__%2Fod c:control_collection x:collection1] o.a.s.c.SolrResourceLoader JNDI not configured for solr (NoInitialContextEx)
    [junit4] 2> 1016905 INFO (coreLoadExecutor-3866-thread-1-processing-n:127.0.0.1:57732__%2Fod) [n:127.0.0.1:57732__%2Fod c:control_collection x:collection1] o.a.s.c.SolrResourceLoader solr home defaulted to 'solr/' (could not find system property or JNDI)
    [junit4] 2> 1016909 INFO (coreLoadExecutor-3866-thread-1-processing-n:127.0.0.1:57732__%2Fod) [n:127.0.0.1:57732__%2Fod c:control_collection x:collection1] o.a.s.c.Config loaded config solrconfig.xml with version 0
    [junit4] 2> 1016919 INFO (coreLoadExecutor-3866-thread-1-processing-n:127.0.0.1:57732__%2Fod) [n:127.0.0.1:57732__%2Fod c:control_collection x:collection1] o.a.s.c.SolrConfig current version of requestparams : -1
    [junit4] 2> 1016922 WARN (coreLoadExecutor-3866-thread-1-processing-n:127.0.0.1:57732__%2Fod) [n:127.0.0.1:57732__%2Fod c:control_collection x:collection1] o.a.s.c.Config Beginning with Solr 5.5, <mergePolicy> is deprecated, use <mergePolicyFactory> instead.
    [junit4] 2> 1016922 INFO (coreLoadExecutor-3866-thread-1-processing-n:127.0.0.1:57732__%2Fod) [n:127.0.0.1:57732__%2Fod c:control_collection x:collection1] o.a.s.c.SolrConfig Using Lucene MatchVersion: 6.1.0
    [junit4] 2> 1016934 INFO (coreLoadExecutor-3866-thread-1-processing-n:127.0.0.1:57732__%2Fod) [n:127.0.0.1:57732__%2Fod c:control_collection x:collection1] o.a.s.c.SolrConfig Loaded SolrConfig: solrconfig.xml
    [junit4] 2> 1016942 INFO (coreLoadExecutor-3866-thread-1-processing-n:127.0.0.1:57732__%2Fod) [n:127.0.0.1:57732__%2Fod c:control_collection x:collection1] o.a.s.s.IndexSchema [collection1] Schema name=test
    [junit4] 2> 1017027 INFO (coreLoadExecutor-3866-thread-1-processing-n:127.0.0.1:57732__%2Fod) [n:127.0.0.1:57732__%2Fod c:control_collection x:collection1] o.a.s.s.OpenExchangeRatesOrgProvider Initialized with rates=open-exchange-rates.json, refreshInterval=1440.
    [junit4] 2> 1017035 INFO (coreLoadExecutor-3866-thread-1-processing-n:127.0.0.1:57732__%2Fod) [n:127.0.0.1:57732__%2Fod c:control_collection x:collection1] o.a.s.s.IndexSchema default search field in schema is text
    [junit4] 2> 1017036 INFO (coreLoadExecutor-3866-thread-1-processing-n:127.0.0.1:57732__%2Fod) [n:127.0.0.1:57732__%2Fod c:control_collection x:collection1] o.a.s.s.IndexSchema unique key field: id
    [junit4] 2> 1017045 INFO (coreLoadExecutor-3866-thread-1-processing-n:127.0.0.1:57732__%2Fod) [n:127.0.0.1:57732__%2Fod c:control_collection x:collection1] o.a.s.s.FileExchangeRateProvider Reloading exchange rates from file currency.xml
    [junit4] 2> 1017048 INFO (coreLoadExecutor-3866-thread-1-processing-n:127.0.0.1:57732__%2Fod) [n:127.0.0.1:57732__%2Fod c:control_collection x:collection1] o.a.s.s.FileExchangeRateProvider Reloading exchange rates from file currency.xml
    [junit4] 2> 1017051 INFO (coreLoadExecutor-3866-thread-1-processing-n:127.0.0.1:57732__%2Fod) [n:127.0.0.1:57732__%2Fod c:control_collection x:collection1] o.a.s.s.OpenExchangeRatesOrgProvider Reloading exchange rates from open-exchange-rates.json
    [junit4] 2> 1017052 INFO (coreLoadExecutor-3866-thread-1-processing-n:127.0.0.1:57732__%2Fod) [n:127.0.0.1:57732__%2Fod c:control_collection x:collection1] o.a.s.s.OpenExchangeRatesOrgProvider Reloading exchange rates from open-exchange-rates.json
    [junit4] 2> 1017063 INFO (coreLoadExecutor-3866-thread-1-processing-n:127.0.0.1:57732__%2Fod) [n:127.0.0.1:57732__%2Fod c:control_collection x:collection1] o.a.s.c.ConfigSetProperties Did not find ConfigSet properties, assuming default properties: Can't find resource 'configsetprops.json' in classpath or '/configs/conf1', cwd=C:\Users\jenkins\workspace\Lucene-Solr-6.1-Windows\solr\build\solr-core\test\J1
    [junit4] 2> 1017063 INFO (coreLoadExecutor-3866-thread-1-processing-n:127.0.0.1:57732__%2Fod) [n:127.0.0.1:57732__%2Fod c:control_collection x:collection1] o.a.s.c.CoreContainer Creating SolrCore 'collection1' using configuration from collection control_collection
    [junit4] 2> 1017063 INFO (coreLoadExecutor-3866-thread-1-processing-n:127.0.0.1:57732__%2Fod) [n:127.0.0.1:57732__%2Fod c:control_collection s:shard1 r:core_node1 x:collection1] o.a.s.c.SolrCore org.apache.solr.core.MockDirectoryFactory
    [junit4] 2> 1017063 INFO (coreLoadExecutor-3866-thread-1-processing-n:127.0.0.1:57732__%2Fod) [n:127.0.0.1:57732__%2Fod c:control_collection s:shard1 r:core_node1 x:collection1] o.a.s.c.SolrCore [[collection1] ] Opening new SolrCore at [C:\Users\jenkins\workspace\Lucene-Solr-6.1-Windows\solr\build\solr-core\test\J1\temp\solr.handler.TestSolrConfigHandlerCloud_8BA9A25AF74EB84D-001\control-001\cores\collection1], dataDir=[C:\Users\jenkins\workspace\Lucene-Solr-6.1-Windows\solr\build\solr-core\test\J1\temp\solr.handler.TestSolrConfigHandlerCloud_8BA9A25AF74EB84D-001\control-001\cores\collection1\data\]
    [junit4] 2> 1017063 INFO (coreLoadExecutor-3866-thread-1-processing-n:127.0.0.1:57732__%2Fod) [n:127.0.0.1:57732__%2Fod c:control_collection s:shard1 r:core_node1 x:collection1] o.a.s.c.JmxMonitoredMap JMX monitoring is enabled. Adding Solr mbeans to JMX Server: com.sun.jmx.mbeanserver.JmxMBeanServer@12afa6b
    [junit4] 2> 1017064 INFO (coreLoadExecutor-3866-thread-1-processing-n:127.0.0.1:57732__%2Fod) [n:127.0.0.1:57732__%2Fod c:control_collection s:shard1 r:core_node1 x:collection1] o.a.s.c.CachingDirectoryFactory return new directory for C:\Users\jenkins\workspace\Lucene-Solr-6.1-Windows\solr\build\solr-core\test\J1\temp\solr.handler.TestSolrConfigHandlerCloud_8BA9A25AF74EB84D-001\control-001\cores\collection1\data\
    [junit4] 2> 1017064 INFO (coreLoadExecutor-3866-thread-1-processing-n:127.0.0.1:57732__%2Fod) [n:127.0.0.1:57732__%2Fod c:control_collection s:shard1 r:core_node1 x:collection1] o.a.s.c.SolrCore New index directory detected: old=null new=C:\Users\jenkins\workspace\Lucene-Solr-6.1-Windows\solr\build\solr-core\test\J1\temp\solr.handler.TestSolrConfigHandlerCloud_8BA9A25AF74EB84D-001\control-001\cores\collection1\data\index/
    [junit4] 2> 1017064 WARN (coreLoadExecutor-3866-thread-1-processing-n:127.0.0.1:57732__%2Fod) [n:127.0.0.1:57732__%2Fod c:control_collection s:shard1 r:core_node1 x:collection1] o.a.s.c.SolrCore [collection1] Solr index directory 'C:\Users\jenkins\workspace\Lucene-Solr-6.1-Windows\solr\build\solr-core\test\J1\temp\solr.handler.TestSolrConfigHandlerCloud_8BA9A25AF74EB84D-001\control-001\cores\collection1\data\index' doesn't exist. Creating new index...
    [junit4] 2> 1017064 INFO (coreLoadExecutor-3866-thread-1-processing-n:127.0.0.1:57732__%2Fod) [n:127.0.0.1:57732__%2Fod c:control_collection s:shard1 r:core_node1 x:collection1] o.a.s.c.CachingDirectoryFactory return new directory for C:\Users\jenkins\workspace\Lucene-Solr-6.1-Windows\solr\build\solr-core\test\J1\temp\solr.handler.TestSolrConfigHandlerCloud_8BA9A25AF74EB84D-001\control-001\cores\collection1\data\index
    [junit4] 2> 1017064 INFO (coreLoadExecutor-3866-thread-1-processing-n:127.0.0.1:57732__%2Fod) [n:127.0.0.1:57732__%2Fod c:control_collection s:shard1 r:core_node1 x:collection1] o.a.s.u.RandomMergePolicy RandomMergePolicy wrapping class org.apache.lucene.index.TieredMergePolicy: [TieredMergePolicy: maxMergeAtOnce=45, maxMergeAtOnceExplicit=39, maxMergedSegmentMB=66.3662109375, floorSegmentMB=1.2958984375, forceMergeDeletesPctAllowed=11.09178478977163, segmentsPerTier=41.0, maxCFSSegmentSizeMB=8.796093022207999E12, noCFSRatio=1.0
    [junit4] 2> 1017065 INFO (coreLoadExecutor-3866-thread-1-processing-n:127.0.0.1:57732__%2Fod) [n:127.0.0.1:57732__%2Fod c:control_collection s:shard1 r:core_node1 x:collection1] o.a.s.c.SolrDeletionPolicy SolrDeletionPolicy.onCommit: commits: num=1
    [junit4] 2> commit{dir=MockDirectoryWrapper(RAMDirectory@1576643 lockFactory=org.apache.lucene.store.SingleInstanceLockFactory@1860b67),segFN=segments_1,generation=1}
    [junit4] 2> 1017065 INFO (coreLoadExecutor-3866-thread-1-processing-n:127.0.0.1:57732__%2Fod) [n:127.0.0.1:57732__%2Fod c:control_collection s:shard1 r:core_node1 x:collection1] o.a.s.c.SolrDeletionPolicy newest commit generation = 1
    [junit4] 2> 1017067 INFO (coreLoadExecutor-3866-thread-1-processing-n:127.0.0.1:57732__%2Fod) [n:127.0.0.1:57732__%2Fod c:control_collection s:shard1 r:core_node1 x:collection1] o.a.s.u.p.UpdateRequestProcessorChain creating updateRequestProcessorChain "nodistrib"
    [junit4] 2> 1017067 INFO (coreLoadExecutor-3866-thread-1-processing-n:127.0.0.1:57732__%2Fod) [n:127.0.0.1:57732__%2Fod c:control_collection s:shard1 r:core_node1 x:collection1] o.a.s.u.p.UpdateRequestProcessorChain creating updateRequestProcessorChain "dedupe"
    [junit4] 2> 1017067 INFO (coreLoadExecutor-3866-thread-1-processing-n:127.0.0.1:57732__%2Fod) [n:127.0.0.1:57732__%2Fod c:control_collection s:shard1 r:core_node1 x:collection1] o.a.s.u.p.UpdateRequestProcessorChain inserting DistributedUpdateProcessorFactory into updateRequestProcessorChain "dedupe"
    [junit4] 2> 1017067 INFO (coreLoadExecutor-3866-thread-1-processing-n:127.0.0.1:57732__%2Fod) [n:127.0.0.1:57732__%2Fod c:control_collection s:shard1 r:core_node1 x:collection1] o.a.s.u.p.UpdateRequestProcessorChain creating updateRequestProcessorChain "stored_sig"
    [junit4] 2> 1017067 INFO (coreLoadExecutor-3866-thread-1-processing-n:127.0.0.1:57732__%2Fod) [n:127.0.0.1:57732__%2Fod c:control_collection s:shard1 r:core_node1 x:collection1] o.a.s.u.p.UpdateRequestProcessorChain inserting DistributedUpdateProcessorFactory into updateRequestProcessorChain "stored_sig"
    [junit4] 2> 1017067 INFO (coreLoadExecutor-3866-thread-1-processing-n:127.0.0.1:57732__%2Fod) [n:127.0.0.1:57732__%2Fod c:control_collection s:shard1 r:core_node1 x:collection1] o.a.s.u.p.UpdateRequestProcessorChain creating updateRequestProcessorChain "distrib-dup-test-chain-explicit"
    [junit4] 2> 1017068 INFO (coreLoadExecutor-3866-thread-1-processing-n:127.0.0.1:57732__%2Fod) [n:127.0.0.1:57732__%2Fod c:control_collection s:shard1 r:core_node1 x:collection1] o.a.s.u.p.UpdateRequestProcessorChain creating updateRequestProcessorChain "distrib-dup-test-chain-implicit"
    [junit4] 2> 1017068 INFO (coreLoadExecutor-3866-thread-1-processing-n:127.0.0.1:57732__%2Fod) [n:127.0.0.1:57732__%2Fod c:control_collection s:shard1 r:core_node1 x:collection1] o.a.s.u.p.UpdateRequestProcessorChain inserting DistributedUpdateProcessorFactory into updateRequestProcessorChain "distrib-dup-test-chain-implicit"
    [junit4] 2> 1017068 INFO (coreLoadExecutor-3866-thread-1-processing-n:127.0.0.1:57732__%2Fod) [n:127.0.0.1:57732__%2Fod c:control_collection s:shard1 r:core_node1 x:collection1] o.a.s.c.SolrCore no updateRequestProcessorChain defined as default, creating implicit default
    [junit4] 2> 1017068 WARN (coreLoadExecutor-3866-thread-1-processing-n:127.0.0.1:57732__%2Fod) [n:127.0.0.1:57732__%2Fod c:control_collection s:shard1 r:core_node1 x:collection1] o.a.s.c.RequestHandlers INVALID paramSet a in requestHandler {type = requestHandler,name = /dump,class = DumpRequestHandler,args = {defaults={a=A,b=B}}}
    [junit4] 2> 1017073 INFO (coreLoadExecutor-3866-thread-1-processing-n:127.0.0.1:57732__%2Fod) [n:127.0.0.1:57732__%2Fod c:control_collection s:shard1 r:core_node1 x:collection1] o.a.s.h.l.XMLLoader xsltCacheLifetimeSeconds=60
    [junit4] 2> 1017074 INFO (coreLoadExecutor-3866-thread-1-processing-n:127.0.0.1:57732__%2Fod) [n:127.0.0.1:57732__%2Fod c:control_collection s:shard1 r:core_node1 x:collection1] o.a.s.h.l.XMLLoader xsltCacheLifetimeSeconds=60
    [junit4] 2> 1017075 INFO (coreLoadExecutor-3866-thread-1-processing-n:127.0.0.1:57732__%2Fod) [n:127.0.0.1:57732__%2Fod c:control_collection s:shard1 r:core_node1 x:collection1] o.a.s.h.l.XMLLoader xsltCacheLifetimeSeconds=60
    [junit4] 2> 1017076 INFO (coreLoadExecutor-3866-thread-1-processing-n:127.0.0.1:57732__%2Fod) [n:127.0.0.1:57732__%2Fod c:control_collection s:shard1 r:core_node1 x:collection1] o.a.s.h.l.XMLLoader xsltCacheLifetimeSeconds=60
    [junit4] 2> 1017079 INFO (coreLoadExecutor-3866-thread-1-processing-n:127.0.0.1:57732__%2Fod) [n:127.0.0.1:57732__%2Fod c:control_collection s:shard1 r:core_node1 x:collection1] o.a.s.c.RequestHandlers Registered paths: /admin/mbeans,standard,/update/json/docs,/admin/luke,/export,/get,/admin/properties,/update/json,/admin/threads,/dump,/update/csv,/sql,/graph,/admin/segments,/admin/system,/replication,/config,/stream,/schema,/admin/plugins,/admin/logging,/admin/ping,/update,/admin/file
    [junit4] 2> 1017079 INFO (coreLoadExecutor-3866-thread-1-processing-n:127.0.0.1:57732__%2Fod) [n:127.0.0.1:57732__%2Fod c:control_collection s:shard1 r:core_node1 x:collection1] o.a.s.c.SolrCore Using default statsCache cache: org.apache.solr.search.stats.LocalStatsCache
    [junit4] 2> 1017080 INFO (coreLoadExecutor-3866-thread-1-processing-n:127.0.0.1:57732__%2Fod) [n:127.0.0.1:57732__%2Fod c:control_collection s:shard1 r:core_node1 x:collection1] o.a.s.u.UpdateHandler Using UpdateLog implementation: org.apache.solr.update.UpdateLog
    [junit4] 2> 1017080 INFO (coreLoadExecutor-3866-thread-1-processing-n:127.0.0.1:57732__%2Fod) [n:127.0.0.1:57732__%2Fod c:control_collection s:shard1 r:core_node1 x:collection1] o.a.s.u.UpdateLog Initializing UpdateLog: dataDir= defaultSyncLevel=FLUSH numRecordsToKeep=100 maxNumLogsToKeep=10 numVersionBuckets=65536
    [junit4] 2> 1017082 INFO (coreLoadExecutor-3866-thread-1-processing-n:127.0.0.1:57732__%2Fod) [n:127.0.0.1:57732__%2Fod c:control_collection s:shard1 r:core_node1 x:collection1] o.a.s.u.CommitTracker Hard AutoCommit: disabled
    [junit4] 2> 1017082 INFO (coreLoadExecutor-3866-thread-1-processing-n:127.0.0.1:57732__%2Fod) [n:127.0.0.1:57732__%2Fod c:control_collection s:shard1 r:core_node1 x:collection1] o.a.s.u.CommitTracker Soft AutoCommit: disabled
    [junit4] 2> 1017082 INFO (coreLoadExecutor-3866-thread-1-processing-n:127.0.0.1:57732__%2Fod) [n:127.0.0.1:57732__%2Fod c:control_collection s:shard1 r:core_node1 x:collection1] o.a.s.u.RandomMergePolicy RandomMergePolicy wrapping class org.apache.lucene.index.LogDocMergePolicy: [LogDocMergePolicy: minMergeSize=1000, mergeFactor=14, maxMergeSize=9223372036854775807, maxMergeSizeForForcedMerge=9223372036854775807, calibrateSizeByDeletes=false, maxMergeDocs=2147483647, maxCFSSegmentSizeMB=8.796093022207999E12, noCFSRatio=0.1083035896939844]
    [junit4] 2> 1017082 INFO (coreLoadExecutor-3866-thread-1-processing-n:127.0.0.1:57732__%2Fod) [n:127.0.0.1:57732__%2Fod c:control_collection s:shard1 r:core_node1 x:collection1] o.a.s.c.SolrDeletionPolicy SolrDeletionPolicy.onInit: commits: num=1
    [junit4] 2> commit{dir=MockDirectoryWrapper(RAMDirectory@1576643 lockFactory=org.apache.lucene.store.SingleInstanceLockFactory@1860b67),segFN=segments_1,generation=1}
    [junit4] 2> 1017082 INFO (coreLoadExecutor-3866-thread-1-processing-n:127.0.0.1:57732__%2Fod) [n:127.0.0.1:57732__%2Fod c:control_collection s:shard1 r:core_node1 x:collection1] o.a.s.c.SolrDeletionPolicy newest commit generation = 1
    [junit4] 2> 1017082 INFO (coreLoadExecutor-3866-thread-1-processing-n:127.0.0.1:57732__%2Fod) [n:127.0.0.1:57732__%2Fod c:control_collection s:shard1 r:core_node1 x:collection1] o.a.s.s.SolrIndexSearcher Opening [Searcher@17d4000[collection1] main]
    [junit4] 2> 1017082 INFO (coreLoadExecutor-3866-thread-1-processing-n:127.0.0.1:57732__%2Fod) [n:127.0.0.1:57732__%2Fod c:control_collection s:shard1 r:core_node1 x:collection1] o.a.s.c.c.ZkStateReader Load collection config from: [/collections/control_collection]
    [junit4] 2> 1017083 INFO (OldIndexDirectoryCleanupThreadForCore-collection1) [n:127.0.0.1:57732__%2Fod c:control_collection s:shard1 r:core_node1 x:collection1] o.a.s.c.SolrCore Looking for old index directories to cleanup for core collection1 in C:\Users\jenkins\workspace\Lucene-Solr-6.1-Windows\solr\build\solr-core\test\J1\temp\solr.handler.TestSolrConfigHandlerCloud_8BA9A25AF74EB84D-001\control-001\cores\collection1\data\
    [junit4] 2> 1017085 INFO (coreLoadExecutor-3866-thread-1-processing-n:127.0.0.1:57732__%2Fod) [n:127.0.0.1:57732__%2Fod c:control_collection s:shard1 r:core_node1 x:collection1] o.a.s.c.c.ZkStateReader path=[/collections/control_collection] [configName]=[conf1] specified config exists in ZooKeeper
    [junit4] 2> 1017085 INFO (coreLoadExecutor-3866-thread-1-processing-n:127.0.0.1:57732__%2Fod) [n:127.0.0.1:57732__%2Fod c:control_collection s:shard1 r:core_node1 x:collection1] o.a.s.r.ManagedResourceStorage Setting up ZooKeeper-based storage for the RestManager with znodeBase: /configs/conf1
    [junit4] 2> 1017085 INFO (coreLoadExecutor-3866-thread-1-processing-n:127.0.0.1:57732__%2Fod) [n:127.0.0.1:57732__%2Fod c:control_collection s:shard1 r:core_node1 x:collection1] o.a.s.r.ManagedResourceStorage Configured ZooKeeperStorageIO with znodeBase: /configs/conf1
    [junit4] 2> 1017086 INFO (coreLoadExecutor-3866-thread-1-processing-n:127.0.0.1:57732__%2Fod) [n:127.0.0.1:57732__%2Fod c:control_collection s:shard1 r:core_node1 x:collection1] o.a.s.r.RestManager Initializing RestManager with initArgs: {}
    [junit4] 2> 1017086 INFO (coreLoadExecutor-3866-thread-1-processing-n:127.0.0.1:57732__%2Fod) [n:127.0.0.1:57732__%2Fod c:control_collection s:shard1 r:core_node1 x:collection1] o.a.s.r.ManagedResourceStorage Reading _rest_managed.json using ZooKeeperStorageIO:path=/configs/conf1
    [junit4] 2> 1017087 INFO (coreLoadExecutor-3866-thread-1-processing-n:127.0.0.1:57732__%2Fod) [n:127.0.0.1:57732__%2Fod c:control_collection s:shard1 r:core_node1 x:collection1] o.a.s.r.ManagedResourceStorage No data found for znode /configs/conf1/_rest_managed.json
    [junit4] 2> 1017087 INFO (coreLoadExecutor-3866-thread-1-processing-n:127.0.0.1:57732__%2Fod) [n:127.0.0.1:57732__%2Fod c:control_collection s:shard1 r:core_node1 x:collection1] o.a.s.r.ManagedResourceStorage Loaded null at path _rest_managed.json using ZooKeeperStorageIO:path=/configs/conf1
    [junit4] 2> 1017087 INFO (coreLoadExecutor-3866-thread-1-processing-n:127.0.0.1:57732__%2Fod) [n:127.0.0.1:57732__%2Fod c:control_collection s:shard1 r:core_node1 x:collection1] o.a.s.r.RestManager Initializing 0 registered ManagedResources
    [junit4] 2> 1017087 INFO (coreLoadExecutor-3866-thread-1-processing-n:127.0.0.1:57732__%2Fod) [n:127.0.0.1:57732__%2Fod c:control_collection s:shard1 r:core_node1 x:collection1] o.a.s.h.ReplicationHandler Commits will be reserved for 10000
    [junit4] 2> 1017087 INFO (searcherExecutor-3867-thread-1-processing-n:127.0.0.1:57732__%2Fod x:collection1 s:shard1 c:control_collection r:core_node1) [n:127.0.0.1:57732__%2Fod c:control_collection s:shard1 r:core_node1 x:collection1] o.a.s.c.SolrCore [collection1] Registered new searcher Searcher@17d4000[collection1] main{ExitableDirectoryReader(UninvertingDirectoryReader())}
    [junit4] 2> 1017087 INFO (coreLoadExecutor-3866-thread-1-processing-n:127.0.0.1:57732__%2Fod) [n:127.0.0.1:57732__%2Fod c:control_collection s:shard1 r:core_node1 x:collection1] o.a.s.u.UpdateLog Looking up max value of version field to seed version buckets
    [junit4] 2> 1017087 INFO (coreLoadExecutor-3866-thread-1-processing-n:127.0.0.1:57732__%2Fod) [n:127.0.0.1:57732__%2Fod c:control_collection s:shard1 r:core_node1 x:collection1] o.a.s.u.VersionInfo Refreshing highest value of _version_ for 65536 version buckets from index
    [junit4] 2> 1017087 INFO (coreLoadExecutor-3866-thread-1-processing-n:127.0.0.1:57732__%2Fod) [n:127.0.0.1:57732__%2Fod c:control_collection s:shard1 r:core_node1 x:collection1] o.a.s.u.VersionInfo No terms found for _version_, cannot seed version bucket highest value from index
    [junit4] 2> 1017087 INFO (coreLoadExecutor-3866-thread-1-processing-n:127.0.0.1:57732__%2Fod) [n:127.0.0.1:57732__%2Fod c:control_collection s:shard1 r:core_node1 x:collection1] o.a.s.u.UpdateLog Could not find max version in index or recent updates, using new clock 1537215482465091584
    [junit4] 2> 1017087 INFO (coreLoadExecutor-3866-thread-1-processing-n:127.0.0.1:57732__%2Fod) [n:127.0.0.1:57732__%2Fod c:control_collection s:shard1 r:core_node1 x:collection1] o.a.s.u.UpdateLog Took 1.0ms to seed version buckets with highest version 1537215482465091584
    [junit4] 2> 1017090 INFO (coreLoadExecutor-3866-thread-1-processing-n:127.0.0.1:57732__%2Fod) [n:127.0.0.1:57732__%2Fod c:control_collection s:shard1 r:core_node1 x:collection1] o.a.s.c.ZkController watch zkdir /configs/conf1
    [junit4] 2> 1017091 INFO (coreLoadExecutor-3866-thread-1-processing-n:127.0.0.1:57732__%2Fod) [n:127.0.0.1:57732__%2Fod c:control_collection s:shard1 r:core_node1 x:collection1] o.a.s.c.CoreContainer registering core: collection1
    [junit4] 2> 1017093 INFO (coreZkRegister-3860-thread-1-processing-n:127.0.0.1:57732__%2Fod x:collection1 s:shard1 c:control_collection r:core_node1) [n:127.0.0.1:57732__%2Fod c:control_collection s:shard1 r:core_node1 x:collection1] o.a.s.c.ZkController Register replica - core:collection1 address:http://127.0.0.1:57732/_/od collection:control_collection shard:shard1
    [junit4] 2> 1017095 INFO (coreZkRegister-3860-thread-1-processing-n:127.0.0.1:57732__%2Fod x:collection1 s:shard1 c:control_collection r:core_node1) [n:127.0.0.1:57732__%2Fod c:control_collection s:shard1 r:core_node1 x:collection1] o.a.s.c.c.SolrZkClient makePath: /collections/control_collection/leader_elect/shard1/election
    [junit4] 2> 1017099 INFO (coreZkRegister-3860-thread-1-processing-n:127.0.0.1:57732__%2Fod x:collection1 s:shard1 c:control_collection r:core_node1) [n:127.0.0.1:57732__%2Fod c:control_collection s:shard1 r:core_node1 x:collection1] o.a.s.c.LeaderElector Joined leadership election with path: /collections/control_collection/leader_elect/shard1/election/96075967529484292-core_node1-n_0000000000
    [junit4] 2> 1017100 INFO (coreZkRegister-3860-thread-1-processing-n:127.0.0.1:57732__%2Fod x:collection1 s:shard1 c:control_collection r:core_node1) [n:127.0.0.1:57732__%2Fod c:control_collection s:shard1 r:core_node1 x:collection1] o.a.s.c.ShardLeaderElectionContext Running the leader process for shard=shard1 and weAreReplacement=false and leaderVoteWait=10000
    [junit4] 2> 1017101 INFO (coreZkRegister-3860-thread-1-processing-n:127.0.0.1:57732__%2Fod x:collection1 s:shard1 c:control_collection r:core_node1) [n:127.0.0.1:57732__%2Fod c:control_collection s:shard1 r:core_node1 x:collection1] o.a.s.c.ShardLeaderElectionContext Enough replicas found to continue.
    [junit4] 2> 1017101 INFO (coreZkRegister-3860-thread-1-processing-n:127.0.0.1:57732__%2Fod x:collection1 s:shard1 c:control_collection r:core_node1) [n:127.0.0.1:57732__%2Fod c:control_collection s:shard1 r:core_node1 x:collection1] o.a.s.c.ShardLeaderElectionContext I may be the new leader - try and sync
    [junit4] 2> 1017101 INFO (coreZkRegister-3860-thread-1-processing-n:127.0.0.1:57732__%2Fod x:collection1 s:shard1 c:control_collection r:core_node1) [n:127.0.0.1:57732__%2Fod c:control_collection s:shard1 r:core_node1 x:collection1] o.a.s.c.SyncStrategy Sync replicas to http://127.0.0.1:57732/_/od/collection1/
    [junit4] 2> 1017101 INFO (coreZkRegister-3860-thread-1-processing-n:127.0.0.1:57732__%2Fod x:collection1 s:shard1 c:control_collection r:core_node1) [n:127.0.0.1:57732__%2Fod c:control_collection s:shard1 r:core_node1 x:collection1] o.a.s.c.SyncStrategy Sync Success - now sync replicas to me
    [junit4] 2> 1017101 INFO (coreZkRegister-3860-thread-1-processing-n:127.0.0.1:57732__%2Fod x:collection1 s:shard1 c:control_collection r:core_node1) [n:127.0.0.1:57732__%2Fod c:control_collection s:shard1 r:core_node1 x:collection1] o.a.s.c.SyncStrategy http://127.0.0.1:57732/_/od/collection1/ has no replicas
    [junit4] 2> 1017101 INFO (OverseerStateUpdate-96075967529484292-127.0.0.1:57732__%2Fod-n_0000000000) [n:127.0.0.1:57732__%2Fod ] o.a.s.c.Overseer processMessage: queueSize: 1, message = {
    [junit4] 2> "operation":"leader",
    [junit4] 2> "shard":"shard1",
    [junit4] 2> "collection":"control_collection"} current state version: 1
    [junit4] 2> 1017102 INFO (coreZkRegister-3860-thread-1-processing-n:127.0.0.1:57732__%2Fod x:collection1 s:shard1 c:control_collection r:core_node1) [n:127.0.0.1:57732__%2Fod c:control_collection s:shard1 r:core_node1 x:collection1] o.a.s.c.c.SolrZkClient makePath: /collections/control_collection/leaders/shard1
    [junit4] 2> 1017104 INFO (coreZkRegister-3860-thread-1-processing-n:127.0.0.1:57732__%2Fod x:collection1 s:shard1 c:control_collection r:core_node1) [n:127.0.0.1:57732__%2Fod c:control_collection s:shard1 r:core_node1 x:collection1] o.a.s.c.ShardLeaderElectionContextBase Creating leader registration node /collections/control_collection/leaders/shard1/leader after winning as /collections/control_collection/leader_elect/shard1/election/96075967529484292-core_node1-n_0000000000
    [junit4] 2> 1017106 INFO (coreZkRegister-3860-thread-1-processing-n:127.0.0.1:57732__%2Fod x:collection1 s:shard1 c:control_collection r:core_node1) [n:127.0.0.1:57732__%2Fod c:control_collection s:shard1 r:core_node1 x:collection1] o.a.s.c.ShardLeaderElectionContext I am the new leader: http://127.0.0.1:57732/_/od/collection1/ shard1
    [junit4] 2> 1017108 INFO (OverseerStateUpdate-96075967529484292-127.0.0.1:57732__%2Fod-n_0000000000) [n:127.0.0.1:57732__%2Fod ] o.a.s.c.Overseer processMessage: queueSize: 1, message = {
    [junit4] 2> "operation":"leader",
    [junit4] 2> "shard":"shard1",
    [junit4] 2> "collection":"control_collection",
    [junit4] 2> "base_url":"http://127.0.0.1:57732/_/od",
    [junit4] 2> "core":"collection1",
    [junit4] 2> "state":"active"} current state version: 1
    [junit4] 2> 1017213 INFO (zkCallback-1179-thread-1-processing-n:127.0.0.1:57732__%2Fod) [n:127.0.0.1:57732__%2Fod ] o.a.s.c.c.ZkStateReader A cluster state change: [WatchedEvent state:SyncConnected type:NodeDataChanged path:/clusterstate.json], has occurred - updating... (live nodes size: [1])
    [junit4] 2> 1017263 INFO (coreZkRegister-3860-thread-1-processing-n:127.0.0.1:57732__%2Fod x:collection1 s:shard1 c:control_collection r:core_node1) [n:127.0.0.1:57732__%2Fod c:control_collection s:shard1 r:core_node1 x:collection1] o.a.s.c.ZkController We are http://127.0.0.1:57732/_/od/collection1/ and leader is http://127.0.0.1:57732/_/od/collection1/
    [junit4] 2> 1017263 INFO (coreZkRegister-3860-thread-1-processing-n:127.0.0.1:57732__%2Fod x:collection1 s:shard1 c:control_collection r:core_node1) [n:127.0.0.1:57732__%2Fod c:control_collection s:shard1 r:core_node1 x:collection1] o.a.s.c.ZkController No LogReplay needed for core=collection1 baseURL=http://127.0.0.1:57732/_/od
    [junit4] 2> 1017263 INFO (coreZkRegister-3860-thread-1-processing-n:127.0.0.1:57732__%2Fod x:collection1 s:shard1 c:control_collection r:core_node1) [n:127.0.0.1:57732__%2Fod c:control_collection s:shard1 r:core_node1 x:collection1] o.a.s.c.ZkController I am the leader, no recovery necessary
    [junit4] 2> 1017263 INFO (coreZkRegister-3860-thread-1-processing-n:127.0.0.1:57732__%2Fod x:collection1 s:shard1 c:control_collection r:core_node1) [n:127.0.0.1:57732__%2Fod c:control_collection s:shard1 r:core_node1 x:collection1] o.a.s.c.ZkController publishing state=active
    [junit4] 2> 1017263 INFO (coreZkRegister-3860-thread-1-processing-n:127.0.0.1:57732__%2Fod x:collection1 s:shard1 c:control_collection r:core_node1) [n:127.0.0.1:57732__%2Fod c:control_collection s:shard1 r:core_node1 x:collection1] o.a.s.c.ZkController numShards not found on descriptor - reading it from system property
    [junit4] 2> 1017265 INFO (OverseerStateUpdate-96075967529484292-127.0.0.1:57732__%2Fod-n_0000000000) [n:127.0.0.1:57732__%2Fod ] o.a.s.c.Overseer processMessage: queueSize: 1, message = {
    [junit4] 2> "core":"collection1",
    [junit4] 2> "core_node_name":"core_node1",
    [junit4] 2> "roles":null,
    [junit4] 2> "base_url":"http://127.0.0.1:57732/_/od",
    [junit4] 2> "node_name":"127.0.0.1:57732__%2Fod",
    [junit4] 2> "numShards":"1",
    [junit4] 2> "state":"active",
    [junit4] 2> "shard":"shard1",
    [junit4] 2> "collection":"control_collection",
    [junit4] 2> "operation":"state"} current state version: 2
    [junit4] 2> 1017265 INFO (OverseerStateUpdate-96075967529484292-127.0.0.1:57732__%2Fod-n_0000000000) [n:127.0.0.1:57732__%2Fod ] o.a.s.c.o.ReplicaMutator Update state numShards=1 message={
    [junit4] 2> "core":"collection1",
    [junit4] 2> "core_node_name":"core_node1",
    [junit4] 2> "roles":null,
    [junit4] 2> "base_url":"http://127.0.0.1:57732/_/od",
    [junit4] 2> "node_name":"127.0.0.1:57732__%2Fod",
    [junit4] 2> "numShards":"1",
    [junit4] 2> "state":"active",
    [junit4] 2> "shard":"shard1",
    [junit4] 2> "collection":"control_collection",
    [junit4] 2> "operation":"state"}
    [junit4] 2> 1017370 INFO (zkCallback-1179-thread-3-processing-n:127.0.0.1:57732__%2Fod) [n:127.0.0.1:57732__%2Fod ] o.a.s.c.c.ZkStateReader A cluster state change: [WatchedEvent state:SyncConnected type:NodeDataChanged path:/clusterstate.json], has occurred - updating... (live nodes size: [1])
    [junit4] 2> 1017398 INFO (TEST-TestSolrConfigHandlerCloud.test-seed#[8BA9A25AF74EB84D]) [ ] o.a.s.c.s.i.CloudSolrClient Final constructed zkHost string: 127.0.0.1:57725/solr
    [junit4] 2> 1017398 INFO (TEST-TestSolrConfigHandlerCloud.test-seed#[8BA9A25AF74EB84D]) [ ] o.a.s.c.c.SolrZkClient Using default ZkCredentialsProvider
    [junit4] 2> 1017399 INFO (TEST-TestSolrConfigHandlerCloud.test-seed#[8BA9A25AF74EB84D]) [ ] o.a.s.c.c.ConnectionManager Waiting for client to connect to ZooKeeper
    [junit4] 2> 1017400 INFO (zkCallback-1183-thread-1) [ ] o.a.s.c.c.ConnectionManager Watcher org.apache.solr.common.cloud.ConnectionManager@1d24a33 name:ZooKeeperConnection Watcher:127.0.0.1:57725/solr got event WatchedEvent state:SyncConnected type:None path:null path:null type:None
    [junit4] 2> 1017400 INFO (TEST-TestSolrConfigHandlerCloud.test-seed#[8BA9A25AF74EB84D]) [ ] o.a.s.c.c.ConnectionManager Client is connected to ZooKeeper
    [junit4] 2> 1017401 INFO (TEST-TestSolrConfigHandlerCloud.test-seed#[8BA9A25AF74EB84D]) [ ] o.a.s.c.c.SolrZkClient Using default ZkACLProvider
    [junit4] 2> 1017401 INFO (TEST-TestSolrConfigHandlerCloud.test-seed#[8BA9A25AF74EB84D]) [ ] o.a.s.c.c.ZkStateReader Updating cluster state from ZooKeeper...
    [junit4] 2> 1017402 INFO (TEST-TestSolrConfigHandlerCloud.test-seed#[8BA9A25AF74EB84D]) [ ] o.a.s.c.c.ZkStateReader Loaded empty cluster properties
    [junit4] 2> 1017404 INFO (TEST-TestSolrConfigHandlerCloud.test-seed#[8BA9A25AF74EB84D]) [ ] o.a.s.c.c.ZkStateReader Updated live nodes from ZooKeeper... (0) -> (1)
    [junit4] 2> 1017405 INFO (TEST-TestSolrConfigHandlerCloud.test-seed#[8BA9A25AF74EB84D]) [ ] o.a.s.c.ChaosMonkey monkey: init - expire sessions:false cause connection loss:false
    [junit4] 2> 1017405 INFO (TEST-TestSolrConfigHandlerCloud.test-seed#[8BA9A25AF74EB84D]) [ ] o.a.s.c.AbstractFullDistribZkTestBase Creating collection1 with stateFormat=2
    [junit4] 2> 1017405 INFO (TEST-TestSolrConfigHandlerCloud.test-seed#[8BA9A25AF74EB84D]) [ ] o.a.s.c.c.SolrZkClient Using default ZkCredentialsProvider
    [junit4] 2> 1017407 INFO (TEST-TestSolrConfigHandlerCloud.test-seed#[8BA9A25AF74EB84D]) [ ] o.a.s.c.c.ConnectionManager Waiting for client to connect to ZooKeeper
    [junit4] 2> 1017409 INFO (zkCallback-1184-thread-1) [ ] o.a.s.c.c.ConnectionManager Watcher org.apache.solr.common.cloud.ConnectionManager@4991b8 name:ZooKeeperConnection Watcher:127.0.0.1:57725/solr got event WatchedEvent state:SyncConnected type:None path:null path:null type:None
    [junit4] 2> 1017409 INFO (TEST-TestSolrConfigHandlerCloud.test-seed#[8BA9A25AF74EB84D]) [ ] o.a.s.c.c.ConnectionManager Client is connected to ZooKeeper
    [junit4] 2> 1017409 INFO (TEST-TestSolrConfigHandlerCloud.test-seed#[8BA9A25AF74EB84D]) [ ] o.a.s.c.c.SolrZkClient Using default ZkACLProvider
    [junit4] 2> 1017416 INFO (OverseerStateUpdate-96075967529484292-127.0.0.1:57732__%2Fod-n_0000000000) [n:127.0.0.1:57732__%2Fod ] o.a.s.c.Overseer processMessage: queueSize: 1, message = {
    [junit4] 2> "operation":"create",
    [junit4] 2> "name":"collection1",
    [junit4] 2> "numShards":"2",
    [junit4] 2> "stateFormat":"2"} current state version: 3
    [junit4] 2> 1017416 INFO (OverseerStateUpdate-96075967529484292-127.0.0.1:57732__%2Fod-n_0000000000) [n:127.0.0.1:57732__%2Fod ] o.a.s.c.o.ClusterStateMutator building a new cName: collection1
    [junit4] 2> 1017526 INFO (OverseerStateUpdate-96075967529484292-127.0.0.1:57732__%2Fod-n_0000000000) [n:127.0.0.1:57732__%2Fod ] o.a.s.c.o.ZkStateWriter going to create_collection /collections/collection1/state.json
    [junit4] 2> 1017935 INFO (TEST-TestSolrConfigHandlerCloud.test-seed#[8BA9A25AF74EB84D]) [ ] o.a.s.SolrTestCaseJ4 Writing core.properties file to C:\Users\jenkins\workspace\Lucene-Solr-6.1-Windows\solr\build\solr-core\test\J1\temp\solr.handler.TestSolrConfigHandlerCloud_8BA9A25AF74EB84D-001\shard-1-001\cores\collection1
    [junit4] 2> 1017937 INFO (TEST-TestSolrConfigHandlerCloud.test-seed#[8BA9A25AF74EB84D]) [ ] o.a.s.c.AbstractFullDistribZkTestBase create jetty 1 in directory C:\Users\jenkins\workspace\Lucene-Solr-6.1-Windows\solr\build\solr-core\test\J1\temp\solr.handler.TestSolrConfigHandlerCloud_8BA9A25AF74EB84D-001\shard-1-001
    [junit4] 2> 1017938 INFO (TEST-TestSolrConfigHandlerCloud.test-seed#[8BA9A25AF74EB84D]) [ ] o.e.j.s.Server jetty-9.3.8.v20160314
    [junit4] 2> 1017939 INFO (TEST-TestSolrConfigHandlerCloud.test-seed#[8BA9A25AF74EB84D]) [ ] o.e.j.s.h.ContextHandler Started o.e.j.s.ServletContextHandler@185ccba{/_/od,null,AVAILABLE}
    [junit4] 2> 1017939 INFO (TEST-TestSolrConfigHandlerCloud.test-seed#[8BA9A25AF74EB84D]) [ ] o.e.j.s.ServerConnector Started ServerConnector@bf1afe{HTTP/1.1,[http/1.1]}{127.0.0.1:57754}
    [junit4] 2> 1017940 INFO (TEST-TestSolrConfigHandlerCloud.test-seed#[8BA9A25AF74EB84D]) [ ] o.e.j.s.Server Started @1022638ms
    [junit4] 2> 1017940 INFO (TEST-TestSolrConfigHandlerCloud.test-seed#[8BA9A25AF74EB84D]) [ ] o.a.s.c.s.e.JettySolrRunner Jetty properties: {solr.data.dir=C:\Users\jenkins\workspace\Lucene-Solr-6.1-Windows\solr\build\solr-core\test\J1\temp\solr.handler.TestSolrConfigHandlerCloud_8BA9A25AF74EB84D-001\tempDir-001/jetty1, solrconfig=solrconfig.xml, hostContext=/_/od, hostPort=57754, coreRootDirectory=C:\Users\jenkins\workspace\Lucene-Solr-6.1-Windows\solr\build\solr-core\test\J1\temp\solr.handler.TestSolrConfigHandlerCloud_8BA9A25AF74EB84D-001\shard-1-001\cores}
    [junit4] 2> 1017940 INFO (TEST-TestSolrConfigHandlerCloud.test-seed#[8BA9A25AF74EB84D]) [ ] o.a.s.s.SolrDispatchFilter SolrDispatchFilter.init(): sun.misc.Launcher$AppClassLoader@1d16e93
    [junit4] 2> 1017940 INFO (TEST-TestSolrConfigHandlerCloud.test-seed#[8BA9A25AF74EB84D]) [ ] o.a.s.c.SolrResourceLoader new SolrResourceLoader for directory: 'C:\Users\jenkins\workspace\Lucene-Solr-6.1-Windows\solr\build\solr-core\test\J1\temp\solr.handler.TestSolrConfigHandlerCloud_8BA9A25AF74EB84D-001\shard-1-001'
    [junit4] 2> 1017941 INFO (TEST-TestSolrConfigHandlerCloud.test-seed#[8BA9A25AF74EB84D]) [ ] o.a.s.c.SolrResourceLoader JNDI not configured for solr (NoInitialContextEx)
    [junit4] 2> 1017948 INFO (TEST-TestSolrConfigHandlerCloud.test-seed#[8BA9A25AF74EB84D]) [ ] o.a.s.c.SolrResourceLoader solr home defaulted to 'solr/' (could not find system property or JNDI)
    [junit4] 2> 1017949 INFO (TEST-TestSolrConfigHandlerCloud.test-seed#[8BA9A25AF74EB84D]) [ ] o.a.s.c.c.SolrZkClient Using default ZkCredentialsProvider
    [junit4] 2> 1017951 INFO (TEST-TestSolrConfigHandlerCloud.test-seed#[8BA9A25AF74EB84D]) [ ] o.a.s.c.c.ConnectionManager Waiting for client to connect to ZooKeeper
    [junit4] 2> 1017952 INFO (zkCallback-1185-thread-1) [ ] o.a.s.c.c.ConnectionManager Watcher org.apache.solr.common.cloud.ConnectionManager@13b7628 name:ZooKeeperConnection Watcher:127.0.0.1:57725/solr got event WatchedEvent state:SyncConnected type:None path:null path:null type:None
    [junit4] 2> 1017952 INFO (TEST-TestSolrConfigHandlerCloud.test-seed#[8BA9A25AF74EB84D]) [ ] o.a.s.c.c.ConnectionManager Client is connected to ZooKeeper
    [junit4] 2> 1017952 INFO (TEST-TestSolrConfigHandlerCloud.test-seed#[8BA9A25AF74EB84D]) [ ] o.a.s.c.c.SolrZkClient Using default ZkACLProvider
    [junit4] 2> 1017953 INFO (TEST-TestSolrConfigHandlerCloud.test-seed#[8BA9A25AF74EB84D]) [ ] o.a.s.s.SolrDispatchFilter Loading solr.xml from SolrHome (not found in ZooKeeper)
    [junit4] 2> 1017953 INFO (TEST-TestSolrConfigHandlerCloud.test-seed#[8BA9A25AF74EB84D]) [ ] o.a.s.c.SolrXmlConfig Loading container configuration from C:\Users\jenkins\workspace\Lucene-Solr-6.1-Windows\solr\build\solr-core\test\J1\temp\solr.handler.TestSolrConfigHandlerCloud_8BA9A25AF74EB84D-001\shard-1-001\solr.xml
    [junit4] 2> 1017962 INFO (TEST-TestSolrConfigHandlerCloud.test-seed#[8BA9A25AF74EB84D]) [ ] o.a.s.c.CorePropertiesLocator Config-defined core root directory: C:\Users\jenkins\workspace\Lucene-Solr-6.1-Windows\solr\build\solr-core\test\J1\temp\solr.handler.TestSolrConfigHandlerCloud_8BA9A25AF74EB84D-001\shard-1-001\cores
    [junit4] 2> 1017962 INFO (TEST-TestSolrConfigHandlerCloud.test-seed#[8BA9A25AF74EB84D]) [ ] o.a.s.c.CoreContainer New CoreContainer 1363127
    [junit4] 2> 1017962 INFO (TEST-TestSolrConfigHandlerCloud.test-seed#[8BA9A25AF74EB84D]) [ ] o.a.s.c.CoreContainer Loading cores into CoreContainer [instanceDir=C:\Users\jenkins\workspace\Lucene-Solr-6.1-Windows\solr\build\solr-core\test\J1\temp\solr.handler.TestSolrConfigHandlerCloud_8BA9A25AF74EB84D-001\shard-1-001]
    [junit4] 2> 1017963 WARN (TEST-TestSolrConfigHandlerCloud.test-seed#[8BA9A25AF74EB84D]) [ ] o.a.s.c.CoreContainer Couldn't add files from C:\Users\jenkins\workspace\Lucene-Solr-6.1-Windows\solr\build\solr-core\test\J1\temp\solr.handler.TestSolrConfigHandlerCloud_8BA9A25AF74EB84D-001\shard-1-001\lib to classpath: C:\Users\jenkins\workspace\Lucene-Solr-6.1-Windows\solr\build\solr-core\test\J1\temp\solr.handler.TestSolrConfigHandlerCloud_8BA9A25AF74EB84D-001\shard-1-001\lib
    [junit4] 2> 1017963 INFO (TEST-TestSolrConfigHandlerCloud.test-seed#[8BA9A25AF74EB84D]) [ ] o.a.s.h.c.HttpShardHandlerFactory created with socketTimeout : 90000,urlScheme : ,connTimeout : 15000,maxConnectionsPerHost : 20,maxConnections : 10000,corePoolSize : 0,maximumPoolSize : 2147483647,maxThreadIdleTime : 5,sizeOfQueue : -1,fairnessPolicy : false,useRetries : false,
    [junit4] 2> 1017966 INFO (TEST-TestSolrConfigHandlerCloud.test-seed#[8BA9A25AF74EB84D]) [ ] o.a.s.u.UpdateShardHandler Creating UpdateShardHandler HTTP client with params: socketTimeout=340000&connTimeout=45000&retry=true
    [junit4] 2> 1017966 INFO (TEST-TestSolrConfigHandlerCloud.test-seed#[8BA9A25AF74EB84D]) [ ] o.a.s.l.LogWatcher SLF4J impl is org.slf4j.impl.Log4jLoggerFactory
    [junit4] 2> 1017966 INFO (TEST-TestSolrConfigHandlerCloud.test-seed#[8BA9A25AF74EB84D]) [ ] o.a.s.l.LogWatcher Registering Log Listener [Log4j (org.slf4j.impl.Log4jLoggerFactory)]
    [junit4] 2> 1017966 INFO (TEST-TestSolrConfigHandlerCloud.test-seed#[8BA9A25AF74EB84D]) [ ] o.a.s.c.ZkContainer Zookeeper client=127.0.0.1:57725/solr
    [junit4] 2> 1017966 INFO (TEST-TestSolrConfigHandlerCloud.test-seed#[8BA9A25AF74EB84D]) [ ] o.a.s.c.ZkController zkHost includes chroot
    [junit4] 2> 1017966 INFO (TEST-TestSolrConfigHandlerCloud.test-seed#[8BA9A25AF74EB84D]) [ ] o.a.s.c.c.SolrZkClient Using default ZkCredentialsProvider
    [junit4] 2> 1017967 INFO (TEST-TestSolrConfigHandlerCloud.test-seed#[8BA9A25AF74EB84D]) [ ] o.a.s.c.c.ConnectionManager Waiting for client to connect to ZooKeeper
    [junit4] 2> 1017971 INFO (zkCallback-1188-thread-1) [ ] o.a.s.c.c.ConnectionManager Watcher org.apache.solr.common.cloud.ConnectionManager@11c009c name:ZooKeeperConnection Watcher:127.0.0.1:57725 got event WatchedEvent state:SyncConnected type:None path:null path:null type:None
    [junit4] 2> 1017971 INFO (TEST-TestSolrConfigHandlerCloud.test-seed#[8BA9A25AF74EB84D]) [ ] o.a.s.c.c.ConnectionManager Client is connected to ZooKeeper
    [junit4] 2> 1017971 INFO (TEST-TestSolrConfigHandlerCloud.test-seed#[8BA9A25AF74EB84D]) [ ] o.a.s.c.c.SolrZkClient Using default ZkACLProvider
    [junit4] 2> 1017972 WARN (NIOServerCxn.Factory:0.0.0.0/0.0.0.0:0) [ ] o.a.z.s.NIOServerCnxn caught end of stream exception
    [junit4] 2> EndOfStreamException: Unable to read additional data from client sessionid 0x15554955c0c0008, likely client has closed socket
    [junit4] 2> at org.apache.zookeeper.server.NIOServerCnxn.doIO(NIOServerCnxn.java:228)
    [junit4] 2> at org.apache.zookeeper.server.NIOServerCnxnFactory.run(NIOServerCnxnFactory.java:208)
    [junit4] 2> at java.lang.Thread.run(Thread.java:745)
    [junit4] 2> 1017973 INFO (TEST-TestSolrConfigHandlerCloud.test-seed#[8BA9A25AF74EB84D]) [n:127.0.0.1:57754__%2Fod ] o.a.s.c.ZkController Added new OnReconnect listener org.apache.solr.cloud.ZkController$$Lambda$52/21291569@f9e54b
    [junit4] 2> 1017977 INFO (TEST-TestSolrConfigHandlerCloud.test-seed#[8BA9A25AF74EB84D]) [n:127.0.0.1:57754__%2Fod ] o.a.s.c.c.ConnectionManager Waiting for client to connect to ZooKeeper
    [junit4] 2> 1017977 INFO (zkCallback-1189-thread-1-processing-n:127.0.0.1:57754__%2Fod) [n:127.0.0.1:57754__%2Fod ] o.a.s.c.c.ConnectionManager Watcher org.apache.solr.common.cloud.ConnectionManager@53c0a3 name:ZooKeeperConnection Watcher:127.0.0.1:57725/solr got event WatchedEvent state:SyncConnected type:None path:null path:null type:None
    [junit4] 2> 1017977 INFO (TEST-TestSolrConfigHandlerCloud.test-seed#[8BA9A25AF74EB84D]) [n:127.0.0.1:57754__%2Fod ] o.a.s.c.c.ConnectionManager Client is connected to ZooKeeper
    [junit4] 2> 1017986 INFO (TEST-TestSolrConfigHandlerCloud.test-seed#[8BA9A25AF74EB84D]) [n:127.0.0.1:57754__%2Fod ] o.a.s.c.c.ZkStateReader Updating cluster state from ZooKeeper...
    [junit4] 2> 1017987 INFO (TEST-TestSolrConfigHandlerCloud.test-seed#[8BA9A25AF74EB84D]) [n:127.0.0.1:57754__%2Fod ] o.a.s.c.c.ZkStateReader Loaded empty cluster properties
    [junit4] 2> 1017988 INFO (TEST-TestSolrConfigHandlerCloud.test-seed#[8BA9A25AF74EB84D]) [n:127.0.0.1:57754__%2Fod ] o.a.s.c.c.ZkStateReader Updated live nodes from ZooKeeper... (0) -> (1)
    [junit4] 2> 1017991 INFO (TEST-TestSolrConfigHandlerCloud.test-seed#[8BA9A25AF74EB84D]) [n:127.0.0.1:57754__%2Fod ] o.a.s.c.Overseer Overseer (id=null) closing
    [junit4] 2> 1017991 INFO (TEST-TestSolrConfigHandlerCloud.test-seed#[8BA9A25AF74EB84D]) [n:127.0.0.1:57754__%2Fod ] o.a.s.c.LeaderElector Joined leadership election with path: /overseer_elect/election/96075967529484297-127.0.0.1:57754__%2Fod-n_0000000001
    [junit4] 2> 1017992 INFO (TEST-TestSolrConfigHandlerCloud.test-seed#[8BA9A25AF74EB84D]) [n:127.0.0.1:57754__%2Fod ] o.a.s.c.LeaderElector Watching path /overseer_elect/election/96075967529484292-127.0.0.1:57732__%2Fod-n_0000000000 to know if I could be the leader
    [junit4] 2> 1017993 INFO (TEST-TestSolrConfigHandlerCloud.test-seed#[8BA9A25AF74EB84D]) [n:127.0.0.1:57754__%2Fod ] o.a.s.c.ZkController Publish node=127.0.0.1:57754__%2Fod as DOWN
    [junit4] 2> 1017996 INFO (OverseerStateUpdate-96075967529484292-127.0.0.1:57732__%2Fod-n_0000000000) [n:127.0.0.1:57732__%2Fod ] o.a.s.c.Overseer processMessage: queueSize: 1, message = {
    [junit4] 2> "operation":"downnode",
    [junit4] 2> "node_name":"127.0.0.1:57754__%2Fod"} current state version: 3
    [junit4] 2> 1017996 INFO (OverseerStateUpdate-96075967529484292-127.0.0.1:57732__%2Fod-n_0000000000) [n:127.0.0.1:57732__%2Fod ] o.a.s.c.o.NodeMutator DownNode state invoked for node: 127.0.0.1:57754__%2Fod
    [junit4] 2> 1017996 INFO (zkCallback-1179-thread-3-processing-n:127.0.0.1:57732__%2Fod) [n:127.0.0.1:57732__%2Fod ] o.a.s.c.c.ZkStateReader A cluster state change: [WatchedEvent state:SyncConnected type:NodeDataChanged path:/clusterstate.json], has occurred - updating... (live nodes size: [1])
    [junit4] 2> 1017996 INFO (zkCallback-1183-thread-1) [ ] o.a.s.c.c.ZkStateReader A cluster state change: [WatchedEvent state:SyncConnected type:NodeDataChanged path:/clusterstate.json], has occurred - updating... (live nodes size: [1])
    [junit4] 2> 1017996 INFO (zkCallback-1189-thread-1-processing-n:127.0.0.1:57754__%2Fod) [n:127.0.0.1:57754__%2Fod ] o.a.s.c.c.ZkStateReader A cluster state change: [WatchedEvent state:SyncConnected type:NodeDataChanged path:/clusterstate.json], has occurred - updating... (live nodes size: [1])
    [junit4] 2> 1018103 INFO (OverseerStateUpdate-96075967529484292-127.0.0.1:57732__%2Fod-n_0000000000) [n:127.0.0.1:57732__%2Fod ] o.a.s.c.o.ZkStateWriter going to update_collection /collections/collection1/state.json version: 0
    [junit4] 2> 1018999 INFO (TEST-TestSolrConfigHandlerCloud.test-seed#[8BA9A25AF74EB84D]) [n:127.0.0.1:57754__%2Fod ] o.a.s.c.ZkController Register node as live in ZooKeeper:/live_nodes/127.0.0.1:57754__%2Fod
    [junit4] 2> 1018999 INFO (TEST-TestSolrConfigHandlerCloud.test-seed#[8BA9A25AF74EB84D]) [n:127.0.0.1:57754__%2Fod ] o.a.s.c.c.SolrZkClient makePath: /live_nodes/127.0.0.1:57754__%2Fod
    [junit4] 2> 1019003 INFO (zkCallback-1179-thread-3-processing-n:127.0.0.1:57732__%2Fod) [n:127.0.0.1:57732__%2Fod ] o.a.s.c.c.ZkStateReader A live node change: [WatchedEvent state:SyncConnected type:NodeChildrenChanged path:/live_nodes], has occurred - updating... (live nodes size: [1])
    [junit4] 2> 1019003 INFO (zkCallback-1189-thread-1-processing-n:127.0.0.1:57754__%2Fod) [n:127.0.0.1:57754__%2Fod ] o.a.s.c.c.ZkStateReader A live node change: [WatchedEvent state:SyncConnected type:NodeChildrenChanged path:/live_nodes], has occurred - updating... (live nodes size: [1])
    [junit4] 2> 1019003 INFO (zkCallback-1183-thread-1) [ ] o.a.s.c.c.ZkStateReader A live node change: [WatchedEvent state:SyncConnected type:NodeChildrenChanged path:/live_nodes], has occurred - updating... (live nodes size: [1])
    [junit4] 2> 1019003 INFO (zkCallback-1179-thread-3-processing-n:127.0.0.1:57732__%2Fod) [n:127.0.0.1:57732__%2Fod ] o.a.s.c.c.ZkStateReader Updated live nodes from ZooKeeper... (1) -> (2)
    [junit4] 2> 1019003 INFO (zkCallback-1189-thread-1-processing-n:127.0.0.1:57754__%2Fod) [n:127.0.0.1:57754__%2Fod ] o.a.s.c.c.ZkStateReader Updated live nodes from ZooKeeper... (1) -> (2)
    [junit4] 2> 1019004 INFO (zkCallback-1183-thread-1) [ ] o.a.s.c.c.ZkStateReader Updated live nodes from ZooKeeper... (1) -> (2)
    [junit4] 2> 1019015 INFO (TEST-TestSolrConfigHandlerCloud.test-seed#[8BA9A25AF74EB84D]) [n:127.0.0.1:57754__%2Fod ] o.a.s.c.CoreContainer Security conf doesn't exist. Skipping setup for authorization module.
    [junit4] 2> 1019015 INFO (TEST-TestSolrConfigHandlerCloud.test-seed#[8BA9A25AF74EB84D]) [n:127.0.0.1:57754__%2Fod ] o.a.s.c.CoreContainer No authentication plugin used.
    [junit4] 2> 1019016 INFO (TEST-TestSolrConfigHandlerCloud.test-seed#[8BA9A25AF74EB84D]) [n:127.0.0.1:57754__%2Fod ] o.a.s.c.CorePropertiesLocator Looking for core definitions underneath C:\Users\jenkins\workspace\Lucene-Solr-6.1-Windows\solr\build\solr-core\test\J1\temp\solr.handler.TestSolrConfigHandlerCloud_8BA9A25AF74EB84D-001\shard-1-001\cores
    [junit4] 2> 1019019 INFO (TEST-TestSolrConfigHandlerCloud.test-seed#[8BA9A25AF74EB84D]) [n:127.0.0.1:57754__%2Fod ] o.a.s.c.CoreDescriptor Created CoreDescriptor: {name=collection1, config=solrconfig.xml, transient=false, schema=schema.xml, loadOnStartup=true, configSetProperties=configsetprops.json, collection=collection1, coreNodeName=, dataDir=data\, shard=}
    [junit4] 2> 1019019 INFO (TEST-TestSolrConfigHandlerCloud.test-seed#[8BA9A25AF74EB84D]) [n:127.0.0.1:57754__%2Fod ] o.a.s.c.CorePropertiesLocator Found core collection1 in C:\Users\jenkins\workspace\Lucene-Solr-6.1-Windows\solr\build\solr-core\test\J1\temp\solr.handler.TestSolrConfigHandlerCloud_8BA9A25AF74EB84D-001\shard-1-001\cores\collection1
    [junit4] 2> 1019019 INFO (TEST-TestSolrConfigHandlerCloud.test-seed#[8BA9A25AF74EB84D]) [n:127.0.0.1:57754__%2Fod ] o.a.s.c.CorePropertiesLocator Found 1 core definitions
    [junit4] 2> 1019020 INFO (TEST-TestSolrConfigHandlerCloud.test-seed#[8BA9A25AF74EB84D]) [n:127.0.0.1:57754__%2Fod ] o.a.s.s.SolrDispatchFilter user.dir=C:\Users\jenkins\workspace\Lucene-Solr-6.1-Windows\solr\build\solr-core\test\J1
    [junit4] 2> 1019020 INFO (TEST-TestSolrConfigHandlerCloud.test-seed#[8BA9A25AF74EB84D]) [n:127.0.0.1:57754__%2Fod ] o.a.s.s.SolrDispatchFilter SolrDispatchFilter.init() done
    [junit4] 2> 1019021 INFO (coreLoadExecutor-3877-thread-1-processing-n:127.0.0.1:57754__%2Fod) [n:127.0.0.1:57754__%2Fod c:collection1 x:collection1] o.a.s.c.ZkController publishing state=down
    [junit4] 2> 1019021 INFO (coreLoadExecutor-3877-thread-1-processing-n:127.0.0.1:57754__%2Fod) [n:127.0.0.1:57754__%2Fod c:collection1 x:collection1] o.a.s.c.ZkController numShards not found on descriptor - reading it from system property
    [junit4] 2> 1019022 INFO (coreLoadExecutor-3877-thread-1-processing-n:127.0.0.1:57754__%2Fod) [n:127.0.0.1:57754__%2Fod c:collection1 x:collection1] o.a.s.c.ZkController Registering watch for collection collection1
    [junit4] 2> 1019022 INFO (OverseerStateUpdate-96075967529484292-127.0.0.1:57732__%2Fod-n_0000000000) [n:127.0.0.1:57732__%2Fod ] o.a.s.c.Overseer processMessage: queueSize: 1, message = {
    [junit4] 2> "core":"collection1",
    [junit4] 2> "roles":null,
    [junit4] 2> "base_url":"http://127.0.0.1:57754/_/od",
    [junit4] 2> "node_name":"127.0.0.1:57754__%2Fod",
    [junit4] 2> "numShards":"2",
    [junit4] 2> "state":"down",
    [junit4] 2> "shard":null,
    [junit4] 2> "collection":"collection1",
    [junit4] 2> "operation":"state"} current state version: 4
    [junit4] 2> 1019022 INFO (OverseerStateUpdate-96075967529484292-127.0.0.1:57732__%2Fod-n_0000000000) [n:127.0.0.1:57732__%2Fod ] o.a.s.c.o.ReplicaMutator Update state numShards=2 message={
    [junit4] 2> "core":"collection1",
    [junit4] 2> "roles":null,
    [junit4] 2> "base_url":"http://127.0.0.1:57754/_/od",
    [junit4] 2> "node_name":"127.0.0.1:57754__%2Fod",
    [junit4] 2> "numShards":"2",
    [junit4] 2> "state":"down",
    [junit4] 2> "shard":null,
    [junit4] 2> "collection":"collection1",
    [junit4] 2> "operation":"state"}
    [junit4] 2> 1019022 INFO (OverseerStateUpdate-96075967529484292-127.0.0.1:57732__%2Fod-n_0000000000) [n:127.0.0.1:57732__%2Fod ] o.a.s.c.o.ReplicaMutator Collection already exists with numShards=2
    [junit4] 2> 1019023 INFO (OverseerStateUpdate-96075967529484292-127.0.0.1:57732__%2Fod-n_0000000000) [n:127.0.0.1:57732__%2Fod ] o.a.s.c.o.ReplicaMutator Assigning new node to shard shard=shard2
    [junit4] 2> 1019023 INFO (coreLoadExecutor-3877-thread-1-processing-n:127.0.0.1:57754__%2Fod) [n:127.0.0.1:57754__%2Fod c:collection1 x:collection1] o.a.s.c.c.ZkStateReader Add data for [collection1] ver [1]
    [junit4] 2> 1019023 INFO (coreLoadExecutor-3877-thread-1-processing-n:127.0.0.1:57754__%2Fod) [n:127.0.0.1:57754__%2Fod c:collection1 x:collection1] o.a.s.c.ZkController look for our core node name
    [junit4] 2> 1019127 INFO (OverseerStateUpdate-96075967529484292-127.0.0.1:57732__%2Fod-n_0000000000) [n:127.0.0.1:57732__%2Fod ] o.a.s.c.o.ZkStateWriter going to update_collection /collections/collection1/state.json version: 1
    [junit4] 2> 1019127 INFO (zkCallback-1189-thread-1-processing-n:127.0.0.1:57754__%2Fod) [n:127.0.0.1:57754__%2Fod ] o.a.s.c.c.ZkStateReader A cluster state change: [WatchedEvent state:SyncConnected type:NodeDataChanged path:/collections/collection1/state.json] for collection [collection1] has occurred - updating... (live nodes size: [2])
    [junit4] 2> 1019128 INFO (zkCallback-1189-thread-1-processing-n:127.0.0.1:57754__%2Fod) [n:127.0.0.1:57754__%2Fod ] o.a.s.c.c.ZkStateReader Updating data for [collection1] from [1] to [2]
    [junit4] 2> 1020024 INFO (coreLoadExecutor-3877-thread-1-processing-n:127.0.0.1:57754__%2Fod) [n:127.0.0.1:57754__%2Fod c:collection1 x:collection1] o.a.s.c.ZkController waiting to find shard id in clusterstate for collection1
    [junit4] 2> 1020024 INFO (coreLoadExecutor-3877-thread-1-processing-n:127.0.0.1:57754__%2Fod) [n:127.0.0.1:57754__%2Fod c:collection1 x:collection1] o.a.s.c.ZkController Check for collection zkNode:collection1
    [junit4] 2> 1020024 INFO (coreLoadExecutor-3877-thread-1-processing-n:127.0.0.1:57754__%2Fod) [n:127.0.0.1:57754__%2Fod c:collection1 x:collection1] o.a.s.c.ZkController Collection zkNode exists
    [junit4] 2> 1020024 INFO (coreLoadExecutor-3877-thread-1-processing-n:127.0.0.1:57754__%2Fod) [n:127.0.0.1:57754__%2Fod c:collection1 x:collection1] o.a.s.c.c.ZkStateReader Load collection config from: [/collections/collection1]
    [junit4] 2> 1020025 INFO (coreLoadExecutor-3877-thread-1-processing-n:127.0.0.1:57754__%2Fod) [n:127.0.0.1:57754__%2Fod c:collection1 x:collection1] o.a.s.c.c.ZkStateReader path=[/collections/collection1] [configName]=[conf1] specified config exis

[...truncated too long message...]

on: Unable to reload core [collection1]
    [junit4] 2> at org.apache.solr.core.CoreContainer.reload(CoreContainer.java:920)
    [junit4] 2> at org.apache.solr.core.SolrCore.lambda$getConfListener$6(SolrCore.java:2510)
    [junit4] 2> at org.apache.solr.cloud.ZkController$4.run(ZkController.java:2408)
    [junit4] 2> Caused by: org.apache.solr.common.SolrException: Could not load conf for core collection1: Error loading schema resource schema.xml
    [junit4] 2> at org.apache.solr.core.ConfigSetService.getConfig(ConfigSetService.java:86)
    [junit4] 2> at org.apache.solr.core.CoreContainer.reload(CoreContainer.java:912)
    [junit4] 2> ... 2 more
    [junit4] 2> Caused by: org.apache.solr.common.SolrException: Error loading schema resource schema.xml
    [junit4] 2> at org.apache.solr.schema.IndexSchemaFactory.create(IndexSchemaFactory.java:52)
    [junit4] 2> at org.apache.solr.schema.IndexSchemaFactory.buildIndexSchema(IndexSchemaFactory.java:75)
    [junit4] 2> at org.apache.solr.core.ConfigSetService.createIndexSchema(ConfigSetService.java:108)
    [junit4] 2> at org.apache.solr.core.ConfigSetService.getConfig(ConfigSetService.java:79)
    [junit4] 2> ... 3 more
    [junit4] 2> Caused by: java.io.IOException: Could not load resource=schema.xml
    [junit4] 2> at org.apache.solr.cloud.ZkSolrResourceLoader.openResource(ZkSolrResourceLoader.java:105)
    [junit4] 2> at org.apache.solr.core.SolrResourceLoader.openSchema(SolrResourceLoader.java:333)
    [junit4] 2> at org.apache.solr.schema.IndexSchemaFactory.create(IndexSchemaFactory.java:48)
    [junit4] 2> ... 6 more
    [junit4] 2> Caused by: java.lang.InterruptedException: sleep interrupted
    [junit4] 2> at java.lang.Thread.sleep(Native Method)
    [junit4] 2> at org.apache.solr.cloud.ZkSolrResourceLoader.openResource(ZkSolrResourceLoader.java:101)
    [junit4] 2> ... 8 more
    [junit4] 2> Jun 15, 2016 3:03:06 PM com.carrotsearch.randomizedtesting.ThreadLeakControl tryToInterruptAll
    [junit4] 2> INFO: All leaked threads terminated.
    [junit4] 2> NOTE: test params are: codec=Asserting(Lucene60), sim=ClassicSimilarity, locale=en-PH, timezone=Etc/GMT+4
    [junit4] 2> NOTE: Windows 10 10.0 x86/Oracle Corporation 1.8.0_92 (32-bit)/cpus=3,threads=1,free=85614216,total=300494848
    [junit4] 2> NOTE: All tests run in this JVM: [TestFastOutputStream, OverseerTaskQueueTest, UUIDUpdateProcessorFallbackTest, BitVectorTest, TestTrie, AutoCommitTest, TestRebalanceLeaders, TestDocTermOrds, SolrCoreCheckLockOnStartupTest, QueryParsingTest, ResponseLogComponentTest, DistributedFacetPivotSmallAdvancedTest, HdfsWriteToMultipleCollectionsTest, TestAddFieldRealTimeGet, SearchHandlerTest, IndexSchemaRuntimeFieldTest, TestPHPSerializedResponseWriter, TestFilteredDocIdSet, TestMinMaxOnMultiValuedField, UpdateRequestProcessorFactoryTest, TestCharFilters, TestWriterPerf, ResourceLoaderTest, TestJoin, JavabinLoaderTest, SuggesterTSTTest, MinimalSchemaTest, FileUtilsTest, TestUseDocValuesAsStored, HLLUtilTest, BadIndexSchemaTest, TestFastWriter, TestObjectReleaseTracker, TestXmlQParser, TestJettySolrRunner, TestSchemaNameResource, FieldMutatingUpdateProcessorTest, DistributedQueryComponentOptimizationTest, HdfsRecoveryZkTest, HdfsTlogReplayBufferedWhileIndexingTest, TestInitParams, TestIndexingPerformance, TestSimpleTrackingShardHandler, TestCustomDocTransformer, TestCSVResponseWriter, TestRealTimeGet, TestQueryUtils, BlockDirectoryTest, ConvertedLegacyTest, SortByFunctionTest, TestDistributedStatsComponentCardinality, SolrPluginUtilsTest, TestSolrDeletionPolicy2, TestRequestForwarding, TestHdfsUpdateLog, TestPerFieldSimilarity, DistributedMLTComponentTest, TestFileDictionaryLookup, UniqFieldsUpdateProcessorFactoryTest, TestSolrConfigHandler, TestReversedWildcardFilterFactory, CoreAdminHandlerTest, ResponseHeaderTest, DistributedIntervalFacetingTest, TestPerFieldSimilarityClassic, DeleteInactiveReplicaTest, TestPivotHelperCode, AnalyticsMergeStrategyTest, TestSolrFieldCacheMBean, TestCopyFieldCollectionResource, CoreMergeIndexesAdminHandlerTest, TestSolrCLIRunExample, NoCacheHeaderTest, CollectionReloadTest, TestConfigSetsAPIZkFailure, TestSubQueryTransformer, TestSystemIdResolver, AsyncCallRequestStatusResponseTest, HdfsSyncSliceTest, SolrIndexSplitterTest, TestUtils, TestMaxScoreQueryParser, LeaderInitiatedRecoveryOnShardRestartTest, TestLegacyFieldCache, DistribDocExpirationUpdateProcessorTest, ShardSplitTest, TestRecovery, TestRuleBasedAuthorizationPlugin, TestSearcherReuse, ExitableDirectoryReaderTest, TestSortingResponseWriter, CacheHeaderTest, LeaderElectionIntegrationTest, TestSolrQueryParserResource, TestExactStatsCache, TestCoreDiscovery, LukeRequestHandlerTest, BaseCdcrDistributedZkTest, TestRawTransformer, TestReplicationHandlerBackup, OpenExchangeRatesOrgProviderTest, TestClusterStateMutator, DistanceFunctionTest, TestSolrCoreProperties, EchoParamsTest, TestDistribIDF, DateRangeFieldTest, HdfsChaosMonkeySafeLeaderTest, DeleteStatusTest, ConnectionReuseTest, SolrCloudExampleTest, BlobRepositoryCloudTest, TestOmitPositions, FullHLLTest, TestValueSourceCache, ShowFileRequestHandlerTest, DeleteReplicaTest, SecurityConfHandlerTest, OpenCloseCoreStressTest, OverseerRolesTest, ShardRoutingCustomTest, TestAuthorizationFramework, RestartWhileUpdatingTest, CoreAdminCreateDiscoverTest, ZkNodePropsTest, TestQueryWrapperFilter, OutputWriterTest, HdfsBasicDistributedZkTest, TestBadConfig, TestFieldCacheVsDocValues, TestSortByMinMaxFunction, TestSolrConfigHandlerCloud]
    [junit4] 2> NOTE: reproduce with: ant test -Dtestcase=TestSolrConfigHandlerCloud -Dtests.seed=8BA9A25AF74EB84D -Dtests.slow=true -Dtests.locale=en-PH -Dtests.timezone=Etc/GMT+4 -Dtests.asserts=true -Dtests.file.encoding=Cp1252
    [junit4] ERROR 0.00s J1 | TestSolrConfigHandlerCloud (suite) <<<
    [junit4] > Throwable #1: com.carrotsearch.randomizedtesting.ThreadLeakError: 2 threads leaked from SUITE scope at org.apache.solr.handler.TestSolrConfigHandlerCloud:
    [junit4] > 1) Thread[id=8563, name=Thread-2896, state=TIMED_WAITING, group=TGRP-TestSolrConfigHandlerCloud]
    [junit4] > at java.lang.Thread.sleep(Native Method)
    [junit4] > at org.apache.solr.cloud.ZkSolrResourceLoader.openResource(ZkSolrResourceLoader.java:101)
    [junit4] > at org.apache.solr.core.SolrResourceLoader.openSchema(SolrResourceLoader.java:333)
    [junit4] > at org.apache.solr.schema.IndexSchemaFactory.create(IndexSchemaFactory.java:48)
    [junit4] > at org.apache.solr.schema.IndexSchemaFactory.buildIndexSchema(IndexSchemaFactory.java:75)
    [junit4] > at org.apache.solr.core.ConfigSetService.createIndexSchema(ConfigSetService.java:108)
    [junit4] > at org.apache.solr.core.ConfigSetService.getConfig(ConfigSetService.java:79)
    [junit4] > at org.apache.solr.core.CoreContainer.reload(CoreContainer.java:912)
    [junit4] > at org.apache.solr.core.SolrCore.lambda$getConfListener$6(SolrCore.java:2510)
    [junit4] > at org.apache.solr.core.SolrCore$$Lambda$62/5403071.run(Unknown Source)
    [junit4] > at org.apache.solr.cloud.ZkController$4.run(ZkController.java:2408)
    [junit4] > 2) Thread[id=7744, name=Thread-2747, state=TIMED_WAITING, group=TGRP-TestSolrConfigHandlerCloud]
    [junit4] > at java.lang.Thread.sleep(Native Method)
    [junit4] > at org.apache.solr.cloud.ZkSolrResourceLoader.openResource(ZkSolrResourceLoader.java:101)
    [junit4] > at org.apache.solr.core.SolrResourceLoader.openSchema(SolrResourceLoader.java:333)
    [junit4] > at org.apache.solr.schema.IndexSchemaFactory.create(IndexSchemaFactory.java:48)
    [junit4] > at org.apache.solr.schema.IndexSchemaFactory.buildIndexSchema(IndexSchemaFactory.java:75)
    [junit4] > at org.apache.solr.core.ConfigSetService.createIndexSchema(ConfigSetService.java:108)
    [junit4] > at org.apache.solr.core.ConfigSetService.getConfig(ConfigSetService.java:79)
    [junit4] > at org.apache.solr.core.CoreContainer.reload(CoreContainer.java:912)
    [junit4] > at org.apache.solr.core.SolrCore.lambda$getConfListener$6(SolrCore.java:2510)
    [junit4] > at org.apache.solr.core.SolrCore$$Lambda$62/5403071.run(Unknown Source)
    [junit4] > at org.apache.solr.cloud.ZkController$4.run(ZkController.java:2408)
    [junit4] > at __randomizedtesting.SeedInfo.seed([8BA9A25AF74EB84D]:0)
    [junit4] Completed [274/614 (1!)] on J1 in 64.06s, 1 test, 1 error <<< FAILURES!

[...truncated 1107 lines...]
BUILD FAILED
C:\Users\jenkins\workspace\Lucene-Solr-6.1-Windows\build.xml:740: The following error occurred while executing this line:
C:\Users\jenkins\workspace\Lucene-Solr-6.1-Windows\build.xml:684: The following error occurred while executing this line:
C:\Users\jenkins\workspace\Lucene-Solr-6.1-Windows\build.xml:59: The following error occurred while executing this line:
C:\Users\jenkins\workspace\Lucene-Solr-6.1-Windows\solr\build.xml:233: The following error occurred while executing this line:
C:\Users\jenkins\workspace\Lucene-Solr-6.1-Windows\solr\common-build.xml:531: The following error occurred while executing this line:
C:\Users\jenkins\workspace\Lucene-Solr-6.1-Windows\lucene\common-build.xml:1427: The following error occurred while executing this line:
C:\Users\jenkins\workspace\Lucene-Solr-6.1-Windows\lucene\common-build.xml:984: There were test failures: 614 suites (10 ignored), 2580 tests, 1 suite-level error, 127 ignored (83 assumptions) [seed: 8BA9A25AF74EB84D]

Total time: 85 minutes 20 seconds
Build step 'Invoke Ant' marked build as failure
Archiving artifacts
[WARNINGS] Skipping publisher since build result is FAILURE
Recording test results
Email was triggered for: Failure - Any
Sending email for trigger: Failure - Any

Search Discussions

Discussion Posts

Previous

Follow ups

Related Discussions

Discussion Navigation
viewthread | post
posts ‹ prev | 2 of 4 | next ›
Discussion Overview
groupdev @
categorieslucene
postedJun 15, '16 at 4:38a
activeJun 16, '16 at 2:17p
posts4
users1
websitelucene.apache.org

1 user in discussion

Policeman Jenkins Server: 4 posts

People

Translate

site design / logo © 2017 Grokbase