Grokbase Groups Lucene dev April 2016
FAQ
https://issues.apache.org/jira/browse/SOLR-8992



: Date: Thu, 21 Apr 2016 19:37:16 +0000 (UTC)
: From: Policeman Jenkins Server <jenkins@thetaphi.de>
: Reply-To: dev@lucene.apache.org
: To: noble@apache.org, nknize@apache.org, markrmiller@apache.org,
: jpountz@gmail.com, DaddyWri@gmail.com, dev@lucene.apache.org
: Subject: [JENKINS] Lucene-Solr-master-MacOSX (64bit/jdk1.8.0) - Build # 3224 -
: Still Failing!
:
: Build: http://jenkins.thetaphi.de/job/Lucene-Solr-master-MacOSX/3224/
: Java: 64bit/jdk1.8.0 -XX:+UseCompressedOops -XX:+UseConcMarkSweepGC
:
: 1 tests failed.
: FAILED: org.apache.solr.client.solrj.request.SchemaTest.testSchemaRequestAccuracy
:
: Error Message:
: java.util.LinkedHashMap cannot be cast to org.apache.solr.common.util.NamedList
:
: Stack Trace:
: java.lang.ClassCastException: java.util.LinkedHashMap cannot be cast to org.apache.solr.common.util.NamedList
: at __randomizedtesting.SeedInfo.seed([B07EE1D8472F7C65:3782EE7649D781E2]:0)
: at org.apache.solr.client.solrj.response.schema.SchemaResponse.setResponse(SchemaResponse.java:252)
: at org.apache.solr.client.solrj.SolrRequest.process(SolrRequest.java:149)
: at org.apache.solr.client.solrj.SolrRequest.process(SolrRequest.java:166)
: at org.apache.solr.client.solrj.request.SchemaTest.testSchemaRequestAccuracy(SchemaTest.java:123)
: at sun.reflect.NativeMethodAccessorImpl.invoke0(Native Method)
: at sun.reflect.NativeMethodAccessorImpl.invoke(NativeMethodAccessorImpl.java:62)
: at sun.reflect.DelegatingMethodAccessorImpl.invoke(DelegatingMethodAccessorImpl.java:43)
: at java.lang.reflect.Method.invoke(Method.java:498)
: at com.carrotsearch.randomizedtesting.RandomizedRunner.invoke(RandomizedRunner.java:1764)
: at com.carrotsearch.randomizedtesting.RandomizedRunner$8.evaluate(RandomizedRunner.java:871)
: at com.carrotsearch.randomizedtesting.RandomizedRunner$9.evaluate(RandomizedRunner.java:907)
: at com.carrotsearch.randomizedtesting.RandomizedRunner$10.evaluate(RandomizedRunner.java:921)
: at com.carrotsearch.randomizedtesting.rules.SystemPropertiesRestoreRule$1.evaluate(SystemPropertiesRestoreRule.java:57)
: at org.apache.lucene.util.TestRuleSetupTeardownChained$1.evaluate(TestRuleSetupTeardownChained.java:49)
: at org.apache.lucene.util.AbstractBeforeAfterRule$1.evaluate(AbstractBeforeAfterRule.java:45)
: at org.apache.lucene.util.TestRuleThreadAndTestName$1.evaluate(TestRuleThreadAndTestName.java:48)
: at org.apache.lucene.util.TestRuleIgnoreAfterMaxFailures$1.evaluate(TestRuleIgnoreAfterMaxFailures.java:64)
: at org.apache.lucene.util.TestRuleMarkFailure$1.evaluate(TestRuleMarkFailure.java:47)
: at com.carrotsearch.randomizedtesting.rules.StatementAdapter.evaluate(StatementAdapter.java:36)
: at com.carrotsearch.randomizedtesting.ThreadLeakControl$StatementRunner.run(ThreadLeakControl.java:367)
: at com.carrotsearch.randomizedtesting.ThreadLeakControl.forkTimeoutingTask(ThreadLeakControl.java:809)
: at com.carrotsearch.randomizedtesting.ThreadLeakControl$3.evaluate(ThreadLeakControl.java:460)
: at com.carrotsearch.randomizedtesting.RandomizedRunner.runSingleTest(RandomizedRunner.java:880)
: at com.carrotsearch.randomizedtesting.RandomizedRunner$5.evaluate(RandomizedRunner.java:781)
: at com.carrotsearch.randomizedtesting.RandomizedRunner$6.evaluate(RandomizedRunner.java:816)
: at com.carrotsearch.randomizedtesting.RandomizedRunner$7.evaluate(RandomizedRunner.java:827)
: at com.carrotsearch.randomizedtesting.rules.StatementAdapter.evaluate(StatementAdapter.java:36)
: at com.carrotsearch.randomizedtesting.rules.SystemPropertiesRestoreRule$1.evaluate(SystemPropertiesRestoreRule.java:57)
: at org.apache.lucene.util.AbstractBeforeAfterRule$1.evaluate(AbstractBeforeAfterRule.java:45)
: at com.carrotsearch.randomizedtesting.rules.StatementAdapter.evaluate(StatementAdapter.java:36)
: at org.apache.lucene.util.TestRuleStoreClassName$1.evaluate(TestRuleStoreClassName.java:41)
: at com.carrotsearch.randomizedtesting.rules.NoShadowingOrOverridesOnMethodsRule$1.evaluate(NoShadowingOrOverridesOnMethodsRule.java:40)
: at com.carrotsearch.randomizedtesting.rules.NoShadowingOrOverridesOnMethodsRule$1.evaluate(NoShadowingOrOverridesOnMethodsRule.java:40)
: at com.carrotsearch.randomizedtesting.rules.StatementAdapter.evaluate(StatementAdapter.java:36)
: at com.carrotsearch.randomizedtesting.rules.StatementAdapter.evaluate(StatementAdapter.java:36)
: at com.carrotsearch.randomizedtesting.rules.StatementAdapter.evaluate(StatementAdapter.java:36)
: at org.apache.lucene.util.TestRuleAssertionsRequired$1.evaluate(TestRuleAssertionsRequired.java:53)
: at org.apache.lucene.util.TestRuleMarkFailure$1.evaluate(TestRuleMarkFailure.java:47)
: at org.apache.lucene.util.TestRuleIgnoreAfterMaxFailures$1.evaluate(TestRuleIgnoreAfterMaxFailures.java:64)
: at org.apache.lucene.util.TestRuleIgnoreTestSuites$1.evaluate(TestRuleIgnoreTestSuites.java:54)
: at com.carrotsearch.randomizedtesting.rules.StatementAdapter.evaluate(StatementAdapter.java:36)
: at com.carrotsearch.randomizedtesting.ThreadLeakControl$StatementRunner.run(ThreadLeakControl.java:367)
: at java.lang.Thread.run(Thread.java:745)
:
:
:
:
: Build Log:
: [...truncated 12894 lines...]
: [junit4] Suite: org.apache.solr.client.solrj.request.SchemaTest
: [junit4] 2> Creating dataDir: /Users/jenkins/workspace/Lucene-Solr-master-MacOSX/solr/build/solr-solrj/test/J0/temp/solr.client.solrj.request.SchemaTest_B07EE1D8472F7C65-001/init-core-data-001
: [junit4] 2> 189925 INFO (SUITE-SchemaTest-seed#[B07EE1D8472F7C65]-worker) [ ] o.a.s.SolrTestCaseJ4 Randomized ssl (false) and clientAuth (false)
: [junit4] 2> 189927 INFO (TEST-SchemaTest.testAddDynamicFieldAccuracy-seed#[B07EE1D8472F7C65]) [ ] o.a.s.SolrTestCaseJ4 ###Starting testAddDynamicFieldAccuracy
: [junit4] 2> 189978 INFO (TEST-SchemaTest.testAddDynamicFieldAccuracy-seed#[B07EE1D8472F7C65]) [ ] o.a.s.SolrTestCaseJ4 ####initCore
: [junit4] 2> 189978 INFO (TEST-SchemaTest.testAddDynamicFieldAccuracy-seed#[B07EE1D8472F7C65]) [ ] o.a.s.SolrTestCaseJ4 ####initCore end
: [junit4] 2> 189979 INFO (TEST-SchemaTest.testAddDynamicFieldAccuracy-seed#[B07EE1D8472F7C65]) [ ] o.a.s.SolrTestCaseJ4 Writing core.properties file to /Users/jenkins/workspace/Lucene-Solr-master-MacOSX/solr/build/solr-solrj/test/J0/temp/solr.client.solrj.request.SchemaTest_B07EE1D8472F7C65-001/tempDir-003/cores/core
: [junit4] 2> 189981 INFO (TEST-SchemaTest.testAddDynamicFieldAccuracy-seed#[B07EE1D8472F7C65]) [ ] o.e.j.s.Server jetty-9.3.8.v20160314
: [junit4] 2> 189983 INFO (TEST-SchemaTest.testAddDynamicFieldAccuracy-seed#[B07EE1D8472F7C65]) [ ] o.e.j.s.h.ContextHandler Started o.e.j.s.ServletContextHandler@1ecfa69d{/solr,null,AVAILABLE}
: [junit4] 2> 189986 INFO (TEST-SchemaTest.testAddDynamicFieldAccuracy-seed#[B07EE1D8472F7C65]) [ ] o.e.j.s.ServerConnector Started ServerConnector@6737635{HTTP/1.1,[http/1.1]}{127.0.0.1:55924}
: [junit4] 2> 189986 INFO (TEST-SchemaTest.testAddDynamicFieldAccuracy-seed#[B07EE1D8472F7C65]) [ ] o.e.j.s.Server Started @199853ms
: [junit4] 2> 189986 INFO (TEST-SchemaTest.testAddDynamicFieldAccuracy-seed#[B07EE1D8472F7C65]) [ ] o.a.s.c.s.e.JettySolrRunner Jetty properties: {hostContext=/solr, hostPort=55924, configSetBaseDir=/Users/jenkins/workspace/Lucene-Solr-master-MacOSX/solr/build/solr-solrj/test/J0/temp/solr.client.solrj.request.SchemaTest_B07EE1D8472F7C65-001/tempDir-001, coreRootDirectory=/Users/jenkins/workspace/Lucene-Solr-master-MacOSX/solr/build/solr-solrj/test/J0/temp/solr.client.solrj.request.SchemaTest_B07EE1D8472F7C65-001/tempDir-003/cores}
: [junit4] 2> 189987 INFO (TEST-SchemaTest.testAddDynamicFieldAccuracy-seed#[B07EE1D8472F7C65]) [ ] o.a.s.s.SolrDispatchFilter SolrDispatchFilter.init(): sun.misc.Launcher$AppClassLoader@4554617c
: [junit4] 2> 189987 INFO (TEST-SchemaTest.testAddDynamicFieldAccuracy-seed#[B07EE1D8472F7C65]) [ ] o.a.s.c.SolrResourceLoader new SolrResourceLoader for directory: '/Users/jenkins/workspace/Lucene-Solr-master-MacOSX/solr/build/solr-solrj/test/J0/temp/solr.client.solrj.request.SchemaTest_B07EE1D8472F7C65-001/tempDir-001'
: [junit4] 2> 189987 INFO (TEST-SchemaTest.testAddDynamicFieldAccuracy-seed#[B07EE1D8472F7C65]) [ ] o.a.s.c.SolrResourceLoader JNDI not configured for solr (NoInitialContextEx)
: [junit4] 2> 189987 INFO (TEST-SchemaTest.testAddDynamicFieldAccuracy-seed#[B07EE1D8472F7C65]) [ ] o.a.s.c.SolrResourceLoader using system property solr.solr.home: /Users/jenkins/workspace/Lucene-Solr-master-MacOSX/solr/build/solr-solrj/test/J0/temp/solr.client.solrj.request.SchemaTest_B07EE1D8472F7C65-001/tempDir-001
: [junit4] 2> 189987 INFO (TEST-SchemaTest.testAddDynamicFieldAccuracy-seed#[B07EE1D8472F7C65]) [ ] o.a.s.c.SolrXmlConfig Loading container configuration from /Users/jenkins/workspace/Lucene-Solr-master-MacOSX/solr/build/solr-solrj/test/J0/temp/solr.client.solrj.request.SchemaTest_B07EE1D8472F7C65-001/tempDir-001/solr.xml
: [junit4] 2> 189993 INFO (TEST-SchemaTest.testAddDynamicFieldAccuracy-seed#[B07EE1D8472F7C65]) [ ] o.a.s.c.CorePropertiesLocator Config-defined core root directory: /Users/jenkins/workspace/Lucene-Solr-master-MacOSX/solr/build/solr-solrj/test/J0/temp/solr.client.solrj.request.SchemaTest_B07EE1D8472F7C65-001/tempDir-003/cores
: [junit4] 2> 189993 INFO (TEST-SchemaTest.testAddDynamicFieldAccuracy-seed#[B07EE1D8472F7C65]) [ ] o.a.s.c.CoreContainer New CoreContainer 746538724
: [junit4] 2> 189993 INFO (TEST-SchemaTest.testAddDynamicFieldAccuracy-seed#[B07EE1D8472F7C65]) [ ] o.a.s.c.CoreContainer Loading cores into CoreContainer [instanceDir=/Users/jenkins/workspace/Lucene-Solr-master-MacOSX/solr/build/solr-solrj/test/J0/temp/solr.client.solrj.request.SchemaTest_B07EE1D8472F7C65-001/tempDir-001]
: [junit4] 2> 189993 WARN (TEST-SchemaTest.testAddDynamicFieldAccuracy-seed#[B07EE1D8472F7C65]) [ ] o.a.s.c.CoreContainer Couldn't add files from /Users/jenkins/workspace/Lucene-Solr-master-MacOSX/solr/build/solr-solrj/test/J0/temp/solr.client.solrj.request.SchemaTest_B07EE1D8472F7C65-001/tempDir-001/lib to classpath: /Users/jenkins/workspace/Lucene-Solr-master-MacOSX/solr/build/solr-solrj/test/J0/temp/solr.client.solrj.request.SchemaTest_B07EE1D8472F7C65-001/tempDir-001/lib
: [junit4] 2> 189994 INFO (TEST-SchemaTest.testAddDynamicFieldAccuracy-seed#[B07EE1D8472F7C65]) [ ] o.a.s.h.c.HttpShardHandlerFactory created with socketTimeout : 90000,urlScheme : ,connTimeout : 15000,maxConnectionsPerHost : 20,maxConnections : 10000,corePoolSize : 0,maximumPoolSize : 2147483647,maxThreadIdleTime : 5,sizeOfQueue : -1,fairnessPolicy : false,
: [junit4] 2> 189996 INFO (TEST-SchemaTest.testAddDynamicFieldAccuracy-seed#[B07EE1D8472F7C65]) [ ] o.a.s.u.UpdateShardHandler Creating UpdateShardHandler HTTP client with params:
: [junit4] 2> 189997 INFO (TEST-SchemaTest.testAddDynamicFieldAccuracy-seed#[B07EE1D8472F7C65]) [ ] o.a.s.l.LogWatcher SLF4J impl is org.slf4j.impl.Log4jLoggerFactory
: [junit4] 2> 189997 INFO (TEST-SchemaTest.testAddDynamicFieldAccuracy-seed#[B07EE1D8472F7C65]) [ ] o.a.s.l.LogWatcher Registering Log Listener [Log4j (org.slf4j.impl.Log4jLoggerFactory)]
: [junit4] 2> 189997 INFO (TEST-SchemaTest.testAddDynamicFieldAccuracy-seed#[B07EE1D8472F7C65]) [ ] o.a.s.c.CoreContainer Security conf doesn't exist. Skipping setup for authorization module.
: [junit4] 2> 189997 INFO (TEST-SchemaTest.testAddDynamicFieldAccuracy-seed#[B07EE1D8472F7C65]) [ ] o.a.s.c.CoreContainer No authentication plugin used.
: [junit4] 2> 189998 INFO (TEST-SchemaTest.testAddDynamicFieldAccuracy-seed#[B07EE1D8472F7C65]) [ ] o.a.s.c.CorePropertiesLocator Looking for core definitions underneath /Users/jenkins/workspace/Lucene-Solr-master-MacOSX/solr/build/solr-solrj/test/J0/temp/solr.client.solrj.request.SchemaTest_B07EE1D8472F7C65-001/tempDir-003/cores
: [junit4] 2> 189999 INFO (TEST-SchemaTest.testAddDynamicFieldAccuracy-seed#[B07EE1D8472F7C65]) [ ] o.a.s.c.CoreDescriptor Created CoreDescriptor: {name=collection1, config=solrconfig-managed-schema.xml, loadOnStartup=true, schema=schema.xml, configSetProperties=configsetprops.json, transient=false, dataDir=data/, configSet=collection1}
: [junit4] 2> 189999 INFO (TEST-SchemaTest.testAddDynamicFieldAccuracy-seed#[B07EE1D8472F7C65]) [ ] o.a.s.c.CorePropertiesLocator Found core collection1 in /Users/jenkins/workspace/Lucene-Solr-master-MacOSX/solr/build/solr-solrj/test/J0/temp/solr.client.solrj.request.SchemaTest_B07EE1D8472F7C65-001/tempDir-003/cores/core
: [junit4] 2> 189999 INFO (TEST-SchemaTest.testAddDynamicFieldAccuracy-seed#[B07EE1D8472F7C65]) [ ] o.a.s.c.CorePropertiesLocator Found 1 core definitions
: [junit4] 2> 190000 INFO (coreLoadExecutor-500-thread-1) [ ] o.a.s.c.SolrResourceLoader new SolrResourceLoader for directory: '/Users/jenkins/workspace/Lucene-Solr-master-MacOSX/solr/build/solr-solrj/test/J0/temp/solr.client.solrj.request.SchemaTest_B07EE1D8472F7C65-001/tempDir-001/collection1'
: [junit4] 2> 190000 INFO (TEST-SchemaTest.testAddDynamicFieldAccuracy-seed#[B07EE1D8472F7C65]) [ ] o.a.s.s.SolrDispatchFilter user.dir=/Users/jenkins/workspace/Lucene-Solr-master-MacOSX/solr/build/solr-solrj/test/J0
: [junit4] 2> 190000 INFO (TEST-SchemaTest.testAddDynamicFieldAccuracy-seed#[B07EE1D8472F7C65]) [ ] o.a.s.s.SolrDispatchFilter SolrDispatchFilter.init() done
: [junit4] 2> 190000 INFO (coreLoadExecutor-500-thread-1) [ ] o.a.s.c.SolrResourceLoader JNDI not configured for solr (NoInitialContextEx)
: [junit4] 2> 190000 INFO (coreLoadExecutor-500-thread-1) [ ] o.a.s.c.SolrResourceLoader using system property solr.solr.home: /Users/jenkins/workspace/Lucene-Solr-master-MacOSX/solr/build/solr-solrj/test/J0/temp/solr.client.solrj.request.SchemaTest_B07EE1D8472F7C65-001/tempDir-001
: [junit4] 2> 190010 INFO (coreLoadExecutor-500-thread-1) [ ] o.a.s.c.SolrConfig current version of requestparams : -1
: [junit4] 2> 190011 INFO (coreLoadExecutor-500-thread-1) [ ] o.a.s.c.SolrConfig Using Lucene MatchVersion: 7.0.0
: [junit4] 2> 190014 INFO (coreLoadExecutor-500-thread-1) [ ] o.a.s.c.SolrConfig Loaded SolrConfig: solrconfig-managed-schema.xml
: [junit4] 2> 190024 INFO (coreLoadExecutor-500-thread-1) [ ] o.a.s.s.ManagedIndexSchemaFactory The schema is configured as managed, but managed schema resource managed-schema not found - loading non-managed schema schema.xml instead
: [junit4] 2> 190028 INFO (coreLoadExecutor-500-thread-1) [ ] o.a.s.s.IndexSchema [collection1] Schema name=test
: [junit4] 2> 190071 INFO (coreLoadExecutor-500-thread-1) [ ] o.a.s.s.IndexSchema default search field in schema is text
: [junit4] 2> 190072 INFO (coreLoadExecutor-500-thread-1) [ ] o.a.s.s.IndexSchema unique key field: id
: [junit4] 2> 190072 WARN (coreLoadExecutor-500-thread-1) [ ] o.a.s.s.IndexSchema Field lowerfilt1and2 is not multivalued and destination for multiple copyFields (2)
: [junit4] 2> 190072 WARN (coreLoadExecutor-500-thread-1) [ ] o.a.s.s.IndexSchema Field text is not multivalued and destination for multiple copyFields (3)
: [junit4] 2> 190381 INFO (coreLoadExecutor-500-thread-1) [ ] o.a.s.s.ManagedIndexSchema Upgraded to managed schema at /Users/jenkins/workspace/Lucene-Solr-master-MacOSX/solr/build/solr-solrj/test/J0/temp/solr.client.solrj.request.SchemaTest_B07EE1D8472F7C65-001/tempDir-001/collection1/conf/managed-schema
: [junit4] 2> 190402 INFO (coreLoadExecutor-500-thread-1) [ ] o.a.s.s.ManagedIndexSchemaFactory After upgrading to managed schema, renamed the non-managed schema /Users/jenkins/workspace/Lucene-Solr-master-MacOSX/solr/build/solr-solrj/test/J0/temp/solr.client.solrj.request.SchemaTest_B07EE1D8472F7C65-001/tempDir-001/collection1/conf/schema.xml to /Users/jenkins/workspace/Lucene-Solr-master-MacOSX/solr/build/solr-solrj/test/J0/temp/solr.client.solrj.request.SchemaTest_B07EE1D8472F7C65-001/tempDir-001/collection1/conf/schema.xml.bak
: [junit4] 2> 190406 INFO (coreLoadExecutor-500-thread-1) [ ] o.a.s.c.ConfigSetProperties Did not find ConfigSet properties, assuming default properties: Can't find resource 'configsetprops.json' in classpath or '/Users/jenkins/workspace/Lucene-Solr-master-MacOSX/solr/build/solr-solrj/test/J0/temp/solr.client.solrj.request.SchemaTest_B07EE1D8472F7C65-001/tempDir-001/collection1'
: [junit4] 2> 190406 INFO (coreLoadExecutor-500-thread-1) [ ] o.a.s.c.CoreContainer Creating SolrCore 'collection1' using configuration from configset /Users/jenkins/workspace/Lucene-Solr-master-MacOSX/solr/build/solr-solrj/test/J0/temp/solr.client.solrj.request.SchemaTest_B07EE1D8472F7C65-001/tempDir-001/collection1
: [junit4] 2> 190406 INFO (coreLoadExecutor-500-thread-1) [ x:collection1] o.a.s.c.SolrCore solr.NRTCachingDirectoryFactory
: [junit4] 2> 190409 INFO (coreLoadExecutor-500-thread-1) [ x:collection1] o.a.s.c.SolrCore [[collection1] ] Opening new SolrCore at [/Users/jenkins/workspace/Lucene-Solr-master-MacOSX/solr/build/solr-solrj/test/J0/temp/solr.client.solrj.request.SchemaTest_B07EE1D8472F7C65-001/tempDir-001/collection1], dataDir=[/Users/jenkins/workspace/Lucene-Solr-master-MacOSX/solr/build/solr-solrj/test/J0/temp/solr.client.solrj.request.SchemaTest_B07EE1D8472F7C65-001/tempDir-003/cores/core/data/]
: [junit4] 2> 190409 INFO (coreLoadExecutor-500-thread-1) [ x:collection1] o.a.s.c.SolrCore JMX monitoring not detected for core: collection1
: [junit4] 2> 190409 INFO (coreLoadExecutor-500-thread-1) [ x:collection1] o.a.s.c.CachingDirectoryFactory return new directory for /Users/jenkins/workspace/Lucene-Solr-master-MacOSX/solr/build/solr-solrj/test/J0/temp/solr.client.solrj.request.SchemaTest_B07EE1D8472F7C65-001/tempDir-003/cores/core/data
: [junit4] 2> 190410 INFO (coreLoadExecutor-500-thread-1) [ x:collection1] o.a.s.c.SolrCore New index directory detected: old=null new=/Users/jenkins/workspace/Lucene-Solr-master-MacOSX/solr/build/solr-solrj/test/J0/temp/solr.client.solrj.request.SchemaTest_B07EE1D8472F7C65-001/tempDir-003/cores/core/data/index/
: [junit4] 2> 190410 WARN (coreLoadExecutor-500-thread-1) [ x:collection1] o.a.s.c.SolrCore [collection1] Solr index directory '/Users/jenkins/workspace/Lucene-Solr-master-MacOSX/solr/build/solr-solrj/test/J0/temp/solr.client.solrj.request.SchemaTest_B07EE1D8472F7C65-001/tempDir-003/cores/core/data/index' doesn't exist. Creating new index...
: [junit4] 2> 190410 INFO (coreLoadExecutor-500-thread-1) [ x:collection1] o.a.s.c.CachingDirectoryFactory return new directory for /Users/jenkins/workspace/Lucene-Solr-master-MacOSX/solr/build/solr-solrj/test/J0/temp/solr.client.solrj.request.SchemaTest_B07EE1D8472F7C65-001/tempDir-003/cores/core/data/index
: [junit4] 2> 190446 INFO (coreLoadExecutor-500-thread-1) [ x:collection1] o.a.s.c.SolrDeletionPolicy SolrDeletionPolicy.onCommit: commits: num=1
: [junit4] 2> commit{dir=NRTCachingDirectory(MMapDirectory@/Users/jenkins/workspace/Lucene-Solr-master-MacOSX/solr/build/solr-solrj/test/J0/temp/solr.client.solrj.request.SchemaTest_B07EE1D8472F7C65-001/tempDir-003/cores/core/data/index lockFactory=org.apache.lucene.store.NativeFSLockFactory@40543ed1; maxCacheMB=48.0 maxMergeSizeMB=4.0),segFN=segments_1,generation=1}
: [junit4] 2> 190447 INFO (coreLoadExecutor-500-thread-1) [ x:collection1] o.a.s.c.SolrDeletionPolicy newest commit generation = 1
: [junit4] 2> 190448 INFO (OldIndexDirectoryCleanupThreadForCore-collection1) [ x:collection1] o.a.s.c.SolrCore Looking for old index directories to cleanup for core collection1 in /Users/jenkins/workspace/Lucene-Solr-master-MacOSX/solr/build/solr-solrj/test/J0/temp/solr.client.solrj.request.SchemaTest_B07EE1D8472F7C65-001/tempDir-003/cores/core/data/
: [junit4] 2> 190450 INFO (coreLoadExecutor-500-thread-1) [ x:collection1] o.a.s.c.SolrCore no updateRequestProcessorChain defined as default, creating implicit default
: [junit4] 2> 190453 INFO (coreLoadExecutor-500-thread-1) [ x:collection1] o.a.s.h.l.XMLLoader xsltCacheLifetimeSeconds=60
: [junit4] 2> 190454 INFO (coreLoadExecutor-500-thread-1) [ x:collection1] o.a.s.h.l.XMLLoader xsltCacheLifetimeSeconds=60
: [junit4] 2> 190454 INFO (coreLoadExecutor-500-thread-1) [ x:collection1] o.a.s.h.l.XMLLoader xsltCacheLifetimeSeconds=60
: [junit4] 2> 190648 INFO (coreLoadExecutor-500-thread-1) [ x:collection1] o.a.s.h.l.XMLLoader xsltCacheLifetimeSeconds=60
: [junit4] 2> 190650 INFO (coreLoadExecutor-500-thread-1) [ x:collection1] o.a.s.c.RequestHandlers Registered paths: /admin/mbeans,/update/csv,/sql,/update/json/docs,/admin/luke,/export,/admin/segments,/get,/admin/system,/replication,/admin/properties,/config,/stream,/schema,/admin/plugins,/admin/logging,/update/json,/admin/ping,/admin/threads,/update,/admin/file
: [junit4] 2> 190650 WARN (coreLoadExecutor-500-thread-1) [ x:collection1] o.a.s.c.RequestHandlers no default request handler is registered (either '/select' or 'standard')
: [junit4] 2> 190650 INFO (coreLoadExecutor-500-thread-1) [ x:collection1] o.a.s.c.SolrCore Using default statsCache cache: org.apache.solr.search.stats.LocalStatsCache
: [junit4] 2> 190650 INFO (coreLoadExecutor-500-thread-1) [ x:collection1] o.a.s.u.CommitTracker Hard AutoCommit: disabled
: [junit4] 2> 190650 INFO (coreLoadExecutor-500-thread-1) [ x:collection1] o.a.s.u.CommitTracker Soft AutoCommit: disabled
: [junit4] 2> 190663 INFO (coreLoadExecutor-500-thread-1) [ x:collection1] o.a.s.c.SolrDeletionPolicy SolrDeletionPolicy.onInit: commits: num=1
: [junit4] 2> commit{dir=NRTCachingDirectory(MMapDirectory@/Users/jenkins/workspace/Lucene-Solr-master-MacOSX/solr/build/solr-solrj/test/J0/temp/solr.client.solrj.request.SchemaTest_B07EE1D8472F7C65-001/tempDir-003/cores/core/data/index lockFactory=org.apache.lucene.store.NativeFSLockFactory@40543ed1; maxCacheMB=48.0 maxMergeSizeMB=4.0),segFN=segments_1,generation=1}
: [junit4] 2> 190663 INFO (coreLoadExecutor-500-thread-1) [ x:collection1] o.a.s.c.SolrDeletionPolicy newest commit generation = 1
: [junit4] 2> 190663 INFO (coreLoadExecutor-500-thread-1) [ x:collection1] o.a.s.s.SolrIndexSearcher Opening [Searcher@516687e0[collection1] main]
: [junit4] 2> 190663 INFO (coreLoadExecutor-500-thread-1) [ x:collection1] o.a.s.r.ManagedResourceStorage File-based storage initialized to use dir: /Users/jenkins/workspace/Lucene-Solr-master-MacOSX/solr/build/solr-solrj/test/J0/temp/solr.client.solrj.request.SchemaTest_B07EE1D8472F7C65-001/tempDir-001/collection1/conf
: [junit4] 2> 190663 INFO (coreLoadExecutor-500-thread-1) [ x:collection1] o.a.s.r.RestManager Initializing RestManager with initArgs: {storageDir=/Users/jenkins/workspace/Lucene-Solr-master-MacOSX/solr/build/solr-solrj/test/J0/temp/solr.client.solrj.request.SchemaTest_B07EE1D8472F7C65-001/tempDir-001/collection1/conf}
: [junit4] 2> 190663 INFO (coreLoadExecutor-500-thread-1) [ x:collection1] o.a.s.r.ManagedResourceStorage Reading _rest_managed.json using file:dir=/Users/jenkins/workspace/Lucene-Solr-master-MacOSX/solr/build/solr-solrj/test/J0/temp/solr.client.solrj.request.SchemaTest_B07EE1D8472F7C65-001/tempDir-001/collection1/conf
: [junit4] 2> 190664 INFO (coreLoadExecutor-500-thread-1) [ x:collection1] o.a.s.r.RestManager Initializing 0 registered ManagedResources
: [junit4] 2> 190664 INFO (coreLoadExecutor-500-thread-1) [ x:collection1] o.a.s.h.ReplicationHandler Commits will be reserved for 10000
: [junit4] 2> 190664 INFO (coreLoadExecutor-500-thread-1) [ x:collection1] o.a.s.c.CoreContainer registering core: collection1
: [junit4] 2> 190664 INFO (searcherExecutor-501-thread-1-processing-x:collection1) [ x:collection1] o.a.s.c.SolrCore [collection1] Registered new searcher Searcher@516687e0[collection1] main{ExitableDirectoryReader(UninvertingDirectoryReader())}
: [junit4] 2> 191015 INFO (TEST-SchemaTest.testAddDynamicFieldAccuracy-seed#[B07EE1D8472F7C65]) [ ] o.a.s.SolrJettyTestBase Jetty Assigned Port#55924
: [junit4] 2> 191053 INFO (qtp894144361-1172) [ x:collection1] o.a.s.c.S.Request [collection1] webapp=/solr path=/schema/dynamicfields params={wt=javabin&version=2} status=0 QTime=1
: [junit4] 2> 191308 INFO (qtp894144361-1173) [ x:collection1] o.a.s.s.ManagedIndexSchema Upgraded to managed schema at /Users/jenkins/workspace/Lucene-Solr-master-MacOSX/solr/build/solr-solrj/test/J0/temp/solr.client.solrj.request.SchemaTest_B07EE1D8472F7C65-001/tempDir-001/collection1/conf/managed-schema
: [junit4] 2> 191331 INFO (qtp894144361-1173) [ x:collection1] o.a.s.c.S.Request [collection1] webapp=/solr path=/schema params={wt=javabin&version=2} status=0 QTime=238
: [junit4] 2> 191333 INFO (qtp894144361-1174) [ x:collection1] o.a.s.c.S.Request [collection1] webapp=/solr path=/schema/dynamicfields params={wt=javabin&version=2} status=0 QTime=0
: [junit4] 2> 191338 INFO (qtp894144361-1175) [ x:collection1] o.a.s.c.S.Request [collection1] webapp=/solr path=/schema/dynamicfields/*_acc params={wt=javabin&version=2} status=0 QTime=0
: [junit4] 2> 191343 INFO (TEST-SchemaTest.testAddDynamicFieldAccuracy-seed#[B07EE1D8472F7C65]) [ ] o.e.j.s.ServerConnector Stopped ServerConnector@6737635{HTTP/1.1,[http/1.1]}{127.0.0.1:0}
: [junit4] 2> 191343 INFO (TEST-SchemaTest.testAddDynamicFieldAccuracy-seed#[B07EE1D8472F7C65]) [ ] o.a.s.c.CoreContainer Shutting down CoreContainer instance=746538724
: [junit4] 2> 191344 INFO (coreCloseExecutor-505-thread-1) [ x:collection1] o.a.s.c.SolrCore [collection1] CLOSING SolrCore org.apache.solr.core.SolrCore@6823ec0a
: [junit4] 2> 191344 INFO (coreCloseExecutor-505-thread-1) [ x:collection1] o.a.s.u.DirectUpdateHandler2 closing DirectUpdateHandler2{commits=0,autocommits=0,soft autocommits=0,optimizes=0,rollbacks=0,expungeDeletes=0,docsPending=0,adds=0,deletesById=0,deletesByQuery=0,errors=0,cumulative_adds=0,cumulative_deletesById=0,cumulative_deletesByQuery=0,cumulative_errors=0}
: [junit4] 2> 191345 INFO (coreCloseExecutor-505-thread-1) [ x:collection1] o.a.s.u.SolrCoreState Closing SolrCoreState
: [junit4] 2> 191345 INFO (coreCloseExecutor-505-thread-1) [ x:collection1] o.a.s.u.DefaultSolrCoreState SolrCoreState ref count has reached 0 - closing IndexWriter
: [junit4] 2> 191345 INFO (coreCloseExecutor-505-thread-1) [ x:collection1] o.a.s.u.DefaultSolrCoreState closing IndexWriter with IndexWriterCloser
: [junit4] 2> 191347 INFO (coreCloseExecutor-505-thread-1) [ x:collection1] o.a.s.c.SolrCore [collection1] Closing main searcher on request.
: [junit4] 2> 191347 INFO (coreCloseExecutor-505-thread-1) [ x:collection1] o.a.s.c.CachingDirectoryFactory Closing NRTCachingDirectoryFactory - 2 directories currently being tracked
: [junit4] 2> 191347 INFO (coreCloseExecutor-505-thread-1) [ x:collection1] o.a.s.c.CachingDirectoryFactory looking to close /Users/jenkins/workspace/Lucene-Solr-master-MacOSX/solr/build/solr-solrj/test/J0/temp/solr.client.solrj.request.SchemaTest_B07EE1D8472F7C65-001/tempDir-003/cores/core/data [CachedDir<<refCount=0;path=/Users/jenkins/workspace/Lucene-Solr-master-MacOSX/solr/build/solr-solrj/test/J0/temp/solr.client.solrj.request.SchemaTest_B07EE1D8472F7C65-001/tempDir-003/cores/core/data;done=false>>]
: [junit4] 2> 191347 INFO (coreCloseExecutor-505-thread-1) [ x:collection1] o.a.s.c.CachingDirectoryFactory Closing directory, CoreContainer#isShutdown=true
: [junit4] 2> 191347 INFO (coreCloseExecutor-505-thread-1) [ x:collection1] o.a.s.c.CachingDirectoryFactory Closing directory: /Users/jenkins/workspace/Lucene-Solr-master-MacOSX/solr/build/solr-solrj/test/J0/temp/solr.client.solrj.request.SchemaTest_B07EE1D8472F7C65-001/tempDir-003/cores/core/data
: [junit4] 2> 191347 INFO (coreCloseExecutor-505-thread-1) [ x:collection1] o.a.s.c.CachingDirectoryFactory looking to close /Users/jenkins/workspace/Lucene-Solr-master-MacOSX/solr/build/solr-solrj/test/J0/temp/solr.client.solrj.request.SchemaTest_B07EE1D8472F7C65-001/tempDir-003/cores/core/data/index [CachedDir<<refCount=0;path=/Users/jenkins/workspace/Lucene-Solr-master-MacOSX/solr/build/solr-solrj/test/J0/temp/solr.client.solrj.request.SchemaTest_B07EE1D8472F7C65-001/tempDir-003/cores/core/data/index;done=false>>]
: [junit4] 2> 191347 INFO (coreCloseExecutor-505-thread-1) [ x:collection1] o.a.s.c.CachingDirectoryFactory Closing directory, CoreContainer#isShutdown=true
: [junit4] 2> 191347 INFO (coreCloseExecutor-505-thread-1) [ x:collection1] o.a.s.c.CachingDirectoryFactory Closing directory: /Users/jenkins/workspace/Lucene-Solr-master-MacOSX/solr/build/solr-solrj/test/J0/temp/solr.client.solrj.request.SchemaTest_B07EE1D8472F7C65-001/tempDir-003/cores/core/data/index
: [junit4] 2> 191348 INFO (TEST-SchemaTest.testAddDynamicFieldAccuracy-seed#[B07EE1D8472F7C65]) [ ] o.e.j.s.h.ContextHandler Stopped o.e.j.s.ServletContextHandler@1ecfa69d{/solr,null,UNAVAILABLE}
: [junit4] 2> 191349 INFO (TEST-SchemaTest.testAddDynamicFieldAccuracy-seed#[B07EE1D8472F7C65]) [ ] o.a.s.SolrTestCaseJ4 ###Ending testAddDynamicFieldAccuracy
: [junit4] 2> 191351 INFO (TEST-SchemaTest.testAddFieldAccuracy-seed#[B07EE1D8472F7C65]) [ ] o.a.s.SolrTestCaseJ4 ###Starting testAddFieldAccuracy
: [junit4] 2> 191420 INFO (TEST-SchemaTest.testAddFieldAccuracy-seed#[B07EE1D8472F7C65]) [ ] o.a.s.SolrTestCaseJ4 ####initCore
: [junit4] 2> 191420 INFO (TEST-SchemaTest.testAddFieldAccuracy-seed#[B07EE1D8472F7C65]) [ ] o.a.s.SolrTestCaseJ4 ####initCore end
: [junit4] 2> 191420 INFO (TEST-SchemaTest.testAddFieldAccuracy-seed#[B07EE1D8472F7C65]) [ ] o.a.s.SolrTestCaseJ4 Writing core.properties file to /Users/jenkins/workspace/Lucene-Solr-master-MacOSX/solr/build/solr-solrj/test/J0/temp/solr.client.solrj.request.SchemaTest_B07EE1D8472F7C65-001/tempDir-006/cores/core
: [junit4] 2> 191423 INFO (TEST-SchemaTest.testAddFieldAccuracy-seed#[B07EE1D8472F7C65]) [ ] o.e.j.s.Server jetty-9.3.8.v20160314
: [junit4] 2> 191425 INFO (TEST-SchemaTest.testAddFieldAccuracy-seed#[B07EE1D8472F7C65]) [ ] o.e.j.s.h.ContextHandler Started o.e.j.s.ServletContextHandler@706255ee{/solr,null,AVAILABLE}
: [junit4] 2> 191425 INFO (TEST-SchemaTest.testAddFieldAccuracy-seed#[B07EE1D8472F7C65]) [ ] o.e.j.s.ServerConnector Started ServerConnector@61b8f670{HTTP/1.1,[http/1.1]}{127.0.0.1:55926}
: [junit4] 2> 191425 INFO (TEST-SchemaTest.testAddFieldAccuracy-seed#[B07EE1D8472F7C65]) [ ] o.e.j.s.Server Started @201292ms
: [junit4] 2> 191425 INFO (TEST-SchemaTest.testAddFieldAccuracy-seed#[B07EE1D8472F7C65]) [ ] o.a.s.c.s.e.JettySolrRunner Jetty properties: {hostContext=/solr, hostPort=55926, configSetBaseDir=/Users/jenkins/workspace/Lucene-Solr-master-MacOSX/solr/build/solr-solrj/test/J0/temp/solr.client.solrj.request.SchemaTest_B07EE1D8472F7C65-001/tempDir-004, coreRootDirectory=/Users/jenkins/workspace/Lucene-Solr-master-MacOSX/solr/build/solr-solrj/test/J0/temp/solr.client.solrj.request.SchemaTest_B07EE1D8472F7C65-001/tempDir-006/cores}
: [junit4] 2> 191426 INFO (TEST-SchemaTest.testAddFieldAccuracy-seed#[B07EE1D8472F7C65]) [ ] o.a.s.s.SolrDispatchFilter SolrDispatchFilter.init(): sun.misc.Launcher$AppClassLoader@4554617c
: [junit4] 2> 191426 INFO (TEST-SchemaTest.testAddFieldAccuracy-seed#[B07EE1D8472F7C65]) [ ] o.a.s.c.SolrResourceLoader new SolrResourceLoader for directory: '/Users/jenkins/workspace/Lucene-Solr-master-MacOSX/solr/build/solr-solrj/test/J0/temp/solr.client.solrj.request.SchemaTest_B07EE1D8472F7C65-001/tempDir-004'
: [junit4] 2> 191426 INFO (TEST-SchemaTest.testAddFieldAccuracy-seed#[B07EE1D8472F7C65]) [ ] o.a.s.c.SolrResourceLoader JNDI not configured for solr (NoInitialContextEx)
: [junit4] 2> 191426 INFO (TEST-SchemaTest.testAddFieldAccuracy-seed#[B07EE1D8472F7C65]) [ ] o.a.s.c.SolrResourceLoader using system property solr.solr.home: /Users/jenkins/workspace/Lucene-Solr-master-MacOSX/solr/build/solr-solrj/test/J0/temp/solr.client.solrj.request.SchemaTest_B07EE1D8472F7C65-001/tempDir-004
: [junit4] 2> 191426 INFO (TEST-SchemaTest.testAddFieldAccuracy-seed#[B07EE1D8472F7C65]) [ ] o.a.s.c.SolrXmlConfig Loading container configuration from /Users/jenkins/workspace/Lucene-Solr-master-MacOSX/solr/build/solr-solrj/test/J0/temp/solr.client.solrj.request.SchemaTest_B07EE1D8472F7C65-001/tempDir-004/solr.xml
: [junit4] 2> 191437 INFO (TEST-SchemaTest.testAddFieldAccuracy-seed#[B07EE1D8472F7C65]) [ ] o.a.s.c.CorePropertiesLocator Config-defined core root directory: /Users/jenkins/workspace/Lucene-Solr-master-MacOSX/solr/build/solr-solrj/test/J0/temp/solr.client.solrj.request.SchemaTest_B07EE1D8472F7C65-001/tempDir-006/cores
: [junit4] 2> 191437 INFO (TEST-SchemaTest.testAddFieldAccuracy-seed#[B07EE1D8472F7C65]) [ ] o.a.s.c.CoreContainer New CoreContainer 1505691059
: [junit4] 2> 191438 INFO (TEST-SchemaTest.testAddFieldAccuracy-seed#[B07EE1D8472F7C65]) [ ] o.a.s.c.CoreContainer Loading cores into CoreContainer [instanceDir=/Users/jenkins/workspace/Lucene-Solr-master-MacOSX/solr/build/solr-solrj/test/J0/temp/solr.client.solrj.request.SchemaTest_B07EE1D8472F7C65-001/tempDir-004]
: [junit4] 2> 191439 WARN (TEST-SchemaTest.testAddFieldAccuracy-seed#[B07EE1D8472F7C65]) [ ] o.a.s.c.CoreContainer Couldn't add files from /Users/jenkins/workspace/Lucene-Solr-master-MacOSX/solr/build/solr-solrj/test/J0/temp/solr.client.solrj.request.SchemaTest_B07EE1D8472F7C65-001/tempDir-004/lib to classpath: /Users/jenkins/workspace/Lucene-Solr-master-MacOSX/solr/build/solr-solrj/test/J0/temp/solr.client.solrj.request.SchemaTest_B07EE1D8472F7C65-001/tempDir-004/lib
: [junit4] 2> 191439 INFO (TEST-SchemaTest.testAddFieldAccuracy-seed#[B07EE1D8472F7C65]) [ ] o.a.s.h.c.HttpShardHandlerFactory created with socketTimeout : 90000,urlScheme : ,connTimeout : 15000,maxConnectionsPerHost : 20,maxConnections : 10000,corePoolSize : 0,maximumPoolSize : 2147483647,maxThreadIdleTime : 5,sizeOfQueue : -1,fairnessPolicy : false,
: [junit4] 2> 191442 INFO (TEST-SchemaTest.testAddFieldAccuracy-seed#[B07EE1D8472F7C65]) [ ] o.a.s.u.UpdateShardHandler Creating UpdateShardHandler HTTP client with params:
: [junit4] 2> 191442 INFO (TEST-SchemaTest.testAddFieldAccuracy-seed#[B07EE1D8472F7C65]) [ ] o.a.s.l.LogWatcher SLF4J impl is org.slf4j.impl.Log4jLoggerFactory
: [junit4] 2> 191442 INFO (TEST-SchemaTest.testAddFieldAccuracy-seed#[B07EE1D8472F7C65]) [ ] o.a.s.l.LogWatcher Registering Log Listener [Log4j (org.slf4j.impl.Log4jLoggerFactory)]
: [junit4] 2> 191442 INFO (TEST-SchemaTest.testAddFieldAccuracy-seed#[B07EE1D8472F7C65]) [ ] o.a.s.c.CoreContainer Security conf doesn't exist. Skipping setup for authorization module.
: [junit4] 2> 191442 INFO (TEST-SchemaTest.testAddFieldAccuracy-seed#[B07EE1D8472F7C65]) [ ] o.a.s.c.CoreContainer No authentication plugin used.
: [junit4] 2> 191444 INFO (TEST-SchemaTest.testAddFieldAccuracy-seed#[B07EE1D8472F7C65]) [ ] o.a.s.c.CorePropertiesLocator Looking for core definitions underneath /Users/jenkins/workspace/Lucene-Solr-master-MacOSX/solr/build/solr-solrj/test/J0/temp/solr.client.solrj.request.SchemaTest_B07EE1D8472F7C65-001/tempDir-006/cores
: [junit4] 2> 191445 INFO (TEST-SchemaTest.testAddFieldAccuracy-seed#[B07EE1D8472F7C65]) [ ] o.a.s.c.CoreDescriptor Created CoreDescriptor: {name=collection1, config=solrconfig-managed-schema.xml, loadOnStartup=true, schema=schema.xml, configSetProperties=configsetprops.json, transient=false, dataDir=data/, configSet=collection1}
: [junit4] 2> 191445 INFO (TEST-SchemaTest.testAddFieldAccuracy-seed#[B07EE1D8472F7C65]) [ ] o.a.s.c.CorePropertiesLocator Found core collection1 in /Users/jenkins/workspace/Lucene-Solr-master-MacOSX/solr/build/solr-solrj/test/J0/temp/solr.client.solrj.request.SchemaTest_B07EE1D8472F7C65-001/tempDir-006/cores/core
: [junit4] 2> 191445 INFO (TEST-SchemaTest.testAddFieldAccuracy-seed#[B07EE1D8472F7C65]) [ ] o.a.s.c.CorePropertiesLocator Found 1 core definitions
: [junit4] 2> 191445 INFO (coreLoadExecutor-512-thread-1) [ ] o.a.s.c.SolrResourceLoader new SolrResourceLoader for directory: '/Users/jenkins/workspace/Lucene-Solr-master-MacOSX/solr/build/solr-solrj/test/J0/temp/solr.client.solrj.request.SchemaTest_B07EE1D8472F7C65-001/tempDir-004/collection1'
: [junit4] 2> 191446 INFO (TEST-SchemaTest.testAddFieldAccuracy-seed#[B07EE1D8472F7C65]) [ ] o.a.s.s.SolrDispatchFilter user.dir=/Users/jenkins/workspace/Lucene-Solr-master-MacOSX/solr/build/solr-solrj/test/J0
: [junit4] 2> 191446 INFO (TEST-SchemaTest.testAddFieldAccuracy-seed#[B07EE1D8472F7C65]) [ ] o.a.s.s.SolrDispatchFilter SolrDispatchFilter.init() done
: [junit4] 2> 191446 INFO (coreLoadExecutor-512-thread-1) [ ] o.a.s.c.SolrResourceLoader JNDI not configured for solr (NoInitialContextEx)
: [junit4] 2> 191446 INFO (coreLoadExecutor-512-thread-1) [ ] o.a.s.c.SolrResourceLoader using system property solr.solr.home: /Users/jenkins/workspace/Lucene-Solr-master-MacOSX/solr/build/solr-solrj/test/J0/temp/solr.client.solrj.request.SchemaTest_B07EE1D8472F7C65-001/tempDir-004
: [junit4] 2> 191456 INFO (coreLoadExecutor-512-thread-1) [ ] o.a.s.c.SolrConfig current version of requestparams : -1
: [junit4] 2> 191457 INFO (coreLoadExecutor-512-thread-1) [ ] o.a.s.c.SolrConfig Using Lucene MatchVersion: 7.0.0
: [junit4] 2> 191465 INFO (coreLoadExecutor-512-thread-1) [ ] o.a.s.c.SolrConfig Loaded SolrConfig: solrconfig-managed-schema.xml
: [junit4] 2> 191469 INFO (coreLoadExecutor-512-thread-1) [ ] o.a.s.s.ManagedIndexSchemaFactory The schema is configured as managed, but managed schema resource managed-schema not found - loading non-managed schema schema.xml instead
: [junit4] 2> 191472 INFO (coreLoadExecutor-512-thread-1) [ ] o.a.s.s.IndexSchema [collection1] Schema name=test
: [junit4] 2> 191515 INFO (coreLoadExecutor-512-thread-1) [ ] o.a.s.s.IndexSchema default search field in schema is text
: [junit4] 2> 191515 INFO (coreLoadExecutor-512-thread-1) [ ] o.a.s.s.IndexSchema unique key field: id
: [junit4] 2> 191516 WARN (coreLoadExecutor-512-thread-1) [ ] o.a.s.s.IndexSchema Field lowerfilt1and2 is not multivalued and destination for multiple copyFields (2)
: [junit4] 2> 191516 WARN (coreLoadExecutor-512-thread-1) [ ] o.a.s.s.IndexSchema Field text is not multivalued and destination for multiple copyFields (3)
: [junit4] 2> 191518 INFO (coreLoadExecutor-512-thread-1) [ ] o.a.s.s.ManagedIndexSchema Upgraded to managed schema at /Users/jenkins/workspace/Lucene-Solr-master-MacOSX/solr/build/solr-solrj/test/J0/temp/solr.client.solrj.request.SchemaTest_B07EE1D8472F7C65-001/tempDir-004/collection1/conf/managed-schema
: [junit4] 2> 191541 INFO (coreLoadExecutor-512-thread-1) [ ] o.a.s.s.ManagedIndexSchemaFactory After upgrading to managed schema, renamed the non-managed schema /Users/jenkins/workspace/Lucene-Solr-master-MacOSX/solr/build/solr-solrj/test/J0/temp/solr.client.solrj.request.SchemaTest_B07EE1D8472F7C65-001/tempDir-004/collection1/conf/schema.xml to /Users/jenkins/workspace/Lucene-Solr-master-MacOSX/solr/build/solr-solrj/test/J0/temp/solr.client.solrj.request.SchemaTest_B07EE1D8472F7C65-001/tempDir-004/collection1/conf/schema.xml.bak
: [junit4] 2> 191544 INFO (coreLoadExecutor-512-thread-1) [ ] o.a.s.c.ConfigSetProperties Did not find ConfigSet properties, assuming default properties: Can't find resource 'configsetprops.json' in classpath or '/Users/jenkins/workspace/Lucene-Solr-master-MacOSX/solr/build/solr-solrj/test/J0/temp/solr.client.solrj.request.SchemaTest_B07EE1D8472F7C65-001/tempDir-004/collection1'
: [junit4] 2> 191545 INFO (coreLoadExecutor-512-thread-1) [ ] o.a.s.c.CoreContainer Creating SolrCore 'collection1' using configuration from configset /Users/jenkins/workspace/Lucene-Solr-master-MacOSX/solr/build/solr-solrj/test/J0/temp/solr.client.solrj.request.SchemaTest_B07EE1D8472F7C65-001/tempDir-004/collection1
: [junit4] 2> 191545 INFO (coreLoadExecutor-512-thread-1) [ x:collection1] o.a.s.c.SolrCore solr.NRTCachingDirectoryFactory
: [junit4] 2> 191545 INFO (coreLoadExecutor-512-thread-1) [ x:collection1] o.a.s.c.SolrCore [[collection1] ] Opening new SolrCore at [/Users/jenkins/workspace/Lucene-Solr-master-MacOSX/solr/build/solr-solrj/test/J0/temp/solr.client.solrj.request.SchemaTest_B07EE1D8472F7C65-001/tempDir-004/collection1], dataDir=[/Users/jenkins/workspace/Lucene-Solr-master-MacOSX/solr/build/solr-solrj/test/J0/temp/solr.client.solrj.request.SchemaTest_B07EE1D8472F7C65-001/tempDir-006/cores/core/data/]
: [junit4] 2> 191545 INFO (coreLoadExecutor-512-thread-1) [ x:collection1] o.a.s.c.SolrCore JMX monitoring not detected for core: collection1
: [junit4] 2> 191546 INFO (coreLoadExecutor-512-thread-1) [ x:collection1] o.a.s.c.CachingDirectoryFactory return new directory for /Users/jenkins/workspace/Lucene-Solr-master-MacOSX/solr/build/solr-solrj/test/J0/temp/solr.client.solrj.request.SchemaTest_B07EE1D8472F7C65-001/tempDir-006/cores/core/data
: [junit4] 2> 191546 INFO (coreLoadExecutor-512-thread-1) [ x:collection1] o.a.s.c.SolrCore New index directory detected: old=null new=/Users/jenkins/workspace/Lucene-Solr-master-MacOSX/solr/build/solr-solrj/test/J0/temp/solr.client.solrj.request.SchemaTest_B07EE1D8472F7C65-001/tempDir-006/cores/core/data/index/
: [junit4] 2> 191546 WARN (coreLoadExecutor-512-thread-1) [ x:collection1] o.a.s.c.SolrCore [collection1] Solr index directory '/Users/jenkins/workspace/Lucene-Solr-master-MacOSX/solr/build/solr-solrj/test/J0/temp/solr.client.solrj.request.SchemaTest_B07EE1D8472F7C65-001/tempDir-006/cores/core/data/index' doesn't exist. Creating new index...
: [junit4] 2> 191547 INFO (coreLoadExecutor-512-thread-1) [ x:collection1] o.a.s.c.CachingDirectoryFactory return new directory for /Users/jenkins/workspace/Lucene-Solr-master-MacOSX/solr/build/solr-solrj/test/J0/temp/solr.client.solrj.request.SchemaTest_B07EE1D8472F7C65-001/tempDir-006/cores/core/data/index
: [junit4] 2> 191578 INFO (coreLoadExecutor-512-thread-1) [ x:collection1] o.a.s.c.SolrDeletionPolicy SolrDeletionPolicy.onCommit: commits: num=1
: [junit4] 2> commit{dir=NRTCachingDirectory(MMapDirectory@/Users/jenkins/workspace/Lucene-Solr-master-MacOSX/solr/build/solr-solrj/test/J0/temp/solr.client.solrj.request.SchemaTest_B07EE1D8472F7C65-001/tempDir-006/cores/core/data/index lockFactory=org.apache.lucene.store.NativeFSLockFactory@40543ed1; maxCacheMB=48.0 maxMergeSizeMB=4.0),segFN=segments_1,generation=1}
: [junit4] 2> 191578 INFO (coreLoadExecutor-512-thread-1) [ x:collection1] o.a.s.c.SolrDeletionPolicy newest commit generation = 1
: [junit4] 2> 191579 INFO (OldIndexDirectoryCleanupThreadForCore-collection1) [ x:collection1] o.a.s.c.SolrCore Looking for old index directories to cleanup for core collection1 in /Users/jenkins/workspace/Lucene-Solr-master-MacOSX/solr/build/solr-solrj/test/J0/temp/solr.client.solrj.request.SchemaTest_B07EE1D8472F7C65-001/tempDir-006/cores/core/data/
: [junit4] 2> 191581 INFO (coreLoadExecutor-512-thread-1) [ x:collection1] o.a.s.c.SolrCore no updateRequestProcessorChain defined as default, creating implicit default
: [junit4] 2> 191584 INFO (coreLoadExecutor-512-thread-1) [ x:collection1] o.a.s.h.l.XMLLoader xsltCacheLifetimeSeconds=60
: [junit4] 2> 191584 INFO (coreLoadExecutor-512-thread-1) [ x:collection1] o.a.s.h.l.XMLLoader xsltCacheLifetimeSeconds=60
: [junit4] 2> 191585 INFO (coreLoadExecutor-512-thread-1) [ x:collection1] o.a.s.h.l.XMLLoader xsltCacheLifetimeSeconds=60
: [junit4] 2> 191586 INFO (coreLoadExecutor-512-thread-1) [ x:collection1] o.a.s.h.l.XMLLoader xsltCacheLifetimeSeconds=60
: [junit4] 2> 191587 INFO (coreLoadExecutor-512-thread-1) [ x:collection1] o.a.s.c.RequestHandlers Registered paths: /admin/mbeans,/update/csv,/sql,/update/json/docs,/admin/luke,/export,/admin/segments,/get,/admin/system,/replication,/admin/properties,/config,/stream,/schema,/admin/plugins,/admin/logging,/update/json,/admin/ping,/admin/threads,/update,/admin/file
: [junit4] 2> 191587 WARN (coreLoadExecutor-512-thread-1) [ x:collection1] o.a.s.c.RequestHandlers no default request handler is registered (either '/select' or 'standard')
: [junit4] 2> 191587 INFO (coreLoadExecutor-512-thread-1) [ x:collection1] o.a.s.c.SolrCore Using default statsCache cache: org.apache.solr.search.stats.LocalStatsCache
: [junit4] 2> 191588 INFO (coreLoadExecutor-512-thread-1) [ x:collection1] o.a.s.u.CommitTracker Hard AutoCommit: disabled
: [junit4] 2> 191588 INFO (coreLoadExecutor-512-thread-1) [ x:collection1] o.a.s.u.CommitTracker Soft AutoCommit: disabled
: [junit4] 2> 191590 INFO (coreLoadExecutor-512-thread-1) [ x:collection1] o.a.s.c.SolrDeletionPolicy SolrDeletionPolicy.onInit: commits: num=1
: [junit4] 2> commit{dir=NRTCachingDirectory(MMapDirectory@/Users/jenkins/workspace/Lucene-Solr-master-MacOSX/solr/build/solr-solrj/test/J0/temp/solr.client.solrj.request.SchemaTest_B07EE1D8472F7C65-001/tempDir-006/cores/core/data/index lockFactory=org.apache.lucene.store.NativeFSLockFactory@40543ed1; maxCacheMB=48.0 maxMergeSizeMB=4.0),segFN=segments_1,generation=1}
: [junit4] 2> 191590 INFO (coreLoadExecutor-512-thread-1) [ x:collection1] o.a.s.c.SolrDeletionPolicy newest commit generation = 1
: [junit4] 2> 191590 INFO (coreLoadExecutor-512-thread-1) [ x:collection1] o.a.s.s.SolrIndexSearcher Opening [Searcher@1eee3f9[collection1] main]
: [junit4] 2> 191590 INFO (coreLoadExecutor-512-thread-1) [ x:collection1] o.a.s.r.ManagedResourceStorage File-based storage initialized to use dir: /Users/jenkins/workspace/Lucene-Solr-master-MacOSX/solr/build/solr-solrj/test/J0/temp/solr.client.solrj.request.SchemaTest_B07EE1D8472F7C65-001/tempDir-004/collection1/conf
: [junit4] 2> 191590 INFO (coreLoadExecutor-512-thread-1) [ x:collection1] o.a.s.r.RestManager Initializing RestManager with initArgs: {storageDir=/Users/jenkins/workspace/Lucene-Solr-master-MacOSX/solr/build/solr-solrj/test/J0/temp/solr.client.solrj.request.SchemaTest_B07EE1D8472F7C65-001/tempDir-004/collection1/conf}
: [junit4] 2> 191590 INFO (coreLoadExecutor-512-thread-1) [ x:collection1] o.a.s.r.ManagedResourceStorage Reading _rest_managed.json using file:dir=/Users/jenkins/workspace/Lucene-Solr-master-MacOSX/solr/build/solr-solrj/test/J0/temp/solr.client.solrj.request.SchemaTest_B07EE1D8472F7C65-001/tempDir-004/collection1/conf
: [junit4] 2> 191590 INFO (coreLoadExecutor-512-thread-1) [ x:collection1] o.a.s.r.RestManager Initializing 0 registered ManagedResources
: [junit4] 2> 191590 INFO (coreLoadExecutor-512-thread-1) [ x:collection1] o.a.s.h.ReplicationHandler Commits will be reserved for 10000
: [junit4] 2> 191591 INFO (searcherExecutor-513-thread-1-processing-x:collection1) [ x:collection1] o.a.s.c.SolrCore [collection1] Registered new searcher Searcher@1eee3f9[collection1] main{ExitableDirectoryReader(UninvertingDirectoryReader())}
: [junit4] 2> 191591 INFO (coreLoadExecutor-512-thread-1) [ x:collection1] o.a.s.c.CoreContainer registering core: collection1
: [junit4] 2> 191951 INFO (TEST-SchemaTest.testAddFieldAccuracy-seed#[B07EE1D8472F7C65]) [ ] o.a.s.SolrJettyTestBase Jetty Assigned Port#55926
: [junit4] 2> 191961 INFO (qtp698207286-1194) [ x:collection1] o.a.s.c.S.Request [collection1] webapp=/solr path=/schema/fields params={wt=javabin&version=2} status=0 QTime=0
: [junit4] 2> 191969 INFO (qtp698207286-1195) [ x:collection1] o.a.s.s.ManagedIndexSchema Upgraded to managed schema at /Users/jenkins/workspace/Lucene-Solr-master-MacOSX/solr/build/solr-solrj/test/J0/temp/solr.client.solrj.request.SchemaTest_B07EE1D8472F7C65-001/tempDir-004/collection1/conf/managed-schema
: [junit4] 2> 191984 INFO (qtp698207286-1195) [ x:collection1] o.a.s.c.S.Request [collection1] webapp=/solr path=/schema params={wt=javabin&version=2} status=0 QTime=18
: [junit4] 2> 191986 INFO (qtp698207286-1196) [ x:collection1] o.a.s.c.S.Request [collection1] webapp=/solr path=/schema/fields params={wt=javabin&version=2} status=0 QTime=0
: [junit4] 2> 191990 INFO (qtp698207286-1197) [ x:collection1] o.a.s.c.S.Request [collection1] webapp=/solr path=/schema/fields/accuracyField params={wt=javabin&version=2} status=0 QTime=0
: [junit4] 2> 191992 INFO (TEST-SchemaTest.testAddFieldAccuracy-seed#[B07EE1D8472F7C65]) [ ] o.e.j.s.ServerConnector Stopped ServerConnector@61b8f670{HTTP/1.1,[http/1.1]}{127.0.0.1:0}
: [junit4] 2> 191992 INFO (TEST-SchemaTest.testAddFieldAccuracy-seed#[B07EE1D8472F7C65]) [ ] o.a.s.c.CoreContainer Shutting down CoreContainer instance=1505691059
: [junit4] 2> 191993 INFO (coreCloseExecutor-517-thread-1) [ x:collection1] o.a.s.c.SolrCore [collection1] CLOSING SolrCore org.apache.solr.core.SolrCore@589fdc96
: [junit4] 2> 191993 INFO (coreCloseExecutor-517-thread-1) [ x:collection1] o.a.s.u.DirectUpdateHandler2 closing DirectUpdateHandler2{commits=0,autocommits=0,soft autocommits=0,optimizes=0,rollbacks=0,expungeDeletes=0,docsPending=0,adds=0,deletesById=0,deletesByQuery=0,errors=0,cumulative_adds=0,cumulative_deletesById=0,cumulative_deletesByQuery=0,cumulative_errors=0}
: [junit4] 2> 191994 INFO (coreCloseExecutor-517-thread-1) [ x:collection1] o.a.s.u.SolrCoreState Closing SolrCoreState
: [junit4] 2> 191994 INFO (coreCloseExecutor-517-thread-1) [ x:collection1] o.a.s.u.DefaultSolrCoreState SolrCoreState ref count has reached 0 - closing IndexWriter
: [junit4] 2> 191994 INFO (coreCloseExecutor-517-thread-1) [ x:collection1] o.a.s.u.DefaultSolrCoreState closing IndexWriter with IndexWriterCloser
: [junit4] 2> 191996 INFO (coreCloseExecutor-517-thread-1) [ x:collection1] o.a.s.c.SolrCore [collection1] Closing main searcher on request.
: [junit4] 2> 191997 INFO (coreCloseExecutor-517-thread-1) [ x:collection1] o.a.s.c.CachingDirectoryFactory Closing NRTCachingDirectoryFactory - 2 directories currently being tracked
: [junit4] 2> 191997 INFO (coreCloseExecutor-517-thread-1) [ x:collection1] o.a.s.c.CachingDirectoryFactory looking to close /Users/jenkins/workspace/Lucene-Solr-master-MacOSX/solr/build/solr-solrj/test/J0/temp/solr.client.solrj.request.SchemaTest_B07EE1D8472F7C65-001/tempDir-006/cores/core/data [CachedDir<<refCount=0;path=/Users/jenkins/workspace/Lucene-Solr-master-MacOSX/solr/build/solr-solrj/test/J0/temp/solr.client.solrj.request.SchemaTest_B07EE1D8472F7C65-001/tempDir-006/cores/core/data;done=false>>]
: [junit4] 2> 191997 INFO (coreCloseExecutor-517-thread-1) [ x:collection1] o.a.s.c.CachingDirectoryFactory Closing directory, CoreContainer#isShutdown=true
: [junit4] 2> 191997 INFO (coreCloseExecutor-517-thread-1) [ x:collection1] o.a.s.c.CachingDirectoryFactory Closing directory: /Users/jenkins/workspace/Lucene-Solr-master-MacOSX/solr/build/solr-solrj/test/J0/temp/solr.client.solrj.request.SchemaTest_B07EE1D8472F7C65-001/tempDir-006/cores/core/data
: [junit4] 2> 191997 INFO (coreCloseExecutor-517-thread-1) [ x:collection1] o.a.s.c.CachingDirectoryFactory looking to close /Users/jenkins/workspace/Lucene-Solr-master-MacOSX/solr/build/solr-solrj/test/J0/temp/solr.client.solrj.request.SchemaTest_B07EE1D8472F7C65-001/tempDir-006/cores/core/data/index [CachedDir<<refCount=0;path=/Users/jenkins/workspace/Lucene-Solr-master-MacOSX/solr/build/solr-solrj/test/J0/temp/solr.client.solrj.request.SchemaTest_B07EE1D8472F7C65-001/tempDir-006/cores/core/data/index;done=false>>]
: [junit4] 2> 191997 INFO (coreCloseExecutor-517-thread-1) [ x:collection1] o.a.s.c.CachingDirectoryFactory Closing directory, CoreContainer#isShutdown=true
: [junit4] 2> 191997 INFO (coreCloseExecutor-517-thread-1) [ x:collection1] o.a.s.c.CachingDirectoryFactory Closing directory: /Users/jenkins/workspace/Lucene-Solr-master-MacOSX/solr/build/solr-solrj/test/J0/temp/solr.client.solrj.request.SchemaTest_B07EE1D8472F7C65-001/tempDir-006/cores/core/data/index
: [junit4] 2> 191998 INFO (TEST-SchemaTest.testAddFieldAccuracy-seed#[B07EE1D8472F7C65]) [ ] o.e.j.s.h.ContextHandler Stopped o.e.j.s.ServletContextHandler@706255ee{/solr,null,UNAVAILABLE}
: [junit4] 2> 192000 INFO (TEST-SchemaTest.testAddFieldAccuracy-seed#[B07EE1D8472F7C65]) [ ] o.a.s.SolrTestCaseJ4 ###Ending testAddFieldAccuracy
: [junit4] 2> 192001 INFO (TEST-SchemaTest.addFieldTypeShouldntBeCalledTwiceWithTheSameName-seed#[B07EE1D8472F7C65]) [ ] o.a.s.SolrTestCaseJ4 ###Starting addFieldTypeShouldntBeCalledTwiceWithTheSameName
: [junit4] 2> 192045 INFO (TEST-SchemaTest.addFieldTypeShouldntBeCalledTwiceWithTheSameName-seed#[B07EE1D8472F7C65]) [ ] o.a.s.SolrTestCaseJ4 ####initCore
: [junit4] 2> 192045 INFO (TEST-SchemaTest.addFieldTypeShouldntBeCalledTwiceWithTheSameName-seed#[B07EE1D8472F7C65]) [ ] o.a.s.SolrTestCaseJ4 ####initCore end
: [junit4] 2> 192046 INFO (TEST-SchemaTest.addFieldTypeShouldntBeCalledTwiceWithTheSameName-seed#[B07EE1D8472F7C65]) [ ] o.a.s.SolrTestCaseJ4 Writing core.properties file to /Users/jenkins/workspace/Lucene-Solr-master-MacOSX/solr/build/solr-solrj/test/J0/temp/solr.client.solrj.request.SchemaTest_B07EE1D8472F7C65-001/tempDir-009/cores/core
: [junit4] 2> 192048 INFO (TEST-SchemaTest.addFieldTypeShouldntBeCalledTwiceWithTheSameName-seed#[B07EE1D8472F7C65]) [ ] o.e.j.s.Server jetty-9.3.8.v20160314
: [junit4] 2> 192050 INFO (TEST-SchemaTest.addFieldTypeShouldntBeCalledTwiceWithTheSameName-seed#[B07EE1D8472F7C65]) [ ] o.e.j.s.h.ContextHandler Started o.e.j.s.ServletContextHandler@289a0470{/solr,null,AVAILABLE}
: [junit4] 2> 192051 INFO (TEST-SchemaTest.addFieldTypeShouldntBeCalledTwiceWithTheSameName-seed#[B07EE1D8472F7C65]) [ ] o.e.j.s.ServerConnector Started ServerConnector@b5d160b{HTTP/1.1,[http/1.1]}{127.0.0.1:55928}
: [junit4] 2> 192051 INFO (TEST-SchemaTest.addFieldTypeShouldntBeCalledTwiceWithTheSameName-seed#[B07EE1D8472F7C65]) [ ] o.e.j.s.Server Started @201918ms
: [junit4] 2> 192051 INFO (TEST-SchemaTest.addFieldTypeShouldntBeCalledTwiceWithTheSameName-seed#[B07EE1D8472F7C65]) [ ] o.a.s.c.s.e.JettySolrRunner Jetty properties: {hostContext=/solr, hostPort=55928, configSetBaseDir=/Users/jenkins/workspace/Lucene-Solr-master-MacOSX/solr/build/solr-solrj/test/J0/temp/solr.client.solrj.request.SchemaTest_B07EE1D8472F7C65-001/tempDir-007, coreRootDirectory=/Users/jenkins/workspace/Lucene-Solr-master-MacOSX/solr/build/solr-solrj/test/J0/temp/solr.client.solrj.request.SchemaTest_B07EE1D8472F7C65-001/tempDir-009/cores}
: [junit4] 2> 192052 INFO (TEST-SchemaTest.addFieldTypeShouldntBeCalledTwiceWithTheSameName-seed#[B07EE1D8472F7C65]) [ ] o.a.s.s.SolrDispatchFilter SolrDispatchFilter.init(): sun.misc.Launcher$AppClassLoader@4554617c
: [junit4] 2> 192052 INFO (TEST-SchemaTest.addFieldTypeShouldntBeCalledTwiceWithTheSameName-seed#[B07EE1D8472F7C65]) [ ] o.a.s.c.SolrResourceLoader new SolrResourceLoader for directory: '/Users/jenkins/workspace/Lucene-Solr-master-MacOSX/solr/build/solr-solrj/test/J0/temp/solr.client.solrj.request.SchemaTest_B07EE1D8472F7C65-001/tempDir-007'
: [junit4] 2> 192052 INFO (TEST-SchemaTest.addFieldTypeShouldntBeCalledTwiceWithTheSameName-seed#[B07EE1D8472F7C65]) [ ] o.a.s.c.SolrResourceLoader JNDI not configured for solr (NoInitialContextEx)
: [junit4] 2> 192052 INFO (TEST-SchemaTest.addFieldTypeShouldntBeCalledTwiceWithTheSameName-seed#[B07EE1D8472F7C65]) [ ] o.a.s.c.SolrResourceLoader using system property solr.solr.home: /Users/jenkins/workspace/Lucene-Solr-master-MacOSX/solr/build/solr-solrj/test/J0/temp/solr.client.solrj.request.SchemaTest_B07EE1D8472F7C65-001/tempDir-007
: [junit4] 2> 192052 INFO (TEST-SchemaTest.addFieldTypeShouldntBeCalledTwiceWithTheSameName-seed#[B07EE1D8472F7C65]) [ ] o.a.s.c.SolrXmlConfig Loading container configuration from /Users/jenkins/workspace/Lucene-Solr-master-MacOSX/solr/build/solr-solrj/test/J0/temp/solr.client.solrj.request.SchemaTest_B07EE1D8472F7C65-001/tempDir-007/solr.xml
: [junit4] 2> 192093 INFO (TEST-SchemaTest.addFieldTypeShouldntBeCalledTwiceWithTheSameName-seed#[B07EE1D8472F7C65]) [ ] o.a.s.c.CorePropertiesLocator Config-defined core root directory: /Users/jenkins/workspace/Lucene-Solr-master-MacOSX/solr/build/solr-solrj/test/J0/temp/solr.client.solrj.request.SchemaTest_B07EE1D8472F7C65-001/tempDir-009/cores
: [junit4] 2> 192093 INFO (TEST-SchemaTest.addFieldTypeShouldntBeCalledTwiceWithTheSameName-seed#[B07EE1D8472F7C65]) [ ] o.a.s.c.CoreContainer New CoreContainer 739391931
: [junit4] 2> 192093 INFO (TEST-SchemaTest.addFieldTypeShouldntBeCalledTwiceWithTheSameName-seed#[B07EE1D8472F7C65]) [ ] o.a.s.c.CoreContainer Loading cores into CoreContainer [instanceDir=/Users/jenkins/workspace/Lucene-Solr-master-MacOSX/solr/build/solr-solrj/test/J0/temp/solr.client.solrj.request.SchemaTest_B07EE1D8472F7C65-001/tempDir-007]
: [junit4] 2> 192093 WARN (TEST-SchemaTest.addFieldTypeShouldntBeCalledTwiceWithTheSameName-seed#[B07EE1D8472F7C65]) [ ] o.a.s.c.CoreContainer Couldn't add files from /Users/jenkins/workspace/Lucene-Solr-master-MacOSX/solr/build/solr-solrj/test/J0/temp/solr.client.solrj.request.SchemaTest_B07EE1D8472F7C65-001/tempDir-007/lib to classpath: /Users/jenkins/workspace/Lucene-Solr-master-MacOSX/solr/build/solr-solrj/test/J0/temp/solr.client.solrj.request.SchemaTest_B07EE1D8472F7C65-001/tempDir-007/lib
: [junit4] 2> 192094 INFO (TEST-SchemaTest.addFieldTypeShouldntBeCalledTwiceWithTheSameName-seed#[B07EE1D8472F7C65]) [ ] o.a.s.h.c.HttpShardHandlerFactory created with socketTimeout : 90000,urlScheme : ,connTimeout : 15000,maxConnectionsPerHost : 20,maxConnections : 10000,corePoolSize : 0,maximumPoolSize : 2147483647,maxThreadIdleTime : 5,sizeOfQueue : -1,fairnessPolicy : false,
: [junit4] 2> 192096 INFO (TEST-SchemaTest.addFieldTypeShouldntBeCalledTwiceWithTheSameName-seed#[B07EE1D8472F7C65]) [ ] o.a.s.u.UpdateShardHandler Creating UpdateShardHandler HTTP client with params:
: [junit4] 2> 192096 INFO (TEST-SchemaTest.addFieldTypeShouldntBeCalledTwiceWithTheSameName-seed#[B07EE1D8472F7C65]) [ ] o.a.s.l.LogWatcher SLF4J impl is org.slf4j.impl.Log4jLoggerFactory
: [junit4] 2> 192096 INFO (TEST-SchemaTest.addFieldTypeShouldntBeCalledTwiceWithTheSameName-seed#[B07EE1D8472F7C65]) [ ] o.a.s.l.LogWatcher Registering Log Listener [Log4j (org.slf4j.impl.Log4jLoggerFactory)]
: [junit4] 2> 192096 INFO (TEST-SchemaTest.addFieldTypeShouldntBeCalledTwiceWithTheSameName-seed#[B07EE1D8472F7C65]) [ ] o.a.s.c.CoreContainer Security conf doesn't exist. Skipping setup for authorization module.
: [junit4] 2> 192096 INFO (TEST-SchemaTest.addFieldTypeShouldntBeCalledTwiceWithTheSameName-seed#[B07EE1D8472F7C65]) [ ] o.a.s.c.CoreContainer No authentication plugin used.
: [junit4] 2> 192097 INFO (TEST-SchemaTest.addFieldTypeShouldntBeCalledTwiceWithTheSameName-seed#[B07EE1D8472F7C65]) [ ] o.a.s.c.CorePropertiesLocator Looking for core definitions underneath /Users/jenkins/workspace/Lucene-Solr-master-MacOSX/solr/build/solr-solrj/test/J0/temp/solr.client.solrj.request.SchemaTest_B07EE1D8472F7C65-001/tempDir-009/cores
: [junit4] 2> 192098 INFO (TEST-SchemaTest.addFieldTypeShouldntBeCalledTwiceWithTheSameName-seed#[B07EE1D8472F7C65]) [ ] o.a.s.c.CoreDescriptor Created CoreDescriptor: {name=collection1, config=solrconfig-managed-schema.xml, loadOnStartup=true, schema=schema.xml, configSetProperties=configsetprops.json, transient=false, dataDir=data/, configSet=collection1}
: [junit4] 2> 192099 INFO (TEST-SchemaTest.addFieldTypeShouldntBeCalledTwiceWithTheSameName-seed#[B07EE1D8472F7C65]) [ ] o.a.s.c.CorePropertiesLocator Found core collection1 in /Users/jenkins/workspace/Lucene-Solr-master-MacOSX/solr/build/solr-solrj/test/J0/temp/solr.client.solrj.request.SchemaTest_B07EE1D8472F7C65-001/tempDir-009/cores/core
: [junit4] 2> 192099 INFO (TEST-SchemaTest.addFieldTypeShouldntBeCalledTwiceWithTheSameName-seed#[B07EE1D8472F7C65]) [ ] o.a.s.c.CorePropertiesLocator Found 1 core definitions
: [junit4] 2> 192099 INFO (coreLoadExecutor-524-thread-1) [ ] o.a.s.c.SolrResourceLoader new SolrResourceLoader for directory: '/Users/jenkins/workspace/Lucene-Solr-master-MacOSX/solr/build/solr-solrj/test/J0/temp/solr.client.solrj.request.SchemaTest_B07EE1D8472F7C65-001/tempDir-007/collection1'
: [junit4] 2> 192100 INFO (coreLoadExecutor-524-thread-1) [ ] o.a.s.c.SolrResourceLoader JNDI not configured for solr (NoInitialContextEx)
: [junit4] 2> 192100 INFO (coreLoadExecutor-524-thread-1) [ ] o.a.s.c.SolrResourceLoader using system property solr.solr.home: /Users/jenkins/workspace/Lucene-Solr-master-MacOSX/solr/build/solr-solrj/test/J0/temp/solr.client.solrj.request.SchemaTest_B07EE1D8472F7C65-001/tempDir-007
: [junit4] 2> 192099 INFO (TEST-SchemaTest.addFieldTypeShouldntBeCalledTwiceWithTheSameName-seed#[B07EE1D8472F7C65]) [ ] o.a.s.s.SolrDispatchFilter user.dir=/Users/jenkins/workspace/Lucene-Solr-master-MacOSX/solr/build/solr-solrj/test/J0
: [junit4] 2> 192100 INFO (TEST-SchemaTest.addFieldTypeShouldntBeCalledTwiceWithTheSameName-seed#[B07EE1D8472F7C65]) [ ] o.a.s.s.SolrDispatchFilter SolrDispatchFilter.init() done
: [junit4] 2> 192110 INFO (coreLoadExecutor-524-thread-1) [ ] o.a.s.c.SolrConfig current version of requestparams : -1
: [junit4] 2> 192111 INFO (coreLoadExecutor-524-thread-1) [ ] o.a.s.c.SolrConfig Using Lucene MatchVersion: 7.0.0
: [junit4] 2> 192114 INFO (coreLoadExecutor-524-thread-1) [ ] o.a.s.c.SolrConfig Loaded SolrConfig: solrconfig-managed-schema.xml
: [junit4] 2> 192117 INFO (coreLoadExecutor-524-thread-1) [ ] o.a.s.s.ManagedIndexSchemaFactory The schema is configured as managed, but managed schema resource managed-schema not found - loading non-managed schema schema.xml instead
: [junit4] 2> 192121 INFO (coreLoadExecutor-524-thread-1) [ ] o.a.s.s.IndexSchema [collection1] Schema name=test
: [junit4] 2> 192165 INFO (coreLoadExecutor-524-thread-1) [ ] o.a.s.s.IndexSchema default search field in schema is text
: [junit4] 2> 192166 INFO (coreLoadExecutor-524-thread-1) [ ] o.a.s.s.IndexSchema unique key field: id
: [junit4] 2> 192166 WARN (coreLoadExecutor-524-thread-1) [ ] o.a.s.s.IndexSchema Field lowerfilt1and2 is not multivalued and destination for multiple copyFields (2)
: [junit4] 2> 192166 WARN (coreLoadExecutor-524-thread-1) [ ] o.a.s.s.IndexSchema Field text is not multivalued and destination for multiple copyFields (3)
: [junit4] 2> 192168 INFO (coreLoadExecutor-524-thread-1) [ ] o.a.s.s.ManagedIndexSchema Upgraded to managed schema at /Users/jenkins/workspace/Lucene-Solr-master-MacOSX/solr/build/solr-solrj/test/J0/temp/solr.client.solrj.request.SchemaTest_B07EE1D8472F7C65-001/tempDir-007/collection1/conf/managed-schema
: [junit4] 2> 192190 INFO (coreLoadExecutor-524-thread-1) [ ] o.a.s.s.ManagedIndexSchemaFactory After upgrading to managed schema, renamed the non-managed schema /Users/jenkins/workspace/Lucene-Solr-master-MacOSX/solr/build/solr-solrj/test/J0/temp/solr.client.solrj.request.SchemaTest_B07EE1D8472F7C65-001/tempDir-007/collection1/conf/schema.xml to /Users/jenkins/workspace/Lucene-Solr-master-MacOSX/solr/build/solr-solrj/test/J0/temp/solr.client.solrj.request.SchemaTest_B07EE1D8472F7C65-001/tempDir-007/collection1/conf/schema.xml.bak
: [junit4] 2> 192194 INFO (coreLoadExecutor-524-thread-1) [ ] o.a.s.c.ConfigSetProperties Did not find ConfigSet properties, assuming default properties: Can't find resource 'configsetprops.json' in classpath or '/Users/jenkins/workspace/Lucene-Solr-master-MacOSX/solr/build/solr-solrj/test/J0/temp/solr.client.solrj.request.SchemaTest_B07EE1D8472F7C65-001/tempDir-007/collection1'
: [junit4] 2> 192194 INFO (coreLoadExecutor-524-thread-1) [ ] o.a.s.c.CoreContainer Creating SolrCore 'collection1' using configuration from configset /Users/jenkins/workspace/Lucene-Solr-master-MacOSX/solr/build/solr-solrj/test/J0/temp/solr.client.solrj.request.SchemaTest_B07EE1D8472F7C65-001/tempDir-007/collection1
: [junit4] 2> 192194 INFO (coreLoadExecutor-524-thread-1) [ x:collection1] o.a.s.c.SolrCore solr.NRTCachingDirectoryFactory
: [junit4] 2> 192194 INFO (coreLoadExecutor-524-thread-1) [ x:collection1] o.a.s.c.SolrCore [[collection1] ] Opening new SolrCore at [/Users/jenkins/workspace/Lucene-Solr-master-MacOSX/solr/build/solr-solrj/test/J0/temp/solr.client.solrj.request.SchemaTest_B07EE1D8472F7C65-001/tempDir-007/collection1], dataDir=[/Users/jenkins/workspace/Lucene-Solr-master-MacOSX/solr/build/solr-solrj/test/J0/temp/solr.client.solrj.request.SchemaTest_B07EE1D8472F7C65-001/tempDir-009/cores/core/data/]
: [junit4] 2> 192194 INFO (coreLoadExecutor-524-thread-1) [ x:collection1] o.a.s.c.SolrCore JMX monitoring not detected for core: collection1
: [junit4] 2> 192195 INFO (coreLoadExecutor-524-thread-1) [ x:collection1] o.a.s.c.CachingDirectoryFactory return new directory for /Users/jenkins/workspace/Lucene-Solr-master-MacOSX/solr/build/solr-solrj/test/J0/temp/solr.client.solrj.request.SchemaTest_B07EE1D8472F7C65-001/tempDir-009/cores/core/data
: [junit4] 2> 192195 INFO (coreLoadExecutor-524-thread-1) [ x:collection1] o.a.s.c.SolrCore New index directory detected: old=null new=/Users/jenkins/workspace/Lucene-Solr-master-MacOSX/solr/build/solr-solrj/test/J0/temp/solr.client.solrj.request.SchemaTest_B07EE1D8472F7C65-001/tempDir-009/cores/core/data/index/
: [junit4] 2> 192195 WARN (coreLoadExecutor-524-thread-1) [ x:collection1] o.a.s.c.SolrCore [collection1] Solr index directory '/Users/jenkins/workspace/Lucene-Solr-master-MacOSX/solr/build/solr-solrj/test/J0/temp/solr.client.solrj.request.SchemaTest_B07EE1D8472F7C65-001/tempDir-009/cores/core/data/index' doesn't exist. Creating new index...
: [junit4] 2> 192196 INFO (coreLoadExecutor-524-thread-1) [ x:collection1] o.a.s.c.CachingDirectoryFactory return new directory for /Users/jenkins/workspace/Lucene-Solr-master-MacOSX/solr/build/solr-solrj/test/J0/temp/solr.client.solrj.request.SchemaTest_B07EE1D8472F7C65-001/tempDir-009/cores/core/data/index
: [junit4] 2> 192222 INFO (coreLoadExecutor-524-thread-1) [ x:collection1] o.a.s.c.SolrDeletionPolicy SolrDeletionPolicy.onCommit: commits: num=1
: [junit4] 2> commit{dir=NRTCachingDirectory(MMapDirectory@/Users/jenkins/workspace/Lucene-Solr-master-MacOSX/solr/build/solr-solrj/test/J0/temp/solr.client.solrj.request.SchemaTest_B07EE1D8472F7C65-001/tempDir-009/cores/core/data/index lockFactory=org.apache.lucene.store.NativeFSLockFactory@40543ed1; maxCacheMB=48.0 maxMergeSizeMB=4.0),segFN=segments_1,generation=1}
: [junit4] 2> 192222 INFO (coreLoadExecutor-524-thread-1) [ x:collection1] o.a.s.c.SolrDeletionPolicy newest commit generation = 1
: [junit4] 2> 192223 INFO (OldIndexDirectoryCleanupThreadForCore-collection1) [ x:collection1] o.a.s.c.SolrCore Looking for old index directories to cleanup for core collection1 in /Users/jenkins/workspace/Lucene-Solr-master-MacOSX/solr/build/solr-solrj/test/J0/temp/solr.client.solrj.request.SchemaTest_B07EE1D8472F7C65-001/tempDir-009/cores/core/data/
: [junit4] 2> 192225 INFO (coreLoadExecutor-524-thread-1) [ x:collection1] o.a.s.c.SolrCore no updateRequestProcessorChain defined as default, creating implicit default
: [junit4] 2> 192228 INFO (coreLoadExecutor-524-thread-1) [ x:collection1] o.a.s.h.l.XMLLoader xsltCacheLifetimeSeconds=60
: [junit4] 2> 192229 INFO (coreLoadExecutor-524-thread-1) [ x:collection1] o.a.s.h.l.XMLLoader xsltCacheLifetimeSeconds=60
: [junit4] 2> 192230 INFO (coreLoadExecutor-524-thread-1) [ x:collection1] o.a.s.h.l.XMLLoader xsltCacheLifetimeSeconds=60
: [junit4] 2> 192230 INFO (coreLoadExecutor-524-thread-1) [ x:collection1] o.a.s.h.l.XMLLoader xsltCacheLifetimeSeconds=60
: [junit4] 2> 192232 INFO (coreLoadExecutor-524-thread-1) [ x:collection1] o.a.s.c.RequestHandlers Registered paths: /admin/mbeans,/update/csv,/sql,/update/json/docs,/admin/luke,/export,/admin/segments,/get,/admin/system,/replication,/admin/properties,/config,/stream,/schema,/admin/plugins,/admin/logging,/update/json,/admin/ping,/admin/threads,/update,/admin/file
: [junit4] 2> 192232 WARN (coreLoadExecutor-524-thread-1) [ x:collection1] o.a.s.c.RequestHandlers no default request handler is registered (either '/select' or 'standard')
: [junit4] 2> 192232 INFO (coreLoadExecutor-524-thread-1) [ x:collection1] o.a.s.c.SolrCore Using default statsCache cache: org.apache.solr.search.stats.LocalStatsCache
: [junit4] 2> 192232 INFO (coreLoadExecutor-524-thread-1) [ x:collection1] o.a.s.u.CommitTracker Hard AutoCommit: disabled
: [junit4] 2> 192232 INFO (coreLoadExecutor-524-thread-1) [ x:collection1] o.a.s.u.CommitTracker Soft AutoCommit: disabled
: [junit4] 2> 192234 INFO (coreLoadExecutor-524-thread-1) [ x:collection1] o.a.s.c.SolrDeletionPolicy SolrDeletionPolicy.onInit: commits: num=1
: [junit4] 2> commit{dir=NRTCachingDirectory(MMapDirectory@/Users/jenkins/workspace/Lucene-Solr-master-MacOSX/solr/build/solr-solrj/test/J0/temp/solr.client.solrj.request.SchemaTest_B07EE1D8472F7C65-001/tempDir-009/cores/core/data/index lockFactory=org.apache.lucene.store.NativeFSLockFactory@40543ed1; maxCacheMB=48.0 maxMergeSizeMB=4.0),segFN=segments_1,generation=1}
: [junit4] 2> 192234 INFO (coreLoadExecutor-524-thread-1) [ x:collection1] o.a.s.c.SolrDeletionPolicy newest commit generation = 1
: [junit4] 2> 192234 INFO (coreLoadExecutor-524-thread-1) [ x:collection1] o.a.s.s.SolrIndexSearcher Opening [Searcher@92cf630[collection1] main]
: [junit4] 2> 192234 INFO (coreLoadExecutor-524-thread-1) [ x:collection1] o.a.s.r.ManagedResourceStorage File-based storage initialized to use dir: /Users/jenkins/workspace/Lucene-Solr-master-MacOSX/solr/build/solr-solrj/test/J0/temp/solr.client.solrj.request.SchemaTest_B07EE1D8472F7C65-001/tempDir-007/collection1/conf
: [junit4] 2> 192234 INFO (coreLoadExecutor-524-thread-1) [ x:collection1] o.a.s.r.RestManager Initializing RestManager with initArgs: {storageDir=/Users/jenkins/workspace/Lucene-Solr-master-MacOSX/solr/build/solr-solrj/test/J0/temp/solr.client.solrj.request.SchemaTest_B07EE1D8472F7C65-001/tempDir-007/collection1/conf}
: [junit4] 2> 192234 INFO (coreLoadExecutor-524-thread-1) [ x:collection1] o.a.s.r.ManagedResourceStorage Reading _rest_managed.json using file:dir=/Users/jenkins/workspace/Lucene-Solr-master-MacOSX/solr/build/solr-solrj/test/J0/temp/solr.client.solrj.request.SchemaTest_B07EE1D8472F7C65-001/tempDir-007/collection1/conf
: [junit4] 2> 192235 INFO (coreLoadExecutor-524-thread-1) [ x:collection1] o.a.s.r.RestManager Initializing 0 registered ManagedResources
: [junit4] 2> 192235 INFO (coreLoadExecutor-524-thread-1) [ x:collection1] o.a.s.h.ReplicationHandler Commits will be reserved for 10000
: [junit4] 2> 192235 INFO (searcherExecutor-525-thread-1-processing-x:collection1) [ x:collection1] o.a.s.c.SolrCore [collection1] Registered new searcher Searcher@92cf630[collection1] main{ExitableDirectoryReader(UninvertingDirectoryReader())}
: [junit4] 2> 192235 INFO (coreLoadExecutor-524-thread-1) [ x:collection1] o.a.s.c.CoreContainer registering core: collection1
: [junit4] 2> 192608 INFO (TEST-SchemaTest.addFieldTypeShouldntBeCalledTwiceWithTheSameName-seed#[B07EE1D8472F7C65]) [ ] o.a.s.SolrJettyTestBase Jetty Assigned Port#55928
: [junit4] 2> 192632 INFO (qtp882078981-1216) [ x:collection1] o.a.s.s.ManagedIndexSchema Upgraded to managed schema at /Users/jenkins/workspace/Lucene-Solr-master-MacOSX/solr/build/solr-solrj/test/J0/temp/solr.client.solrj.request.SchemaTest_B07EE1D8472F7C65-001/tempDir-007/collection1/conf/managed-schema
: [junit4] 2> 192651 INFO (qtp882078981-1216) [ x:collection1] o.a.s.c.S.Request [collection1] webapp=/solr path=/schema params={wt=javabin&version=2} status=0 QTime=31
: [junit4] 2> 192652 ERROR (qtp882078981-1217) [ x:collection1] o.a.s.s.ManagedIndexSchema Field type 'failureInt' already exists.
: [junit4] 2> 192653 INFO (qtp882078981-1217) [ x:collection1] o.a.s.c.S.Request [collection1] webapp=/solr path=/schema params={wt=javabin&version=2} status=0 QTime=0
: [junit4] 2> 192656 INFO (TEST-SchemaTest.addFieldTypeShouldntBeCalledTwiceWithTheSameName-seed#[B07EE1D8472F7C65]) [ ] o.e.j.s.ServerConnector Stopped ServerConnector@b5d160b{HTTP/1.1,[http/1.1]}{127.0.0.1:0}
: [junit4] 2> 192656 INFO (TEST-SchemaTest.addFieldTypeShouldntBeCalledTwiceWithTheSameName-seed#[B07EE1D8472F7C65]) [ ] o.a.s.c.CoreContainer Shutting down CoreContainer instance=739391931
: [junit4] 2> 192657 INFO (coreCloseExecutor-529-thread-1) [ x:collection1] o.a.s.c.SolrCore [collection1] CLOSING SolrCore org.apache.solr.core.SolrCore@793b4947
: [junit4] 2> 192657 INFO (coreCloseExecutor-529-thread-1) [ x:collection1] o.a.s.u.DirectUpdateHandler2 closing DirectUpdateHandler2{commits=0,autocommits=0,soft autocommits=0,optimizes=0,rollbacks=0,expungeDeletes=0,docsPending=0,adds=0,deletesById=0,deletesByQuery=0,errors=0,cumulative_adds=0,cumulative_deletesById=0,cumulative_deletesByQuery=0,cumulative_errors=0}
: [junit4] 2> 192658 INFO (coreCloseExecutor-529-thread-1) [ x:collection1] o.a.s.u.SolrCoreState Closing SolrCoreState
: [junit4] 2> 192658 INFO (coreCloseExecutor-529-thread-1) [ x:collection1] o.a.s.u.DefaultSolrCoreState SolrCoreState ref count has reached 0 - closing IndexWriter
: [junit4] 2> 192658 INFO (coreCloseExecutor-529-thread-1) [ x:collection1] o.a.s.u.DefaultSolrCoreState closing IndexWriter with IndexWriterCloser
: [junit4] 2> 192660 INFO (coreCloseExecutor-529-thread-1) [ x:collection1] o.a.s.c.SolrCore [collection1] Closing main searcher on request.
: [junit4] 2> 192660 INFO (coreCloseExecutor-529-thread-1) [ x:collection1] o.a.s.c.CachingDirectoryFactory Closing NRTCachingDirectoryFactory - 2 directories currently being tracked
: [junit4] 2> 192660 INFO (coreCloseExecutor-529-thread-1) [ x:collection1] o.a.s.c.CachingDirectoryFactory looking to close /Users/jenkins/workspace/Lucene-Solr-master-MacOSX/solr/build/solr-solrj/test/J0/temp/solr.client.solrj.request.SchemaTest_B07EE1D8472F7C65-001/tempDir-009/cores/core/data/index [CachedDir<<refCount=0;path=/Users/jenkins/workspace/Lucene-Solr-master-MacOSX/solr/build/solr-solrj/test/J0/temp/solr.client.solrj.request.SchemaTest_B07EE1D8472F7C65-001/tempDir-009/cores/core/data/index;done=false>>]
: [junit4] 2> 192660 INFO (coreCloseExecutor-529-thread-1) [ x:collection1] o.a.s.c.CachingDirectoryFactory Closing directory, CoreContainer#isShutdown=true
: [junit4] 2> 192660 INFO (coreCloseExecutor-529-thread-1) [ x:collection1] o.a.s.c.CachingDirectoryFactory Closing directory: /Users/jenkins/workspace/Lucene-Solr-master-MacOSX/solr/build/solr-solrj/test/J0/temp/solr.client.solrj.request.SchemaTest_B07EE1D8472F7C65-001/tempDir-009/cores/core/data/index
: [junit4] 2> 192660 INFO (coreCloseExecutor-529-thread-1) [ x:collection1] o.a.s.c.CachingDirectoryFactory looking to close /Users/jenkins/workspace/Lucene-Solr-master-MacOSX/solr/build/solr-solrj/test/J0/temp/solr.client.solrj.request.SchemaTest_B07EE1D8472F7C65-001/tempDir-009/cores/core/data [CachedDir<<refCount=0;path=/Users/jenkins/workspace/Lucene-Solr-master-MacOSX/solr/build/solr-solrj/test/J0/temp/solr.client.solrj.request.SchemaTest_B07EE1D8472F7C65-001/tempDir-009/cores/core/data;done=false>>]
: [junit4] 2> 192660 INFO (coreCloseExecutor-529-thread-1) [ x:collection1] o.a.s.c.CachingDirectoryFactory Closing directory, CoreContainer#isShutdown=true
: [junit4] 2> 192660 INFO (coreCloseExecutor-529-thread-1) [ x:collection1] o.a.s.c.CachingDirectoryFactory Closing directory: /Users/jenkins/workspace/Lucene-Solr-master-MacOSX/solr/build/solr-solrj/test/J0/temp/solr.client.solrj.request.SchemaTest_B07EE1D8472F7C65-001/tempDir-009/cores/core/data
: [junit4] 2> 192661 INFO (TEST-SchemaTest.addFieldTypeShouldntBeCalledTwiceWithTheSameName-seed#[B07EE1D8472F7C65]) [ ] o.e.j.s.h.ContextHandler Stopped o.e.j.s.ServletContextHandler@289a0470{/solr,null,UNAVAILABLE}
: [junit4] 2> 192663 INFO (TEST-SchemaTest.addFieldTypeShouldntBeCalledTwiceWithTheSameName-seed#[B07EE1D8472F7C65]) [ ] o.a.s.SolrTestCaseJ4 ###Ending addFieldTypeShouldntBeCalledTwiceWithTheSameName
: [junit4] 2> 192664 INFO (TEST-SchemaTest.deletingAFieldTypeThatDoesntExistInTheSchemaShouldFail-seed#[B07EE1D8472F7C65]) [ ] o.a.s.SolrTestCaseJ4 ###Starting deletingAFieldTypeThatDoesntExistInTheSchemaShouldFail
: [junit4] 2> 192709 INFO (TEST-SchemaTest.deletingAFieldTypeThatDoesntExistInTheSchemaShouldFail-seed#[B07EE1D8472F7C65]) [ ] o.a.s.SolrTestCaseJ4 ####initCore
: [junit4] 2> 192710 INFO (TEST-SchemaTest.deletingAFieldTypeThatDoesntExistInTheSchemaShouldFail-seed#[B07EE1D8472F7C65]) [ ] o.a.s.SolrTestCaseJ4 ####initCore end
: [junit4] 2> 192711 INFO (TEST-SchemaTest.deletingAFieldTypeThatDoesntExistInTheSchemaShouldFail-seed#[B07EE1D8472F7C65]) [ ] o.a.s.SolrTestCaseJ4 Writing core.properties file to /Users/jenkins/workspace/Lucene-Solr-master-MacOSX/solr/build/solr-solrj/test/J0/temp/solr.client.solrj.request.SchemaTest_B07EE1D8472F7C65-001/tempDir-012/cores/core
: [junit4] 2> 192713 INFO (TEST-SchemaTest.deletingAFieldTypeThatDoesntExistInTheSchemaShouldFail-seed#[B07EE1D8472F7C65]) [ ] o.e.j.s.Server jetty-9.3.8.v20160314
: [junit4] 2> 192715 INFO (TEST-SchemaTest.deletingAFieldTypeThatDoesntExistInTheSchemaShouldFail-seed#[B07EE1D8472F7C65]) [ ] o.e.j.s.h.ContextHandler Started o.e.j.s.ServletContextHandler@31b8d1e8{/solr,null,AVAILABLE}
: [junit4] 2> 192715 INFO (TEST-SchemaTest.deletingAFieldTypeThatDoesntExistInTheSchemaShouldFail-seed#[B07EE1D8472F7C65]) [ ] o.e.j.s.ServerConnector Started ServerConnector@5de05de7{HTTP/1.1,[http/1.1]}{127.0.0.1:55930}
: [junit4] 2> 192715 INFO (TEST-SchemaTest.deletingAFieldTypeThatDoesntExistInTheSchemaShouldFail-seed#[B07EE1D8472F7C65]) [ ] o.e.j.s.Server Started @202582ms
: [junit4] 2> 192715 INFO (TEST-SchemaTest.deletingAFieldTypeThatDoesntExistInTheSchemaShouldFail-seed#[B07EE1D8472F7C65]) [ ] o.a.s.c.s.e.JettySolrRunner Jetty properties: {hostContext=/solr, hostPort=55930, configSetBaseDir=/Users/jenkins/workspace/Lucene-Solr-master-MacOSX/solr/build/solr-solrj/test/J0/temp/solr.client.solrj.request.SchemaTest_B07EE1D8472F7C65-001/tempDir-010, coreRootDirectory=/Users/jenkins/workspace/Lucene-Solr-master-MacOSX/solr/build/solr-solrj/test/J0/temp/solr.client.solrj.request.SchemaTest_B07EE1D8472F7C65-001/tempDir-012/cores}
: [junit4] 2> 192716 INFO (TEST-SchemaTest.deletingAFieldTypeThatDoesntExistInTheSchemaShouldFail-seed#[B07EE1D8472F7C65]) [ ] o.a.s.s.SolrDispatchFilter SolrDispatchFilter.init(): sun.misc.Launcher$AppClassLoader@4554617c
: [junit4] 2> 192716 INFO (TEST-SchemaTest.deletingAFieldTypeThatDoesntExistInTheSchemaShouldFail-seed#[B07EE1D8472F7C65]) [ ] o.a.s.c.SolrResourceLoader new SolrResourceLoader for directory: '/Users/jenkins/workspace/Lucene-Solr-master-MacOSX/solr/build/solr-solrj/test/J0/temp/solr.client.solrj.request.SchemaTest_B07EE1D8472F7C65-001/tempDir-010'
: [junit4] 2> 192716 INFO (TEST-SchemaTest.deletingAFieldTypeThatDoesntExistInTheSchemaShouldFail-seed#[B07EE1D8472F7C65]) [ ] o.a.s.c.SolrResourceLoader JNDI not configured for solr (NoInitialContextEx)
: [junit4] 2> 192716 INFO (TEST-SchemaTest.deletingAFieldTypeThatDoesntExistInTheSchemaShouldFail-seed#[B07EE1D8472F7C65]) [ ] o.a.s.c.SolrResourceLoader using system property solr.solr.home: /Users/jenkins/workspace/Lucene-Solr-master-MacOSX/solr/build/solr-solrj/test/J0/temp/solr.client.solrj.request.SchemaTest_B07EE1D8472F7C65-001/tempDir-010
: [junit4] 2> 192717 INFO (TEST-SchemaTest.deletingAFieldTypeThatDoesntExistInTheSchemaShouldFail-seed#[B07EE1D8472F7C65]) [ ] o.a.s.c.SolrXmlConfig Loading container configuration from /Users/jenkins/workspace/Lucene-Solr-master-MacOSX/solr/build/solr-solrj/test/J0/temp/solr.client.solrj.request.SchemaTest_B07EE1D8472F7C65-001/tempDir-010/solr.xml
: [junit4] 2> 192736 INFO (TEST-SchemaTest.deletingAFieldTypeThatDoesntExistInTheSchemaShouldFail-seed#[B07EE1D8472F7C65]) [ ] o.a.s.c.CorePropertiesLocator Config-defined core root directory: /Users/jenkins/workspace/Lucene-Solr-master-MacOSX/solr/build/solr-solrj/test/J0/temp/solr.client.solrj.request.SchemaTest_B07EE1D8472F7C65-001/tempDir-012/cores
: [junit4] 2> 192736 INFO (TEST-SchemaTest.deletingAFieldTypeThatDoesntExistInTheSchemaShouldFail-seed#[B07EE1D8472F7C65]) [ ] o.a.s.c.CoreContainer New CoreContainer 757552851
: [junit4] 2> 192736 INFO (TEST-SchemaTest.deletingAFieldTypeThatDoesntExistInTheSchemaShouldFail-seed#[B07EE1D8472F7C65]) [ ] o.a.s.c.CoreContainer Loading cores into CoreContainer [instanceDir=/Users/jenkins/workspace/Lucene-Solr-master-MacOSX/solr/build/solr-solrj/test/J0/temp/solr.client.solrj.request.SchemaTest_B07EE1D8472F7C65-001/tempDir-010]
: [junit4] 2> 192737 WARN (TEST-SchemaTest.deletingAFieldTypeThatDoesntExistInTheSchemaShouldFail-seed#[B07EE1D8472F7C65]) [ ] o.a.s.c.CoreContainer Couldn't add files from /Users/jenkins/workspace/Lucene-Solr-master-MacOSX/solr/build/solr-solrj/test/J0/temp/solr.client.solrj.request.SchemaTest_B07EE1D8472F7C65-001/tempDir-010/lib to classpath: /Users/jenkins/workspace/Lucene-Solr-master-MacOSX/solr/build/solr-solrj/test/J0/temp/solr.client.solrj.request.SchemaTest_B07EE1D8472F7C65-001/tempDir-010/lib
: [junit4] 2> 192737 INFO (TEST-SchemaTest.deletingAFieldTypeThatDoesntExistInTheSchemaShouldFail-seed#[B07EE1D8472F7C65]) [ ] o.a.s.h.c.HttpShardHandlerFactory created with socketTimeout : 90000,urlScheme : ,connTimeout : 15000,maxConnectionsPerHost : 20,maxConnections : 10000,corePoolSize : 0,maximumPoolSize : 2147483647,maxThreadIdleTime : 5,sizeOfQueue : -1,fairnessPolicy : false,
: [junit4] 2> 192738 INFO (TEST-SchemaTest.deletingAFieldTypeThatDoesntExistInTheSchemaShouldFail-seed#[B07EE1D8472F7C65]) [ ] o.a.s.u.UpdateShardHandler Creating UpdateShardHandler HTTP client with params:
: [junit4] 2> 192739 INFO (TEST-SchemaTest.deletingAFieldTypeThatDoesntExistInTheSchemaShouldFail-seed#[B07EE1D8472F7C65]) [ ] o.a.s.l.LogWatcher SLF4J impl is org.slf4j.impl.Log4jLoggerFactory
: [junit4] 2> 192739 INFO (TEST-SchemaTest.deletingAFieldTypeThatDoesntExistInTheSchemaShouldFail-seed#[B07EE1D8472F7C65]) [ ] o.a.s.l.LogWatcher Registering Log Listener [Log4j (org.slf4j.impl.Log4jLoggerFactory)]
: [junit4] 2> 192739 INFO (TEST-SchemaTest.deletingAFieldTypeThatDoesntExistInTheSchemaShouldFail-seed#[B07EE1D8472F7C65]) [ ] o.a.s.c.CoreContainer Security conf doesn't exist. Skipping setup for authorization module.
: [junit4] 2> 192739 INFO (TEST-SchemaTest.deletingAFieldTypeThatDoesntExistInTheSchemaShouldFail-seed#[B07EE1D8472F7C65]) [ ] o.a.s.c.CoreContainer No authentication plugin used.
: [junit4] 2> 192740 INFO (TEST-SchemaTest.deletingAFieldTypeThatDoesntExistInTheSchemaShouldFail-seed#[B07EE1D8472F7C65]) [ ] o.a.s.c.CorePropertiesLocator Looking for core definitions underneath /Users/jenkins/workspace/Lucene-Solr-master-MacOSX/solr/build/solr-solrj/test/J0/temp/solr.client.solrj.request.SchemaTest_B07EE1D8472F7C65-001/tempDir-012/cores
: [junit4] 2> 192746 INFO (TEST-SchemaTest.deletingAFieldTypeThatDoesntExistInTheSchemaShouldFail-seed#[B07EE1D8472F7C65]) [ ] o.a.s.c.CoreDescriptor Created CoreDescriptor: {name=collection1, config=solrconfig-managed-schema.xml, loadOnStartup=true, schema=schema.xml, configSetProperties=configsetprops.json, transient=false, dataDir=data/, configSet=collection1}
: [junit4] 2> 192746 INFO (TEST-SchemaTest.deletingAFieldTypeThatDoesntExistInTheSchemaShouldFail-seed#[B07EE1D8472F7C65]) [ ] o.a.s.c.CorePropertiesLocator Found core collection1 in /Users/jenkins/workspace/Lucene-Solr-master-MacOSX/solr/build/solr-solrj/test/J0/temp/solr.client.solrj.request.SchemaTest_B07EE1D8472F7C65-001/tempDir-012/cores/core
: [junit4] 2> 192746 INFO (TEST-SchemaTest.deletingAFieldTypeThatDoesntExistInTheSchemaShouldFail-seed#[B07EE1D8472F7C65]) [ ] o.a.s.c.CorePropertiesLocator Found 1 core definitions
: [junit4] 2> 192747 INFO (coreLoadExecutor-536-thread-1) [ ] o.a.s.c.SolrResourceLoader new SolrResourceLoader for directory: '/Users/jenkins/workspace/Lucene-Solr-master-MacOSX/solr/build/solr-solrj/test/J0/temp/solr.client.solrj.request.SchemaTest_B07EE1D8472F7C65-001/tempDir-010/collection1'
: [junit4] 2> 192748 INFO (TEST-SchemaTest.deletingAFieldTypeThatDoesntExistInTheSchemaShouldFail-seed#[B07EE1D8472F7C65]) [ ] o.a.s.s.SolrDispatchFilter user.dir=/Users/jenkins/workspace/Lucene-Solr-master-MacOSX/solr/build/solr-solrj/test/J0
: [junit4] 2> 192748 INFO (TEST-SchemaTest.deletingAFieldTypeThatDoesntExistInTheSchemaShouldFail-seed#[B07EE1D8472F7C65]) [ ] o.a.s.s.SolrDispatchFilter SolrDispatchFilter.init() done
: [junit4] 2> 192748 INFO (coreLoadExecutor-536-thread-1) [ ] o.a.s.c.SolrResourceLoader JNDI not configured for solr (NoInitialContextEx)
: [junit4] 2> 192748 INFO (coreLoadExecutor-536-thread-1) [ ] o.a.s.c.SolrResourceLoader using system property solr.solr.home: /Users/jenkins/workspace/Lucene-Solr-master-MacOSX/solr/build/solr-solrj/test/J0/temp/solr.client.solrj.request.SchemaTest_B07EE1D8472F7C65-001/tempDir-010
: [junit4] 2> 192758 INFO (coreLoadExecutor-536-thread-1) [ ] o.a.s.c.SolrConfig current version of requestparams : -1
: [junit4] 2> 192760 INFO (coreLoadExecutor-536-thread-1) [ ] o.a.s.c.SolrConfig Using Lucene MatchVersion: 7.0.0
: [junit4] 2> 192764 INFO (coreLoadExecutor-536-thread-1) [ ] o.a.s.c.SolrConfig Loaded SolrConfig: solrconfig-managed-schema.xml
: [junit4] 2> 192767 INFO (coreLoadExecutor-536-thread-1) [ ] o.a.s.s.ManagedIndexSchemaFactory The schema is configured as managed, but managed schema resource managed-schema not found - loading non-managed schema schema.xml instead
: [junit4] 2> 192772 INFO (coreLoadExecutor-536-thread-1) [ ] o.a.s.s.IndexSchema [collection1] Schema name=test
: [junit4] 2> 192840 INFO (coreLoadExecutor-536-thread-1) [ ] o.a.s.s.IndexSchema default search field in schema is text
: [junit4] 2> 192841 INFO (coreLoadExecutor-536-thread-1) [ ] o.a.s.s.IndexSchema unique key field: id
: [junit4] 2> 192842 WARN (coreLoadExecutor-536-thread-1) [ ] o.a.s.s.IndexSchema Field lowerfilt1and2 is not multivalued and destination for multiple copyFields (2)
: [junit4] 2> 192842 WARN (coreLoadExecutor-536-thread-1) [ ] o.a.s.s.IndexSchema Field text is not multivalued and destination for multiple copyFields (3)
: [junit4] 2> 192843 INFO (coreLoadExecutor-536-thread-1) [ ] o.a.s.s.ManagedIndexSchema Upgraded to managed schema at /Users/jenkins/workspace/Lucene-Solr-master-MacOSX/solr/build/solr-solrj/test/J0/temp/solr.client.solrj.request.SchemaTest_B07EE1D8472F7C65-001/tempDir-010/collection1/conf/managed-schema
: [junit4] 2> 192858 INFO (coreLoadExecutor-536-thread-1) [ ] o.a.s.s.ManagedIndexSchemaFactory After upgrading to managed schema, renamed the non-managed schema /Users/jenkins/workspace/Lucene-Solr-master-MacOSX/solr/build/solr-solrj/test/J0/temp/solr.client.solrj.request.SchemaTest_B07EE1D8472F7C65-001/tempDir-010/collection1/conf/schema.xml to /Users/jenkins/workspace/Lucene-Solr-master-MacOSX/solr/build/solr-solrj/test/J0/temp/solr.client.solrj.request.SchemaTest_B07EE1D8472F7C65-001/tempDir-010/collection1/conf/schema.xml.bak
: [junit4] 2> 192862 INFO (coreLoadExecutor-536-thread-1) [ ] o.a.s.c.ConfigSetProperties Did not find ConfigSet properties, assuming default properties: Can't find resource 'configsetprops.json' in classpath or '/Users/jenkins/workspace/Lucene-Solr-master-MacOSX/solr/build/solr-solrj/test/J0/temp/solr.client.solrj.request.SchemaTest_B07EE1D8472F7C65-001/tempDir-010/collection1'
: [junit4] 2> 192862 INFO (coreLoadExecutor-536-thread-1) [ ] o.a.s.c.CoreContainer Creating SolrCore 'collection1' using configuration from configset /Users/jenkins/workspace/Lucene-Solr-master-MacOSX/solr/build/solr-solrj/test/J0/temp/solr.client.solrj.request.SchemaTest_B07EE1D8472F7C65-001/tempDir-010/collection1
: [junit4] 2> 192862 INFO (coreLoadExecutor-536-thread-1) [ x:collection1] o.a.s.c.SolrCore solr.NRTCachingDirectoryFactory
: [junit4] 2> 192862 INFO (coreLoadExecutor-536-thread-1) [ x:collection1] o.a.s.c.SolrCore [[collection1] ] Opening new SolrCore at [/Users/jenkins/workspace/Lucene-Solr-master-MacOSX/solr/build/solr-solrj/test/J0/temp/solr.client.solrj.request.SchemaTest_B07EE1D8472F7C65-001/tempDir-010/collection1], dataDir=[/Users/jenkins/workspace/Lucene-Solr-master-MacOSX/solr/build/solr-solrj/test/J0/temp/solr.client.solrj.request.SchemaTest_B07EE1D8472F7C65-001/tempDir-012/cores/core/data/]
: [junit4] 2> 192862 INFO (coreLoadExecutor-536-thread-1) [ x:collection1] o.a.s.c.SolrCore JMX monitoring not detected for core: collection1
: [junit4] 2> 192863 INFO (coreLoadExecutor-536-thread-1) [ x:collection1] o.a.s.c.CachingDirectoryFactory return new directory for /Users/jenkins/workspace/Lucene-Solr-master-MacOSX/solr/build/solr-solrj/test/J0/temp/solr.client.solrj.request.SchemaTest_B07EE1D8472F7C65-001/tempDir-012/cores/core/data
: [junit4] 2> 192863 INFO (coreLoadExecutor-536-thread-1) [ x:collection1] o.a.s.c.SolrCore New index directory detected: old=null new=/Users/jenkins/workspace/Lucene-Solr-master-MacOSX/solr/build/solr-solrj/test/J0/temp/solr.client.solrj.request.SchemaTest_B07EE1D8472F7C65-001/tempDir-0
:
: [...truncated too long message...]
:
: rd')
: [junit4] 2> 214345 INFO (coreLoadExecutor-920-thread-1) [ x:collection1] o.a.s.c.SolrCore Using default statsCache cache: org.apache.solr.search.stats.LocalStatsCache
: [junit4] 2> 214345 INFO (coreLoadExecutor-920-thread-1) [ x:collection1] o.a.s.u.CommitTracker Hard AutoCommit: disabled
: [junit4] 2> 214345 INFO (coreLoadExecutor-920-thread-1) [ x:collection1] o.a.s.u.CommitTracker Soft AutoCommit: disabled
: [junit4] 2> 214348 INFO (coreLoadExecutor-920-thread-1) [ x:collection1] o.a.s.c.SolrDeletionPolicy SolrDeletionPolicy.onInit: commits: num=1
: [junit4] 2> commit{dir=NRTCachingDirectory(MMapDirectory@/Users/jenkins/workspace/Lucene-Solr-master-MacOSX/solr/build/solr-solrj/test/J0/temp/solr.client.solrj.request.SchemaTest_B07EE1D8472F7C65-001/tempDir-108/cores/core/data/index lockFactory=org.apache.lucene.store.NativeFSLockFactory@40543ed1; maxCacheMB=48.0 maxMergeSizeMB=4.0),segFN=segments_1,generation=1}
: [junit4] 2> 214348 INFO (coreLoadExecutor-920-thread-1) [ x:collection1] o.a.s.c.SolrDeletionPolicy newest commit generation = 1
: [junit4] 2> 214348 INFO (coreLoadExecutor-920-thread-1) [ x:collection1] o.a.s.s.SolrIndexSearcher Opening [Searcher@5eb422dc[collection1] main]
: [junit4] 2> 214348 INFO (coreLoadExecutor-920-thread-1) [ x:collection1] o.a.s.r.ManagedResourceStorage File-based storage initialized to use dir: /Users/jenkins/workspace/Lucene-Solr-master-MacOSX/solr/build/solr-solrj/test/J0/temp/solr.client.solrj.request.SchemaTest_B07EE1D8472F7C65-001/tempDir-106/collection1/conf
: [junit4] 2> 214349 INFO (coreLoadExecutor-920-thread-1) [ x:collection1] o.a.s.r.RestManager Initializing RestManager with initArgs: {storageDir=/Users/jenkins/workspace/Lucene-Solr-master-MacOSX/solr/build/solr-solrj/test/J0/temp/solr.client.solrj.request.SchemaTest_B07EE1D8472F7C65-001/tempDir-106/collection1/conf}
: [junit4] 2> 214349 INFO (coreLoadExecutor-920-thread-1) [ x:collection1] o.a.s.r.ManagedResourceStorage Reading _rest_managed.json using file:dir=/Users/jenkins/workspace/Lucene-Solr-master-MacOSX/solr/build/solr-solrj/test/J0/temp/solr.client.solrj.request.SchemaTest_B07EE1D8472F7C65-001/tempDir-106/collection1/conf
: [junit4] 2> 214349 INFO (coreLoadExecutor-920-thread-1) [ x:collection1] o.a.s.r.RestManager Initializing 0 registered ManagedResources
: [junit4] 2> 214349 INFO (coreLoadExecutor-920-thread-1) [ x:collection1] o.a.s.h.ReplicationHandler Commits will be reserved for 10000
: [junit4] 2> 214349 INFO (searcherExecutor-921-thread-1-processing-x:collection1) [ x:collection1] o.a.s.c.SolrCore [collection1] Registered new searcher Searcher@5eb422dc[collection1] main{ExitableDirectoryReader(UninvertingDirectoryReader())}
: [junit4] 2> 214350 INFO (coreLoadExecutor-920-thread-1) [ x:collection1] o.a.s.c.CoreContainer registering core: collection1
: [junit4] 2> 214735 INFO (TEST-SchemaTest.copyFieldsShouldFailWhenOneOfTheFieldsDoesntExistInTheSchema-seed#[B07EE1D8472F7C65]) [ ] o.a.s.SolrJettyTestBase Jetty Assigned Port#56048
: [junit4] 2> 214746 INFO (qtp1699008653-1942) [ x:collection1] o.a.s.c.S.Request [collection1] webapp=/solr path=/schema params={wt=javabin&version=2} status=0 QTime=0
: [junit4] 2> 214748 INFO (TEST-SchemaTest.copyFieldsShouldFailWhenOneOfTheFieldsDoesntExistInTheSchema-seed#[B07EE1D8472F7C65]) [ ] o.e.j.s.ServerConnector Stopped ServerConnector@77b2d25{HTTP/1.1,[http/1.1]}{127.0.0.1:0}
: [junit4] 2> 214748 INFO (TEST-SchemaTest.copyFieldsShouldFailWhenOneOfTheFieldsDoesntExistInTheSchema-seed#[B07EE1D8472F7C65]) [ ] o.a.s.c.CoreContainer Shutting down CoreContainer instance=1704900284
: [junit4] 2> 214749 INFO (coreCloseExecutor-925-thread-1) [ x:collection1] o.a.s.c.SolrCore [collection1] CLOSING SolrCore org.apache.solr.core.SolrCore@25b36b9b
: [junit4] 2> 214750 INFO (coreCloseExecutor-925-thread-1) [ x:collection1] o.a.s.u.DirectUpdateHandler2 closing DirectUpdateHandler2{commits=0,autocommits=0,soft autocommits=0,optimizes=0,rollbacks=0,expungeDeletes=0,docsPending=0,adds=0,deletesById=0,deletesByQuery=0,errors=0,cumulative_adds=0,cumulative_deletesById=0,cumulative_deletesByQuery=0,cumulative_errors=0}
: [junit4] 2> 214750 INFO (coreCloseExecutor-925-thread-1) [ x:collection1] o.a.s.u.SolrCoreState Closing SolrCoreState
: [junit4] 2> 214750 INFO (coreCloseExecutor-925-thread-1) [ x:collection1] o.a.s.u.DefaultSolrCoreState SolrCoreState ref count has reached 0 - closing IndexWriter
: [junit4] 2> 214750 INFO (coreCloseExecutor-925-thread-1) [ x:collection1] o.a.s.u.DefaultSolrCoreState closing IndexWriter with IndexWriterCloser
: [junit4] 2> 214751 INFO (coreCloseExecutor-925-thread-1) [ x:collection1] o.a.s.c.SolrCore [collection1] Closing main searcher on request.
: [junit4] 2> 214751 INFO (coreCloseExecutor-925-thread-1) [ x:collection1] o.a.s.c.CachingDirectoryFactory Closing NRTCachingDirectoryFactory - 2 directories currently being tracked
: [junit4] 2> 214751 INFO (coreCloseExecutor-925-thread-1) [ x:collection1] o.a.s.c.CachingDirectoryFactory looking to close /Users/jenkins/workspace/Lucene-Solr-master-MacOSX/solr/build/solr-solrj/test/J0/temp/solr.client.solrj.request.SchemaTest_B07EE1D8472F7C65-001/tempDir-108/cores/core/data [CachedDir<<refCount=0;path=/Users/jenkins/workspace/Lucene-Solr-master-MacOSX/solr/build/solr-solrj/test/J0/temp/solr.client.solrj.request.SchemaTest_B07EE1D8472F7C65-001/tempDir-108/cores/core/data;done=false>>]
: [junit4] 2> 214752 INFO (coreCloseExecutor-925-thread-1) [ x:collection1] o.a.s.c.CachingDirectoryFactory Closing directory, CoreContainer#isShutdown=true
: [junit4] 2> 214752 INFO (coreCloseExecutor-925-thread-1) [ x:collection1] o.a.s.c.CachingDirectoryFactory Closing directory: /Users/jenkins/workspace/Lucene-Solr-master-MacOSX/solr/build/solr-solrj/test/J0/temp/solr.client.solrj.request.SchemaTest_B07EE1D8472F7C65-001/tempDir-108/cores/core/data
: [junit4] 2> 214752 INFO (coreCloseExecutor-925-thread-1) [ x:collection1] o.a.s.c.CachingDirectoryFactory looking to close /Users/jenkins/workspace/Lucene-Solr-master-MacOSX/solr/build/solr-solrj/test/J0/temp/solr.client.solrj.request.SchemaTest_B07EE1D8472F7C65-001/tempDir-108/cores/core/data/index [CachedDir<<refCount=0;path=/Users/jenkins/workspace/Lucene-Solr-master-MacOSX/solr/build/solr-solrj/test/J0/temp/solr.client.solrj.request.SchemaTest_B07EE1D8472F7C65-001/tempDir-108/cores/core/data/index;done=false>>]
: [junit4] 2> 214752 INFO (coreCloseExecutor-925-thread-1) [ x:collection1] o.a.s.c.CachingDirectoryFactory Closing directory, CoreContainer#isShutdown=true
: [junit4] 2> 214752 INFO (coreCloseExecutor-925-thread-1) [ x:collection1] o.a.s.c.CachingDirectoryFactory Closing directory: /Users/jenkins/workspace/Lucene-Solr-master-MacOSX/solr/build/solr-solrj/test/J0/temp/solr.client.solrj.request.SchemaTest_B07EE1D8472F7C65-001/tempDir-108/cores/core/data/index
: [junit4] 2> 214753 INFO (TEST-SchemaTest.copyFieldsShouldFailWhenOneOfTheFieldsDoesntExistInTheSchema-seed#[B07EE1D8472F7C65]) [ ] o.e.j.s.h.ContextHandler Stopped o.e.j.s.ServletContextHandler@ce4c547{/solr,null,UNAVAILABLE}
: [junit4] 2> 214755 INFO (TEST-SchemaTest.copyFieldsShouldFailWhenOneOfTheFieldsDoesntExistInTheSchema-seed#[B07EE1D8472F7C65]) [ ] o.a.s.SolrTestCaseJ4 ###Ending copyFieldsShouldFailWhenOneOfTheFieldsDoesntExistInTheSchema
: [junit4] 2> 214756 INFO (SUITE-SchemaTest-seed#[B07EE1D8472F7C65]-worker) [ ] o.a.s.SolrTestCaseJ4 ###deleteCore
: [junit4] 2> NOTE: leaving temporary files on disk at: /Users/jenkins/workspace/Lucene-Solr-master-MacOSX/solr/build/solr-solrj/test/J0/temp/solr.client.solrj.request.SchemaTest_B07EE1D8472F7C65-001
: [junit4] 2> NOTE: test params are: codec=Asserting(Lucene60): {}, docValues:{}, maxPointsInLeafNode=483, maxMBSortInHeap=4.99098970102813, sim=RandomSimilarity(queryNorm=true,coord=crazy): {}, locale=es-VE, timezone=Europe/Nicosia
: [junit4] 2> NOTE: Mac OS X 10.11.4 x86_64/Oracle Corporation 1.8.0_72 (64-bit)/cpus=3,threads=1,free=176371312,total=322826240
: [junit4] 2> NOTE: All tests run in this JVM: [ModifiableSolrParamsTest, CloudSolrClientTest, JettyWebappTest, SolrExampleXMLTest, TestClusteringResponse, ConcurrentUpdateSolrClientTest, TestJsonRecordReader, TestXMLEscaping, TestSpellCheckResponse, TestSolrProperties, TestEmbeddedSolrServer, SolrDocumentTest, TestToleratedUpdateError, TestJavaBinCodec, LBHttpSolrClientBuilderTest, TermsResponseTest, SolrExampleEmbeddedTest, TestBatchUpdate, SchemaTest]
: [junit4] Completed [40/82 (1!)] on J0 in 24.85s, 36 tests, 1 error <<< FAILURES!
:
: [...truncated 136 lines...]
: BUILD FAILED
: /Users/jenkins/workspace/Lucene-Solr-master-MacOSX/build.xml:740: The following error occurred while executing this line:
: /Users/jenkins/workspace/Lucene-Solr-master-MacOSX/build.xml:684: The following error occurred while executing this line:
: /Users/jenkins/workspace/Lucene-Solr-master-MacOSX/build.xml:59: The following error occurred while executing this line:
: /Users/jenkins/workspace/Lucene-Solr-master-MacOSX/solr/build.xml:246: The following error occurred while executing this line:
: /Users/jenkins/workspace/Lucene-Solr-master-MacOSX/solr/common-build.xml:529: The following error occurred while executing this line:
: /Users/jenkins/workspace/Lucene-Solr-master-MacOSX/lucene/common-build.xml:1457: The following error occurred while executing this line:
: /Users/jenkins/workspace/Lucene-Solr-master-MacOSX/lucene/common-build.xml:1014: There were test failures: 82 suites, 552 tests, 1 error [seed: B07EE1D8472F7C65]
:
: Total time: 83 minutes 1 second
: Build step 'Invoke Ant' marked build as failure
: Archiving artifacts
: [WARNINGS] Skipping publisher since build result is FAILURE
: Recording test results
: Email was triggered for: Failure - Any
: Sending email for trigger: Failure - Any
:
:
:

-Hoss
http://www.lucidworks.com/

---------------------------------------------------------------------
To unsubscribe, e-mail: dev-unsubscribe@lucene.apache.org
For additional commands, e-mail: dev-help@lucene.apache.org

Search Discussions

Discussion Posts

Previous

Follow ups

Related Discussions

Discussion Navigation
viewthread | post
posts ‹ prev | 3 of 4 | next ›
Discussion Overview
groupdev @
categorieslucene
postedApr 21, '16 at 7:47a
activeApr 22, '16 at 7:32a
posts4
users2
websitelucene.apache.org

People

Translate

site design / logo © 2017 Grokbase